%!PS-Adobe-2.0 EPSF-2.0
%%Title: wp2latex.eps
%%Creator: fig2dev Version 3.2 Patchlevel 1
%%CreationDate: Sun Apr 22 23:07:36 2001
%%For: root@darkstar ()
%%Orientation: Portrait
%%BoundingBox: 0 0 643 475
%%Pages: 0
%%BeginSetup
%%EndSetup
%%Magnification: 1.0000
%%EndComments
/$F2psDict 200 dict def
$F2psDict begin
$F2psDict /mtrx matrix put
/col-1 {0 setgray} bind def
/col0 {0.000 0.000 0.000 srgb} bind def
/col1 {0.000 0.000 1.000 srgb} bind def
/col2 {0.000 1.000 0.000 srgb} bind def
/col3 {0.000 1.000 1.000 srgb} bind def
/col4 {1.000 0.000 0.000 srgb} bind def
/col5 {1.000 0.000 1.000 srgb} bind def
/col6 {1.000 1.000 0.000 srgb} bind def
/col7 {1.000 1.000 1.000 srgb} bind def
/col8 {0.000 0.000 0.560 srgb} bind def
/col9 {0.000 0.000 0.690 srgb} bind def
/col10 {0.000 0.000 0.820 srgb} bind def
/col11 {0.530 0.810 1.000 srgb} bind def
/col12 {0.000 0.560 0.000 srgb} bind def
/col13 {0.000 0.690 0.000 srgb} bind def
/col14 {0.000 0.820 0.000 srgb} bind def
/col15 {0.000 0.560 0.560 srgb} bind def
/col16 {0.000 0.690 0.690 srgb} bind def
/col17 {0.000 0.820 0.820 srgb} bind def
/col18 {0.560 0.000 0.000 srgb} bind def
/col19 {0.690 0.000 0.000 srgb} bind def
/col20 {0.820 0.000 0.000 srgb} bind def
/col21 {0.560 0.000 0.560 srgb} bind def
/col22 {0.690 0.000 0.690 srgb} bind def
/col23 {0.820 0.000 0.820 srgb} bind def
/col24 {0.500 0.190 0.000 srgb} bind def
/col25 {0.630 0.250 0.000 srgb} bind def
/col26 {0.750 0.380 0.000 srgb} bind def
/col27 {1.000 0.500 0.500 srgb} bind def
/col28 {1.000 0.630 0.630 srgb} bind def
/col29 {1.000 0.750 0.750 srgb} bind def
/col30 {1.000 0.880 0.880 srgb} bind def
/col31 {1.000 0.840 0.000 srgb} bind def

end
save
-16.0 478.0 translate
1 -1 scale

/cp {closepath} bind def
/ef {eofill} bind def
/gr {grestore} bind def
/gs {gsave} bind def
/sa {save} bind def
/rs {restore} bind def
/l {lineto} bind def
/m {moveto} bind def
/rm {rmoveto} bind def
/n {newpath} bind def
/s {stroke} bind def
/sh {show} bind def
/slc {setlinecap} bind def
/slj {setlinejoin} bind def
/slw {setlinewidth} bind def
/srgb {setrgbcolor} bind def
/rot {rotate} bind def
/sc {scale} bind def
/sd {setdash} bind def
/ff {findfont} bind def
/sf {setfont} bind def
/scf {scalefont} bind def
/sw {stringwidth} bind def
/tr {translate} bind def
/tnt {dup dup currentrgbcolor
  4 -2 roll dup 1 exch sub 3 -1 roll mul add
  4 -2 roll dup 1 exch sub 3 -1 roll mul add
  4 -2 roll dup 1 exch sub 3 -1 roll mul add srgb}
  bind def
/shd {dup dup currentrgbcolor 4 -2 roll mul 4 -2 roll mul
  4 -2 roll mul srgb} bind def
/$F2psBegin {$F2psDict begin /$F2psEnteredState save def} def
/$F2psEnd {$F2psEnteredState restore end} def
%%EndProlog

$F2psBegin
10 setmiterlimit
n -1000 8962 m -1000 -1000 l 11972 -1000 l 11972 8962 l cp clip
 0.06000 0.06000 sc
% Polyline
7.500 slw
n 3975 6750 m 5550 6750 l 5550 7950 l 3975 7950 l cp gs col0 s gr 
/Times-Roman ff 300.00 scf sf
4275 7425 m
gs 1 -1 sc (WP 5.x) col0 sh gr
% Polyline
n 6675 600 m 9600 600 l 9600 2325 l 6675 2325 l cp gs col0 s gr 
% Polyline
n 900 600 m 3600 600 l 3600 2400 l 900 2400 l cp gs col0 s gr 
% Polyline
n 7680 3300 m 7575 3300 7575 4845 105 arcto 4 {pop} repeat
  7575 4950 10020 4950 105 arcto 4 {pop} repeat
  10125 4950 10125 3405 105 arcto 4 {pop} repeat
  10125 3300 7680 3300 105 arcto 4 {pop} repeat
 cp gs col0 s gr 
% Polyline
n 3371 7050 m 3379 7050 l gs col0 s gr
% Polyline
n 4455 3300 m 4350 3300 4350 4845 105 arcto 4 {pop} repeat
  4350 4950 6495 4950 105 arcto 4 {pop} repeat
  6600 4950 6600 3405 105 arcto 4 {pop} repeat
  6600 3300 4455 3300 105 arcto 4 {pop} repeat
 cp gs col0 s gr 
% Polyline
n 7800 2325 m 7800 3000 l 6000 3000 l 6000 3300 l gs col0 s gr 
% Polyline
n 2175 2400 m 2175 3000 l 4875 3000 l 4875 3300 l gs col0 s gr 
% Polyline
n 5775 6000 m 7350 6000 l 7350 7200 l 5775 7200 l cp gs col0 s gr 
% Polyline
n 7500 6000 m 9075 6000 l 9075 7200 l 7500 7200 l cp gs col0 s gr 
% Polyline
n 2325 6000 m 3900 6000 l 3900 7200 l 2325 7200 l cp gs col0 s gr 
% Polyline
n 9225 6000 m 10800 6000 l 10800 7200 l 9225 7200 l cp gs col0 s gr 
% Polyline
n 4875 6000 m 4875 5775 l 5025 5775 l 5025 5550 l gs col0 s gr 
% Polyline
n 6525 6000 m 6525 5850 l 5175 5850 l 5175 5550 l gs col0 s gr 
% Polyline
n 8250 6000 m 8250 5700 l 5400 5700 l 5400 5550 l gs col0 s gr 
% Polyline
n 10050 6000 m 10050 5550 l 5625 5550 l gs col0 s gr 
% Polyline
n 5175 4950 m 5175 5250 l gs col0 s gr 
% Polyline
n 5175 5250 m 5400 5550 l gs col0 s gr 
% Polyline
 [60] 0 sd
gs  clippath
4824 5258 m 5003 5325 l 4824 5393 l 5040 5393 l 5040 5258 l cp
clip
n 2175 4950 m 2175 5325 l 5025 5325 l gs col0 s gr gr
 [] 0 sd
% arrowhead
15.000 slw
n 4824 5258 m 5003 5325 l 4824 5393 l  col0 s
% Polyline
7.500 slw
n 1020 3300 m 900 3300 900 4830 120 arcto 4 {pop} repeat
  900 4950 3405 4950 120 arcto 4 {pop} repeat
  3525 4950 3525 3420 120 arcto 4 {pop} repeat
  3525 3300 1020 3300 120 arcto 4 {pop} repeat
 cp gs col0 s gr 
% Polyline
15.000 slw
gs  clippath
699 3983 m 878 4050 l 699 4118 l 930 4118 l 930 3983 l cp
clip
n 300 4050 m 900 4050 l gs col0 s gr gr

% arrowhead
n 699 3983 m 878 4050 l 699 4118 l  col0 s
% Polyline
gs  clippath
4149 4058 m 4328 4125 l 4149 4193 l 4380 4193 l 4380 4058 l cp
clip
n 3525 4125 m 4350 4125 l gs col0 s gr gr

% arrowhead
n 4149 4058 m 4328 4125 l 4149 4193 l  col0 s
% Polyline
gs  clippath
7374 4058 m 7553 4125 l 7374 4193 l 7605 4193 l 7605 4058 l cp
clip
n 6600 4125 m 7575 4125 l gs col0 s gr gr

% arrowhead
n 7374 4058 m 7553 4125 l 7374 4193 l  col0 s
% Polyline
7.500 slw
n 4350 600 m 6075 600 l 6075 2400 l 4350 2400 l cp gs col0 s gr 
% Polyline
n 5325 2400 m 5325 3000 l 5550 3000 l 5550 3300 l gs col0 s gr 
% Polyline
n 6825 1800 m 8025 1800 l 8025 2175 l 6825 2175 l cp gs col0 s gr 
% Polyline
n 8175 1800 m 9450 1800 l 9450 2175 l 8175 2175 l cp gs col0 s gr 
% Polyline
n 8175 1275 m 9450 1275 l 9450 1650 l 8175 1650 l cp gs col0 s gr 
% Polyline
n 6825 1275 m 8025 1275 l 8025 1650 l 6825 1650 l cp gs col0 s gr 
% Polyline
n 8625 2325 m 8625 2925 l 8925 2925 l 8925 3300 l gs col0 s gr 
% Polyline
n 8921 3300 m 8929 3300 l gs col0 s gr
% Polyline
15.000 slw
gs  clippath
10732 4133 m 10927 4200 l 10732 4268 l 10980 4268 l 10980 4133 l cp
clip
n 10125 4200 m 10950 4200 l gs col0 s gr gr

% arrowhead
n 10732 4133 m 10927 4200 l 10732 4268 l  col0 s
% Polyline
7.500 slw
n 4050 6000 m 5625 6000 l 5625 7200 l 4050 7200 l cp gs col7 1.00 shd ef gr gs col0 s gr 
% Polyline
n 450 6000 m 2025 6000 l 2025 7200 l 450 7200 l cp gs col0 s gr 
% Polyline
n 3150 6000 m 3150 5700 l 4875 5700 l 4875 5550 l gs col0 s gr 
% Polyline
n 4646 5550 m 4654 5550 l gs col0 s gr
% Polyline
n 1200 6000 m 1200 5550 l 4650 5550 l gs col0 s gr 
% Polyline
n 1050 1350 m 1800 1350 l 1800 2175 l 1050 2175 l cp gs col0 s gr 
% Polyline
n 1875 1350 m 2550 1350 l 2550 2175 l 1875 2175 l cp gs col0 s gr 
/Times-Roman ff 300.00 scf sf
7050 975 m
gs 1 -1 sc (Atoms library) col0 sh gr
/Times-Roman ff 300.00 scf sf
1050 900 m
gs 1 -1 sc (Image manipulation) col0 sh gr
/Times-Roman ff 300.00 scf sf
1725 1275 m
gs 1 -1 sc (library) col0 sh gr
/Times-Roman ff 300.00 scf sf
1125 3600 m
gs 1 -1 sc (Filetype detector) col0 sh gr
/Times-Roman ff 300.00 scf sf
4575 3675 m
gs 1 -1 sc (LaTeX builder) col0 sh gr
/Times-Roman ff 300.00 scf sf
7950 3675 m
gs 1 -1 sc (Latex Cleaner ) col0 sh gr
/Times-Roman ff 300.00 scf sf
8250 3975 m
gs 1 -1 sc (engine) col0 sh gr
/Times-Roman ff 300.00 scf sf
2625 6675 m
gs 1 -1 sc (WP 4.x) col0 sh gr
/Times-Roman ff 300.00 scf sf
6075 6675 m
gs 1 -1 sc (WP 6.x) col0 sh gr
/Times-Roman ff 300.00 scf sf
7875 6675 m
gs 1 -1 sc (RTF) col0 sh gr
/Times-Roman ff 300.00 scf sf
9600 6675 m
gs 1 -1 sc (HTML) col0 sh gr
/Times-Roman ff 300.00 scf sf
5025 4050 m
gs 1 -1 sc (engine) col0 sh gr
/Times-Roman ff 180.00 scf sf
4500 4800 m
gs 1 -1 sc (pass1.cc) col0 sh gr
/Times-Roman ff 180.00 scf sf
7725 4800 m
gs 1 -1 sc (pass2.cc) col0 sh gr
/Times-Roman ff 180.00 scf sf
2400 7125 m
gs 1 -1 sc (pass1_wp4.cc) col0 sh gr
/Times-Roman ff 180.00 scf sf
4125 7125 m
gs 1 -1 sc (pass1_wp5.cc) col0 sh gr
/Times-Roman ff 180.00 scf sf
5850 7125 m
gs 1 -1 sc (pass1_wp6.cc) col0 sh gr
/Times-Roman ff 180.00 scf sf
7575 7125 m
gs 1 -1 sc (pass1_rtf.cc) col0 sh gr
/Times-Roman ff 180.00 scf sf
9300 7125 m
gs 1 -1 sc (pass1htm.cc) col0 sh gr
/Times-Roman ff 300.00 scf sf
4500 1350 m
gs 1 -1 sc (set library) col0 sh gr
/Times-Roman ff 300.00 scf sf
4500 975 m
gs 1 -1 sc (Character) col0 sh gr
/Times-Roman ff 300.00 scf sf
6975 1575 m
gs 1 -1 sc (Strings) col0 sh gr
/Times-Roman ff 300.00 scf sf
8325 1575 m
gs 1 -1 sc (Lists) col0 sh gr
/Times-Roman ff 300.00 scf sf
8250 2100 m
gs 1 -1 sc (Dbl Lists) col0 sh gr
/Times-Roman ff 300.00 scf sf
7125 2100 m
gs 1 -1 sc (Sets) col0 sh gr
/Times-Roman ff 180.00 scf sf
1050 4875 m
gs 1 -1 sc (wp2latex.cc) col0 sh gr
/Times-Roman ff 450.00 scf sf
1350 375 m
gs 1 -1 sc (Programmers view of wp2latex internal structure) col0 sh gr
/Times-Roman ff 300.00 scf sf
1125 4350 m
gs 1 -1 sc (command line) col0 sh gr
/Times-Roman ff 300.00 scf sf
1125 4050 m
gs 1 -1 sc (configuration file) col0 sh gr
/Times-Roman ff 300.00 scf sf
1875 4575 m
gs 1 -1 sc (parser) col0 sh gr
/Times-Roman ff 300.00 scf sf
4275 6675 m
gs 1 -1 sc (WP 5.x) col0 sh gr
/Times-Roman ff 300.00 scf sf
750 6675 m
gs 1 -1 sc (WP 3.x) col0 sh gr
/Times-Roman ff 180.00 scf sf
600 7125 m
gs 1 -1 sc (pass1_wp3.cc) col0 sh gr
/Times-Roman ff 300.00 scf sf
4125 7725 m
gs 1 -1 sc (encrypted) col0 sh gr
/Times-Roman ff 180.00 scf sf
4425 2250 m
gs 1 -1 sc (cptran.cc) col0 sh gr
/Times-Roman ff 180.00 scf sf
5325 2250 m
gs 1 -1 sc (cptran.h) col0 sh gr
/Times-Roman ff 300.00 scf sf
1125 1875 m
gs 1 -1 sc (WPG) col0 sh gr
/Times-Roman ff 300.00 scf sf
1950 1875 m
gs 1 -1 sc (GIF) col0 sh gr
/Times-Roman ff 180.00 scf sf
2700 2325 m
gs 1 -1 sc (ras_img.cc) col0 sh gr
$F2psEnd
rs
