STARTFONT 2.1
COMMENT +
COMMENT  Copyright 1984-1989, 1994 Adobe Systems Incorporated.
COMMENT  Copyright 1988, 1994 Digital Equipment Corporation.
COMMENT  Copyright 1996 BIZNET Poland, Inc.
COMMENT
COMMENT  Permission to use, copy, modify, distribute and sell this software
COMMENT  and its documentation for any purpose and without fee is hereby
COMMENT  granted, provided that the above copyright notices appear in all
COMMENT  copies and that both those copyright notices and this permission
COMMENT  notice appear in supporting documentation, and that the names of
COMMENT  Adobe Systems and Digital Equipment Corporation not be used in
COMMENT  advertising or publicity pertaining to distribution of the software
COMMENT  without specific, written prior permission.  Adobe Systems and
COMMENT  Digital Equipment Corporation make no representations about the
COMMENT  suitability of this software for any purpose.  It is provided "as
COMMENT  is" without express or implied warranty.
COMMENT -
FONT -BIZNET-Courier-Bold-O-Normal--18-180-75-75-M-110-ISO8859-2
SIZE 18 75 75
FONTBOUNDINGBOX 14 17 -1 -5
STARTPROPERTIES 25
FOUNDRY "BIZNET"
FAMILY_NAME "Courier"
WEIGHT_NAME "Bold"
SLANT "O"
SETWIDTH_NAME "Normal"
ADD_STYLE_NAME ""
PIXEL_SIZE 18
POINT_SIZE 180
RESOLUTION_X 75
RESOLUTION_Y 75
SPACING "M"
AVERAGE_WIDTH 110
CHARSET_REGISTRY "ISO8859"
CHARSET_ENCODING "2"
CAP_HEIGHT 11
X_HEIGHT 9
FONT_ASCENT 14
FONT_DESCENT 4
FACE_NAME "Courier Bold Oblique"
DEFAULT_CHAR 32
RELATIVE_SETWIDTH 50
RELATIVE_WEIGHT 70
CHARSET_COLLECTIONS "ASCII ISO8859-2"
COPYRIGHT "Copyright (c) 1984, 1987 Adobe Systems Incorporated. All Rights Reserved. Copyright (c) 1988, 1991 Digital Equipment Corporation. All Rights Reserved. Copyright (c) 1996 BIZNET Poland, Inc. All Rights Reserved."
NOTICE "The name "BIZNET" is a registered trademark of BIZNET Poland, Inc."
ENDPROPERTIES
CHARS 190
STARTCHAR space
ENCODING 32
SWIDTH 600 0
DWIDTH 11 0
BBX 1 1 0 0
BITMAP
00
ENDCHAR
STARTCHAR exclam
ENCODING 33
SWIDTH 600 0
DWIDTH 11 0
BBX 5 12 4 0
BITMAP
38
38
38
70
70
60
60
C0
C0
00
C0
C0
ENDCHAR
STARTCHAR quotedbl
ENCODING 34
SWIDTH 600 0
DWIDTH 11 0
BBX 7 6 3 6
BITMAP
66
66
66
CC
CC
88
ENDCHAR
STARTCHAR numbersign
ENCODING 35
SWIDTH 600 0
DWIDTH 11 0
BBX 12 12 0 0
BITMAP
0360
06C0
06C0
3FF0
7FE0
1B00
1B00
7FC0
FF80
3600
3600
6C00
ENDCHAR
STARTCHAR dollar
ENCODING 36
SWIDTH 600 0
DWIDTH 11 0
BBX 11 15 0 -2
BITMAP
0180
0180
07E0
1FE0
3860
3000
3C00
1F00
0780
0180
C380
FF00
FE00
1800
1800
ENDCHAR
STARTCHAR percent
ENCODING 37
SWIDTH 600 0
DWIDTH 11 0
BBX 10 12 1 0
BITMAP
0E00
1A00
3200
2400
39C0
0700
3800
E700
0D00
1900
1200
1C00
ENDCHAR
STARTCHAR ampersand
ENCODING 38
SWIDTH 600 0
DWIDTH 11 0
BBX 9 10 1 0
BITMAP
0F00
1F80
3180
3000
3000
7B80
CF00
CE00
FF00
7380
ENDCHAR
STARTCHAR quoteright
ENCODING 39
SWIDTH 600 0
DWIDTH 11 0
BBX 4 5 5 7
BITMAP
30
70
60
C0
80
ENDCHAR
STARTCHAR parenleft
ENCODING 40
SWIDTH 600 0
DWIDTH 11 0
BBX 7 15 4 -3
BITMAP
06
0C
18
30
60
60
C0
C0
C0
C0
C0
C0
C0
60
60
ENDCHAR
STARTCHAR parenright
ENCODING 41
SWIDTH 600 0
DWIDTH 11 0
BBX 6 15 1 -3
BITMAP
18
18
0C
0C
0C
0C
0C
0C
18
18
18
30
30
60
C0
ENDCHAR
STARTCHAR asterisk
ENCODING 42
SWIDTH 600 0
DWIDTH 11 0
BBX 8 8 2 4
BITMAP
0C
0C
7F
7F
1C
7E
E7
42
ENDCHAR
STARTCHAR plus
ENCODING 43
SWIDTH 600 0
DWIDTH 11 0
BBX 10 10 1 0
BITMAP
0600
0600
0C00
0C00
FFC0
FFC0
1800
1800
3000
3000
ENDCHAR
STARTCHAR comma
ENCODING 44
SWIDTH 600 0
DWIDTH 11 0
BBX 4 5 2 -3
BITMAP
30
70
60
C0
80
ENDCHAR
STARTCHAR minus
ENCODING 45
SWIDTH 600 0
DWIDTH 11 0
BBX 9 2 1 4
BITMAP
FF80
FF80
ENDCHAR
STARTCHAR period
ENCODING 46
SWIDTH 600 0
DWIDTH 11 0
BBX 2 2 4 0
BITMAP
C0
C0
ENDCHAR
STARTCHAR slash
ENCODING 47
SWIDTH 600 0
DWIDTH 11 0
BBX 14 16 -1 -3
BITMAP
000C
0018
0030
0060
0060
00C0
0180
0300
0300
0600
0C00
1800
1800
3000
6000
C000
ENDCHAR
STARTCHAR zero
ENCODING 48
SWIDTH 600 0
DWIDTH 11 0
BBX 8 12 2 0
BITMAP
1E
3F
63
63
C3
C3
C3
C3
C6
C6
FC
78
ENDCHAR
STARTCHAR one
ENCODING 49
SWIDTH 600 0
DWIDTH 11 0
BBX 8 12 1 0
BITMAP
03
3F
3E
06
06
0C
0C
0C
18
18
FF
FF
ENDCHAR
STARTCHAR two
ENCODING 50
SWIDTH 600 0
DWIDTH 11 0
BBX 10 12 1 0
BITMAP
0780
1FC0
30C0
30C0
01C0
0380
0700
1C00
3800
7000
FF00
FF00
ENDCHAR
STARTCHAR three
ENCODING 51
SWIDTH 600 0
DWIDTH 11 0
BBX 10 12 1 0
BITMAP
0780
1FC0
18C0
01C0
0380
1E00
1F00
0300
0300
C700
FE00
7C00
ENDCHAR
STARTCHAR four
ENCODING 52
SWIDTH 600 0
DWIDTH 11 0
BBX 9 12 1 0
BITMAP
0180
0380
0780
0D80
1B00
3300
6300
FF80
FF80
0600
1F00
1F00
ENDCHAR
STARTCHAR five
ENCODING 53
SWIDTH 600 0
DWIDTH 11 0
BBX 10 12 1 0
BITMAP
0FC0
0FC0
1800
1800
3F00
3F80
3180
0180
0380
C700
FE00
7C00
ENDCHAR
STARTCHAR six
ENCODING 54
SWIDTH 600 0
DWIDTH 11 0
BBX 10 12 1 0
BITMAP
03C0
0FC0
1C00
3000
6000
6F00
FF80
E180
C180
E380
7F00
3E00
ENDCHAR
STARTCHAR seven
ENCODING 55
SWIDTH 600 0
DWIDTH 11 0
BBX 9 12 3 0
BITMAP
7F80
FF80
C300
0600
0600
0C00
1800
1800
3000
3000
6000
6000
ENDCHAR
STARTCHAR eight
ENCODING 56
SWIDTH 600 0
DWIDTH 11 0
BBX 10 12 1 0
BITMAP
0780
1FC0
30C0
30C0
3180
1F00
3F00
6180
C180
C300
7F00
3C00
ENDCHAR
STARTCHAR nine
ENCODING 57
SWIDTH 600 0
DWIDTH 11 0
BBX 10 12 1 0
BITMAP
0780
1FC0
38C0
30C0
60C0
6180
7F80
3D80
0300
0700
FE00
F800
ENDCHAR
STARTCHAR colon
ENCODING 58
SWIDTH 600 0
DWIDTH 11 0
BBX 3 8 4 0
BITMAP
60
60
00
00
00
00
C0
C0
ENDCHAR
STARTCHAR semicolon
ENCODING 59
SWIDTH 600 0
DWIDTH 11 0
BBX 5 11 2 -3
BITMAP
18
18
00
00
00
00
30
70
60
C0
80
ENDCHAR
STARTCHAR less
ENCODING 60
SWIDTH 600 0
DWIDTH 11 0
BBX 11 9 1 1
BITMAP
01E0
0780
1E00
7800
E000
7800
1E00
0780
01C0
ENDCHAR
STARTCHAR equal
ENCODING 61
SWIDTH 600 0
DWIDTH 11 0
BBX 11 6 0 2
BITMAP
7FE0
7FE0
0000
0000
FFC0
FFC0
ENDCHAR
STARTCHAR greater
ENCODING 62
SWIDTH 600 0
DWIDTH 11 0
BBX 11 9 0 1
BITMAP
7000
3C00
0F00
03C0
00E0
03C0
0F00
3C00
F000
ENDCHAR
STARTCHAR question
ENCODING 63
SWIDTH 600 0
DWIDTH 11 0
BBX 7 11 4 0
BITMAP
7C
FE
C6
0E
3C
70
E0
C0
00
C0
C0
ENDCHAR
STARTCHAR at
ENCODING 64
SWIDTH 600 0
DWIDTH 11 0
BBX 10 13 1 -1
BITMAP
0780
1840
3040
61C0
6780
4D80
D980
DB00
DB00
CF80
C000
6300
3C00
ENDCHAR
STARTCHAR A
ENCODING 65
SWIDTH 600 0
DWIDTH 11 0
BBX 12 11 -1 0
BITMAP
0F80
0F80
0380
0780
0CC0
0CC0
1FC0
3FC0
30C0
F9F0
F9F0
ENDCHAR
STARTCHAR B
ENCODING 66
SWIDTH 600 0
DWIDTH 11 0
BBX 11 11 0 0
BITMAP
3FC0
3FE0
0C60
0C60
1FE0
1FC0
3060
3060
30E0
FFC0
FF80
ENDCHAR
STARTCHAR C
ENCODING 67
SWIDTH 600 0
DWIDTH 11 0
BBX 11 11 1 0
BITMAP
0F60
3FE0
70C0
60C0
C000
C000
C000
C000
E180
7F80
3E00
ENDCHAR
STARTCHAR D
ENCODING 68
SWIDTH 600 0
DWIDTH 11 0
BBX 11 11 0 0
BITMAP
3F80
3FC0
1860
1860
3060
3060
3060
60C0
61C0
FF80
FE00
ENDCHAR
STARTCHAR E
ENCODING 69
SWIDTH 600 0
DWIDTH 11 0
BBX 12 11 0 0
BITMAP
3FF0
3FF0
0C60
1B60
1F00
1F00
3300
30C0
30C0
FFC0
FFC0
ENDCHAR
STARTCHAR F
ENCODING 70
SWIDTH 600 0
DWIDTH 11 0
BBX 12 11 0 0
BITMAP
3FF0
3FF0
0C60
1B60
1F00
1F00
3300
3000
3000
FE00
FE00
ENDCHAR
STARTCHAR G
ENCODING 71
SWIDTH 600 0
DWIDTH 11 0
BBX 11 11 1 0
BITMAP
0F60
3FE0
70C0
60C0
C000
C000
C7C0
C7C0
E180
7F80
3E00
ENDCHAR
STARTCHAR H
ENCODING 72
SWIDTH 600 0
DWIDTH 11 0
BBX 12 11 0 0
BITMAP
3CF0
3CF0
1860
1860
3FC0
3FC0
30C0
6180
6180
F3C0
F3C0
ENDCHAR
STARTCHAR I
ENCODING 73
SWIDTH 600 0
DWIDTH 11 0
BBX 10 11 1 0
BITMAP
3FC0
3FC0
0600
0600
0C00
0C00
0C00
1800
1800
FF00
FF00
ENDCHAR
STARTCHAR J
ENCODING 74
SWIDTH 600 0
DWIDTH 11 0
BBX 12 11 0 0
BITMAP
07F0
07F0
00C0
00C0
0180
0180
6180
6300
C300
FE00
7C00
ENDCHAR
STARTCHAR K
ENCODING 75
SWIDTH 600 0
DWIDTH 11 0
BBX 12 11 0 0
BITMAP
3DF0
3DF0
18C0
1980
3300
3E00
3E00
6700
6380
F9E0
F9E0
ENDCHAR
STARTCHAR L
ENCODING 76
SWIDTH 600 0
DWIDTH 11 0
BBX 11 11 0 0
BITMAP
3F00
3F00
0C00
0C00
1800
1800
1860
3060
30C0
FFC0
FF80
ENDCHAR
STARTCHAR M
ENCODING 77
SWIDTH 600 0
DWIDTH 11 0
BBX 13 11 0 0
BITMAP
3838
3838
1870
38E0
3DE0
37E0
3760
66C0
60C0
FBE0
FBE0
ENDCHAR
STARTCHAR N
ENCODING 78
SWIDTH 600 0
DWIDTH 11 0
BBX 12 11 0 0
BITMAP
39F0
39F0
1C60
1C60
34C0
36C0
36C0
6380
6380
FB80
FB80
ENDCHAR
STARTCHAR O
ENCODING 79
SWIDTH 600 0
DWIDTH 11 0
BBX 10 11 1 0
BITMAP
0F00
3F80
71C0
60C0
C0C0
C0C0
C0C0
C180
E380
7F00
3C00
ENDCHAR
STARTCHAR P
ENCODING 80
SWIDTH 600 0
DWIDTH 11 0
BBX 11 11 0 0
BITMAP
3FC0
3FE0
1860
1860
30E0
3FC0
3F80
6000
6000
FC00
FC00
ENDCHAR
STARTCHAR Q
ENCODING 81
SWIDTH 600 0
DWIDTH 11 0
BBX 10 13 1 -2
BITMAP
0F00
3F80
71C0
60C0
C0C0
C0C0
C0C0
C180
E380
7F00
3C80
FF00
CE00
ENDCHAR
STARTCHAR R
ENCODING 82
SWIDTH 600 0
DWIDTH 11 0
BBX 12 11 0 0
BITMAP
3FC0
3FE0
1860
1860
30E0
3FC0
3F80
6380
61C0
FCF0
FCF0
ENDCHAR
STARTCHAR S
ENCODING 83
SWIDTH 600 0
DWIDTH 11 0
BBX 12 11 0 0
BITMAP
07B0
1FF0
3860
3860
1E00
0F80
03C0
60C0
61C0
FF80
EF00
ENDCHAR
STARTCHAR T
ENCODING 84
SWIDTH 600 0
DWIDTH 11 0
BBX 11 11 1 0
BITMAP
7FE0
7FE0
6660
C6C0
CCC0
0C00
0C00
1800
1800
7E00
7E00
ENDCHAR
STARTCHAR U
ENCODING 85
SWIDTH 600 0
DWIDTH 11 0
BBX 12 11 1 0
BITMAP
7DF0
7DF0
3060
6060
60C0
60C0
C0C0
C180
E380
7F00
3E00
ENDCHAR
STARTCHAR V
ENCODING 86
SWIDTH 600 0
DWIDTH 11 0
BBX 12 11 1 0
BITMAP
F9F0
F9F0
6060
60C0
3180
3180
3300
3600
1E00
1C00
1800
ENDCHAR
STARTCHAR W
ENCODING 87
SWIDTH 600 0
DWIDTH 11 0
BBX 12 11 1 0
BITMAP
F9F0
F9F0
6060
6C60
6CC0
DEC0
D6C0
F780
E780
E300
C300
ENDCHAR
STARTCHAR X
ENCODING 88
SWIDTH 600 0
DWIDTH 11 0
BBX 12 11 0 0
BITMAP
3CF0
3CF0
18C0
1980
0F00
0E00
1E00
3300
6180
F3C0
F3C0
ENDCHAR
STARTCHAR Y
ENCODING 89
SWIDTH 600 0
DWIDTH 11 0
BBX 10 11 2 0
BITMAP
F3C0
F3C0
6180
6300
3600
3C00
1800
3000
3000
FC00
FC00
ENDCHAR
STARTCHAR Z
ENCODING 90
SWIDTH 600 0
DWIDTH 11 0
BBX 10 11 1 0
BITMAP
3FC0
3FC0
6180
6300
0600
0C00
1800
3180
6180
FF00
FF00
ENDCHAR
STARTCHAR bracketleft
ENCODING 91
SWIDTH 600 0
DWIDTH 11 0
BBX 8 15 3 -3
BITMAP
0F
0F
18
18
18
30
30
30
60
60
60
C0
C0
F0
F0
ENDCHAR
STARTCHAR backslash
ENCODING 92
SWIDTH 600 0
DWIDTH 11 0
BBX 5 16 4 -3
BITMAP
C0
C0
C0
C0
60
60
60
60
30
30
30
30
18
18
18
18
ENDCHAR
STARTCHAR bracketright
ENCODING 93
SWIDTH 600 0
DWIDTH 11 0
BBX 8 15 1 -3
BITMAP
1F
1F
03
03
06
06
06
0C
0C
0C
18
18
18
F0
F0
ENDCHAR
STARTCHAR asciicircum
ENCODING 94
SWIDTH 600 0
DWIDTH 11 0
BBX 8 7 2 5
BITMAP
06
0E
1E
33
63
C3
C3
ENDCHAR
STARTCHAR underscore
ENCODING 95
SWIDTH 600 0
DWIDTH 11 0
BBX 11 2 0 -4
BITMAP
FFE0
FFE0
ENDCHAR
STARTCHAR quoteleft
ENCODING 96
SWIDTH 600 0
DWIDTH 11 0
BBX 3 5 6 7
BITMAP
C0
C0
60
60
20
ENDCHAR
STARTCHAR a
ENCODING 97
SWIDTH 600 0
DWIDTH 11 0
BBX 10 9 0 0
BITMAP
0F80
3FC0
30C0
00C0
3FC0
FF80
C180
FFC0
7DC0
ENDCHAR
STARTCHAR b
ENCODING 98
SWIDTH 600 0
DWIDTH 11 0
BBX 11 12 0 0
BITMAP
3800
3800
1800
3780
3FC0
38E0
3060
6060
6060
70C0
FFC0
EF00
ENDCHAR
STARTCHAR c
ENCODING 99
SWIDTH 600 0
DWIDTH 11 0
BBX 11 9 0 0
BITMAP
0F60
3FE0
70C0
60C0
C000
C000
E0C0
7FC0
3F00
ENDCHAR
STARTCHAR d
ENCODING 100
SWIDTH 600 0
DWIDTH 11 0
BBX 11 12 0 0
BITMAP
00E0
00E0
0060
0F60
3FC0
71C0
60C0
C0C0
C180
E380
7FC0
3DC0
ENDCHAR
STARTCHAR e
ENCODING 101
SWIDTH 600 0
DWIDTH 11 0
BBX 11 9 0 0
BITMAP
0F80
3FC0
70E0
6060
FFE0
FFE0
C000
7F80
3F80
ENDCHAR
STARTCHAR f
ENCODING 102
SWIDTH 600 0
DWIDTH 11 0
BBX 11 12 1 0
BITMAP
03E0
0FE0
0C00
7F80
7F80
1800
1800
3800
3000
3000
FE00
FE00
ENDCHAR
STARTCHAR g
ENCODING 103
SWIDTH 600 0
DWIDTH 11 0
BBX 12 13 0 -4
BITMAP
0F70
3FE0
71C0
60C0
C0C0
C1C0
E380
7F80
3D80
0300
0700
7E00
7C00
ENDCHAR
STARTCHAR h
ENCODING 104
SWIDTH 600 0
DWIDTH 11 0
BBX 10 12 0 0
BITMAP
3800
3800
1800
3780
3FC0
38C0
30C0
60C0
6180
6180
F3C0
F3C0
ENDCHAR
STARTCHAR i
ENCODING 105
SWIDTH 600 0
DWIDTH 11 0
BBX 8 12 1 0
BITMAP
06
06
00
3C
3C
0C
0C
0C
18
18
FF
FF
ENDCHAR
STARTCHAR j
ENCODING 106
SWIDTH 600 0
DWIDTH 11 0
BBX 10 16 0 -4
BITMAP
0180
0180
0000
3FC0
3FC0
0180
0180
0180
0300
0300
0300
0300
0600
0600
FC00
F800
ENDCHAR
STARTCHAR k
ENCODING 107
SWIDTH 600 0
DWIDTH 11 0
BBX 11 12 0 0
BITMAP
3800
3800
1800
19E0
33E0
3700
3E00
3C00
6E00
6700
E3C0
E3C0
ENDCHAR
STARTCHAR l
ENCODING 108
SWIDTH 600 0
DWIDTH 11 0
BBX 8 12 1 0
BITMAP
1E
1E
06
06
0C
0C
0C
18
18
18
FF
FF
ENDCHAR
STARTCHAR m
ENCODING 109
SWIDTH 600 0
DWIDTH 11 0
BBX 12 9 -1 0
BITMAP
7B60
7FF0
3BB0
3330
3330
6660
6660
F770
F770
ENDCHAR
STARTCHAR n
ENCODING 110
SWIDTH 600 0
DWIDTH 11 0
BBX 10 9 0 0
BITMAP
7B80
7FC0
38C0
30C0
30C0
6180
6180
F3C0
F3C0
ENDCHAR
STARTCHAR o
ENCODING 111
SWIDTH 600 0
DWIDTH 11 0
BBX 11 9 0 0
BITMAP
0F80
3FC0
70E0
6060
C060
C0C0
E1C0
7F80
3E00
ENDCHAR
STARTCHAR p
ENCODING 112
SWIDTH 600 0
DWIDTH 11 0
BBX 12 13 -1 -4
BITMAP
3DC0
3FE0
1C70
1830
1830
3030
3860
3FE0
3780
6000
6000
F800
F800
ENDCHAR
STARTCHAR q
ENCODING 113
SWIDTH 600 0
DWIDTH 11 0
BBX 12 13 0 -4
BITMAP
0F70
3FF0
71C0
60C0
C0C0
C180
E380
7F80
3D80
0300
0300
0F80
0F80
ENDCHAR
STARTCHAR r
ENCODING 114
SWIDTH 600 0
DWIDTH 11 0
BBX 11 9 0 0
BITMAP
7DC0
7FE0
1C60
1800
1800
3000
3000
FF00
FF00
ENDCHAR
STARTCHAR s
ENCODING 115
SWIDTH 600 0
DWIDTH 11 0
BBX 11 9 0 0
BITMAP
0F60
1FE0
30C0
3C00
1F00
6780
6180
FF80
DF00
ENDCHAR
STARTCHAR t
ENCODING 116
SWIDTH 600 0
DWIDTH 11 0
BBX 9 12 1 0
BITMAP
1800
1800
1800
FF80
FF80
3000
3000
6000
6180
6180
7F00
3E00
ENDCHAR
STARTCHAR u
ENCODING 117
SWIDTH 600 0
DWIDTH 11 0
BBX 9 9 1 0
BITMAP
E380
E380
6180
6180
C300
C300
C700
FF80
7B80
ENDCHAR
STARTCHAR v
ENCODING 118
SWIDTH 600 0
DWIDTH 11 0
BBX 11 9 1 0
BITMAP
F1E0
F1E0
60C0
6180
3300
3600
3E00
1C00
1800
ENDCHAR
STARTCHAR w
ENCODING 119
SWIDTH 600 0
DWIDTH 11 0
BBX 12 9 0 0
BITMAP
F8F0
F8F0
6660
6660
6EC0
3AC0
3BC0
3180
3180
ENDCHAR
STARTCHAR x
ENCODING 120
SWIDTH 600 0
DWIDTH 11 0
BBX 13 9 0 0
BITMAP
7CF8
7CF8
18E0
0D80
0700
0F00
3980
FBE0
FBE0
ENDCHAR
STARTCHAR y
ENCODING 121
SWIDTH 600 0
DWIDTH 11 0
BBX 12 13 0 -4
BITMAP
3CF0
3CF0
1860
0CC0
0D80
0700
0600
0600
0C00
1800
3000
F800
F800
ENDCHAR
STARTCHAR z
ENCODING 122
SWIDTH 600 0
DWIDTH 11 0
BBX 9 9 1 0
BITMAP
3F80
7F80
6700
0E00
1C00
3800
7180
FF80
FF00
ENDCHAR
STARTCHAR braceleft
ENCODING 123
SWIDTH 600 0
DWIDTH 11 0
BBX 7 15 3 -3
BITMAP
0E
18
18
30
30
30
C0
60
60
60
60
C0
C0
C0
70
ENDCHAR
STARTCHAR bar
ENCODING 124
SWIDTH 600 0
DWIDTH 11 0
BBX 6 16 3 -3
BITMAP
0C
0C
0C
18
18
18
30
30
30
60
60
60
60
C0
C0
C0
ENDCHAR
STARTCHAR braceright
ENCODING 125
SWIDTH 600 0
DWIDTH 11 0
BBX 7 15 1 -3
BITMAP
0C
06
06
06
0C
0C
06
0C
18
18
18
18
30
30
E0
ENDCHAR
STARTCHAR asciitilde
ENCODING 126
SWIDTH 600 0
DWIDTH 11 0
BBX 8 3 2 4
BITMAP
73
FF
DE
ENDCHAR
STARTCHAR Aogonek
ENCODING 161
SWIDTH 600 0
DWIDTH 11 0
BBX 12 14 -1 -3
BITMAP
0F80
0F80
0380
0780
0CC0
0CC0
1FC0
3FC0
30C0
F9F0
F9F0
0060
00C0
0070
ENDCHAR
STARTCHAR breve
ENCODING 162
SWIDTH 600 0
DWIDTH 11 0
BBX 6 2 2 9
BITMAP
CC
78
ENDCHAR
STARTCHAR Lslash
ENCODING 163
SWIDTH 600 0
DWIDTH 11 0
BBX 11 11 0 0
BITMAP
3F00
3F00
0C00
0F00
1E00
3C00
7860
3060
30C0
FFC0
FF80
ENDCHAR
STARTCHAR currency
ENCODING 164
SWIDTH 600 0
DWIDTH 11 0
BBX 10 9 1 1
BITMAP
30C0
3FC0
3F80
6180
6180
6180
7F00
FF00
C300
ENDCHAR
STARTCHAR Lcaron
ENCODING 165
SWIDTH 600 0
DWIDTH 11 0
BBX 11 11 0 0
BITMAP
3F20
3F60
0C40
0CC0
1880
1800
1860
3060
30C0
FFC0
FF80
ENDCHAR
STARTCHAR Sacute
ENCODING 166
SWIDTH 600 0
DWIDTH 11 0
BBX 12 15 0 0
BITMAP
0030
0060
00C0
0000
07B0
1FF0
3860
3860
1E00
0F80
03C0
60C0
61C0
FF80
EF00
ENDCHAR
STARTCHAR section
ENCODING 167
SWIDTH 600 0
DWIDTH 11 0
BBX 11 14 1 -2
BITMAP
07E0
0C60
18C0
1C00
3700
6380
71C0
38C0
1CC0
0F80
0700
C300
C600
F800
ENDCHAR
STARTCHAR dieresis
ENCODING 168
SWIDTH 600 0
DWIDTH 11 0
BBX 6 2 4 9
BITMAP
CC
CC
ENDCHAR
STARTCHAR Scaron
ENCODING 169
SWIDTH 600 0
DWIDTH 11 0
BBX 11 14 0 0
BITMAP
1980
1F00
0E00
0000
0F60
3FE0
70C0
70C0
3C00
0F00
6380
6380
FF00
DE00
ENDCHAR
STARTCHAR Scedilla
ENCODING 170
SWIDTH 600 0
DWIDTH 11 0
BBX 12 15 0 -4
BITMAP
07B0
1FF0
3860
3860
1E00
0F80
03C0
60C0
61C0
FF80
EF00
0800
1C00
0C00
3800
ENDCHAR
STARTCHAR Tcaron
ENCODING 171
SWIDTH 600 0
DWIDTH 11 0
BBX 11 15 1 0
BITMAP
0CC0
0F80
0700
0000
7FE0
7FE0
6660
C6C0
CCC0
0C00
0C00
1800
1800
7E00
7E00
ENDCHAR
STARTCHAR Zacute
ENCODING 172
SWIDTH 600 0
DWIDTH 11 0
BBX 10 15 1 0
BITMAP
00C0
0180
0300
0000
3FC0
3FC0
6180
6300
0600
0C00
1800
3180
6180
FF00
FF00
ENDCHAR
STARTCHAR hyphen
ENCODING 173
SWIDTH 600 0
DWIDTH 11 0
BBX 9 2 2 4
BITMAP
FF80
FF80
ENDCHAR
STARTCHAR Zcaron
ENCODING 174
SWIDTH 600 0
DWIDTH 11 0
BBX 10 14 1 0
BITMAP
1980
1F00
0E00
0000
3FC0
3FC0
6180
6300
0E00
1800
3180
6180
FF00
FF00
ENDCHAR
STARTCHAR Zdotaccent
ENCODING 175
SWIDTH 600 0
DWIDTH 11 0
BBX 10 14 1 0
BITMAP
0600
0600
0000
3FC0
3FC0
6180
6300
0600
0C00
1800
3180
6180
FF00
FF00
ENDCHAR
STARTCHAR degree
ENCODING 176
SWIDTH 600 0
DWIDTH 11 0
BBX 6 6 3 6
BITMAP
38
4C
84
84
C8
70
ENDCHAR
STARTCHAR aogonek
ENCODING 177
SWIDTH 600 0
DWIDTH 11 0
BBX 10 12 0 -3
BITMAP
0F80
3FC0
30C0
00C0
3FC0
FF80
C180
FFC0
7DC0
0180
0300
01C0
ENDCHAR
STARTCHAR ogonek
ENCODING 178
SWIDTH 600 0
DWIDTH 11 0
BBX 4 4 3 -4
BITMAP
60
C0
C0
70
ENDCHAR
STARTCHAR lslash
ENCODING 179
SWIDTH 600 0
DWIDTH 11 0
BBX 8 12 1 0
BITMAP
1E
1E
06
06
0C
0F
3E
78
18
18
FF
FF
ENDCHAR
STARTCHAR acute
ENCODING 180
SWIDTH 600 0
DWIDTH 11 0
BBX 4 3 7 9
BITMAP
30
60
C0
ENDCHAR
STARTCHAR lcaron
ENCODING 181
SWIDTH 600 0
DWIDTH 11 0
BBX 11 12 1 0
BITMAP
1E20
1E60
0640
06C0
0C80
0C00
0C00
1800
1800
1800
FF00
FF00
ENDCHAR
STARTCHAR sacute
ENCODING 182
SWIDTH 600 0
DWIDTH 11 0
BBX 11 13 0 0
BITMAP
0060
00C0
0180
0000
0F60
1FE0
30C0
3C00
1F00
6780
6180
FF80
DF00
ENDCHAR
STARTCHAR caron
ENCODING 183
SWIDTH 600 0
DWIDTH 11 0
BBX 6 3 2 9
BITMAP
CC
F8
70
ENDCHAR
STARTCHAR cedilla
ENCODING 184
SWIDTH 600 0
DWIDTH 11 0
BBX 4 5 3 -5
BITMAP
20
70
30
30
E0
ENDCHAR
STARTCHAR scaron
ENCODING 185
SWIDTH 600 0
DWIDTH 11 0
BBX 11 13 0 0
BITMAP
0CC0
0F80
0700
0000
0F60
1FE0
30C0
3C00
0F00
6380
6180
FF80
DF00
ENDCHAR
STARTCHAR scedilla
ENCODING 186
SWIDTH 600 0
DWIDTH 11 0
BBX 11 13 0 -4
BITMAP
0F60
1FE0
30C0
3C00
1F00
6780
6180
FF80
DF00
0800
1C00
0C00
3800
ENDCHAR
STARTCHAR tcaron
ENCODING 187
SWIDTH 600 0
DWIDTH 11 0
BBX 9 15 1 0
BITMAP
0080
0180
0100
1B00
1A00
1800
FF80
FF80
3000
3000
6000
6180
6180
7F00
3E00
ENDCHAR
STARTCHAR zacute
ENCODING 188
SWIDTH 600 0
DWIDTH 11 0
BBX 10 13 1 0
BITMAP
00C0
0180
0300
0000
3F80
7F80
6700
0E00
1C00
3800
7180
FF80
FF00
ENDCHAR
STARTCHAR hungarumlaut
ENCODING 189
SWIDTH 600 0
DWIDTH 11 0
BBX 7 3 2 9
BITMAP
36
6C
D8
ENDCHAR
STARTCHAR zcaron
ENCODING 190
SWIDTH 600 0
DWIDTH 11 0
BBX 9 13 1 0
BITMAP
1980
1F00
0E00
0000
3F80
7F80
6700
0E00
1C00
3800
7180
FF80
FF00
ENDCHAR
STARTCHAR zdotaccent
ENCODING 191
SWIDTH 600 0
DWIDTH 11 0
BBX 9 12 1 0
BITMAP
0600
0600
0000
3F80
7F80
6700
0E00
1C00
3800
7180
FF80
FF00
ENDCHAR
STARTCHAR Racute
ENCODING 192
SWIDTH 600 0
DWIDTH 11 0
BBX 12 15 0 0
BITMAP
00C0
0180
0300
0000
3FC0
3FE0
1860
1860
30E0
3FC0
3F80
6380
61C0
FCF0
FCF0
ENDCHAR
STARTCHAR Aacute
ENCODING 193
SWIDTH 600 0
DWIDTH 11 0
BBX 12 15 -1 0
BITMAP
00C0
0180
0300
0000
0F80
0F80
0380
0780
0480
0CC0
1FC0
3FC0
30C0
F9F0
F9F0
ENDCHAR
STARTCHAR Acircumflex
ENCODING 194
SWIDTH 600 0
DWIDTH 11 0
BBX 12 15 -1 0
BITMAP
0180
03C0
0660
0000
0F80
0F80
0380
0780
0480
0CC0
1FC0
3FC0
30C0
F9F0
F9F0
ENDCHAR
STARTCHAR Abreve
ENCODING 195
SWIDTH 600 0
DWIDTH 11 0
BBX 12 15 -1 0
BITMAP
0660
03C0
0000
0000
0F80
0F80
0380
0780
0CC0
0CC0
1FC0
3FC0
30C0
F9F0
F9F0
ENDCHAR
STARTCHAR Adieresis
ENCODING 196
SWIDTH 600 0
DWIDTH 11 0
BBX 12 14 -1 0
BITMAP
0660
0660
0000
0F80
0F80
0380
0780
0480
0CC0
1FC0
3FC0
30C0
F9F0
F9F0
ENDCHAR
STARTCHAR Lacute
ENCODING 197
SWIDTH 600 0
DWIDTH 11 0
BBX 11 15 0 0
BITMAP
0180
0300
0600
0000
3F00
3F00
0C00
0C00
1800
1800
1860
3060
30C0
FFC0
FF80
ENDCHAR
STARTCHAR Cacute
ENCODING 198
SWIDTH 600 0
DWIDTH 11 0
BBX 11 15 1 0
BITMAP
00C0
0180
0300
0000
0F60
3FE0
70C0
60C0
C000
C000
C000
C000
E180
7F80
3E00
ENDCHAR
STARTCHAR Ccedilla
ENCODING 199
SWIDTH 600 0
DWIDTH 11 0
BBX 11 15 1 -4
BITMAP
0F60
3FE0
70C0
60C0
C000
C000
C000
C000
E180
7F80
3E00
1000
3800
1800
7000
ENDCHAR
STARTCHAR Ccaron
ENCODING 200
SWIDTH 600 0
DWIDTH 11 0
BBX 11 15 1 0
BITMAP
0660
07C0
0380
0000
0F60
3FE0
70C0
60C0
C000
C000
C000
C000
E180
7F80
3E00
ENDCHAR
STARTCHAR Eacute
ENCODING 201
SWIDTH 600 0
DWIDTH 11 0
BBX 12 15 0 0
BITMAP
00C0
0180
0300
0000
3FF0
3FF0
0C60
1B60
1F60
1E00
3600
30C0
30C0
FFC0
FFC0
ENDCHAR
STARTCHAR Eogonek
ENCODING 202
SWIDTH 600 0
DWIDTH 11 0
BBX 12 14 0 -3
BITMAP
3FF0
3FF0
0C60
1B60
1F00
1F00
3300
30C0
30C0
FFC0
FFC0
00C0
0180
00E0
ENDCHAR
STARTCHAR Edieresis
ENCODING 203
SWIDTH 600 0
DWIDTH 11 0
BBX 12 14 0 0
BITMAP
0CC0
0CC0
0000
3FF0
3FF0
0C60
1B60
1F60
1E00
3600
30C0
30C0
FFC0
FFC0
ENDCHAR
STARTCHAR Ecaron
ENCODING 204
SWIDTH 600 0
DWIDTH 11 0
BBX 12 15 0 0
BITMAP
0660
07C0
0380
0000
3FF0
3FF0
0C60
1B60
1F00
1F00
3300
30C0
30C0
FFC0
FFC0
ENDCHAR
STARTCHAR Iacute
ENCODING 205
SWIDTH 600 0
DWIDTH 11 0
BBX 10 15 1 0
BITMAP
0180
0300
0600
0000
3FC0
3FC0
0600
0600
0C00
0C00
0C00
1800
1800
FF00
FF00
ENDCHAR
STARTCHAR Icircumflex
ENCODING 206
SWIDTH 600 0
DWIDTH 11 0
BBX 10 15 1 0
BITMAP
0300
0780
0CC0
0000
3FC0
3FC0
0600
0600
0C00
0C00
0C00
1800
1800
FF00
FF00
ENDCHAR
STARTCHAR Dcaron
ENCODING 207
SWIDTH 600 0
DWIDTH 11 0
BBX 11 15 0 0
BITMAP
0660
07C0
0380
0000
3F80
3FC0
1860
1860
3060
3060
3060
60C0
61C0
FF80
FE00
ENDCHAR
STARTCHAR Eth
ENCODING 208
SWIDTH 600 0
DWIDTH 11 0
BBX 11 11 0 0
BITMAP
3F80
3FC0
1860
1860
7E60
7E60
3060
60C0
61C0
FF80
FE00
ENDCHAR
STARTCHAR Nacute
ENCODING 209
SWIDTH 600 0
DWIDTH 11 0
BBX 12 15 0 0
BITMAP
00C0
0180
0300
0000
39F0
39F0
1C60
1C60
34C0
36C0
36C0
6380
6380
FB80
FB80
ENDCHAR
STARTCHAR Ncaron
ENCODING 210
SWIDTH 600 0
DWIDTH 11 0
BBX 12 15 0 0
BITMAP
0330
03E0
01C0
0000
39F0
39F0
1C60
1C60
34C0
36C0
36C0
6380
6380
FB80
FB80
ENDCHAR
STARTCHAR Oacute
ENCODING 211
SWIDTH 600 0
DWIDTH 11 0
BBX 10 15 1 0
BITMAP
0180
0300
0600
0000
0F00
3F80
71C0
60C0
C0C0
C0C0
C0C0
C180
E380
7F00
3C00
ENDCHAR
STARTCHAR Ocircumflex
ENCODING 212
SWIDTH 600 0
DWIDTH 11 0
BBX 10 15 1 0
BITMAP
0600
0F00
1980
0000
0F00
3F80
71C0
60C0
C0C0
C0C0
C0C0
C180
E380
7F00
3C00
ENDCHAR
STARTCHAR Ohungarumlaut
ENCODING 213
SWIDTH 600 0
DWIDTH 11 0
BBX 11 15 1 0
BITMAP
0360
06C0
0D80
0000
0F00
3F80
71C0
60C0
C0C0
C0C0
C0C0
C180
E380
7F00
3C00
ENDCHAR
STARTCHAR Odieresis
ENCODING 214
SWIDTH 600 0
DWIDTH 11 0
BBX 10 14 1 0
BITMAP
1980
1980
0000
0F00
3F80
71C0
60C0
C0C0
C0C0
C0C0
C180
E380
7F00
3C00
ENDCHAR
STARTCHAR multiply
ENCODING 215
SWIDTH 600 0
DWIDTH 11 0
BBX 11 10 0 0
BITMAP
2040
70E0
39C0
1F80
0F00
1E00
3F00
7380
E1C0
4080
ENDCHAR
STARTCHAR Rcaron
ENCODING 216
SWIDTH 600 0
DWIDTH 11 0
BBX 12 15 0 0
BITMAP
0660
07C0
0380
0000
3FC0
3FE0
1860
1860
30E0
3FC0
3F80
6380
61C0
FCF0
FCF0
ENDCHAR
STARTCHAR Uring
ENCODING 217
SWIDTH 600 0
DWIDTH 11 0
BBX 12 15 1 0
BITMAP
0380
0480
0480
0700
7DF0
7DF0
3060
6060
60C0
60C0
C0C0
C180
E380
7F00
3E00
ENDCHAR
STARTCHAR Uacute
ENCODING 218
SWIDTH 600 0
DWIDTH 11 0
BBX 12 14 1 0
BITMAP
0180
0300
0000
7DF0
7DF0
3060
6060
60C0
60C0
C0C0
C180
E380
7F00
3E00
ENDCHAR
STARTCHAR Uhungarumlaut
ENCODING 219
SWIDTH 600 0
DWIDTH 11 0
BBX 12 15 1 0
BITMAP
0360
06C0
0D80
0000
7DF0
7DF0
3060
6060
60C0
60C0
C0C0
C180
E380
7F00
3E00
ENDCHAR
STARTCHAR Udieresis
ENCODING 220
SWIDTH 600 0
DWIDTH 11 0
BBX 12 14 1 0
BITMAP
0C60
0C60
0000
7DF0
7DF0
3060
6060
60C0
60C0
C0C0
C180
E380
7F00
3E00
ENDCHAR
STARTCHAR Yacute
ENCODING 221
SWIDTH 600 0
DWIDTH 11 0
BBX 10 15 2 0
BITMAP
0300
0600
0C00
0000
F3C0
F3C0
6180
6300
3600
3C00
1800
3800
3000
FC00
FC00
ENDCHAR
STARTCHAR Tcedilla
ENCODING 222
SWIDTH 600 0
DWIDTH 11 0
BBX 11 15 1 -4
BITMAP
7FE0
7FE0
6660
C6C0
CCC0
0C00
0C00
1800
1800
7E00
7E00
0800
1C00
0C00
3800
ENDCHAR
STARTCHAR germandbls
ENCODING 223
SWIDTH 600 0
DWIDTH 11 0
BBX 10 12 0 0
BITMAP
0780
1FC0
18C0
18C0
3180
3380
31C0
30C0
60C0
6980
EF80
E700
ENDCHAR
STARTCHAR racute
ENCODING 224
SWIDTH 600 0
DWIDTH 11 0
BBX 11 13 0 0
BITMAP
00C0
0180
0300
0000
7DC0
7FE0
1C60
1800
1800
3000
3000
FF00
FF00
ENDCHAR
STARTCHAR aacute
ENCODING 225
SWIDTH 600 0
DWIDTH 11 0
BBX 10 13 0 0
BITMAP
00C0
0180
0300
0000
0F80
3FC0
30C0
00C0
3FC0
FF80
C180
FFC0
7DC0
ENDCHAR
STARTCHAR acircumflex
ENCODING 226
SWIDTH 600 0
DWIDTH 11 0
BBX 10 13 0 0
BITMAP
0300
0780
0CC0
0000
0F80
3FC0
30C0
00C0
3FC0
FF80
C180
FFC0
7DC0
ENDCHAR
STARTCHAR abreve
ENCODING 227
SWIDTH 600 0
DWIDTH 11 0
BBX 10 13 0 0
BITMAP
0CC0
0780
0000
0000
0F80
3FC0
30C0
00C0
3FC0
FF80
C180
FFC0
7DC0
ENDCHAR
STARTCHAR adieresis
ENCODING 228
SWIDTH 600 0
DWIDTH 11 0
BBX 10 12 0 0
BITMAP
0CC0
0CC0
0000
0F80
3FC0
30C0
00C0
3FC0
FF80
C180
FFC0
7DC0
ENDCHAR
STARTCHAR lacute
ENCODING 229
SWIDTH 600 0
DWIDTH 11 0
BBX 9 15 1 0
BITMAP
0180
0300
0600
1E00
1E00
0600
0600
0C00
0C00
0C00
1800
1800
1800
FF00
FF00
ENDCHAR
STARTCHAR cacute
ENCODING 230
SWIDTH 600 0
DWIDTH 11 0
BBX 11 13 0 0
BITMAP
0060
00C0
0180
0000
0F60
3FE0
70C0
60C0
C000
C000
E0C0
7FC0
3F00
ENDCHAR
STARTCHAR ccedilla
ENCODING 231
SWIDTH 600 0
DWIDTH 11 0
BBX 11 13 0 -4
BITMAP
0F60
3FE0
70C0
60C0
C000
C000
E0C0
7FC0
3F00
0800
1C00
0C00
3800
ENDCHAR
STARTCHAR ccaron
ENCODING 232
SWIDTH 600 0
DWIDTH 11 0
BBX 11 13 0 0
BITMAP
0660
07C0
0380
0000
0F60
3FE0
70C0
60C0
C000
C000
E0C0
7FC0
3F00
ENDCHAR
STARTCHAR eacute
ENCODING 233
SWIDTH 600 0
DWIDTH 11 0
BBX 11 13 0 0
BITMAP
00C0
0180
0300
0000
0F80
3FC0
70E0
6060
FFE0
FFE0
C000
7F80
3F80
ENDCHAR
STARTCHAR eogonek
ENCODING 234
SWIDTH 600 0
DWIDTH 11 0
BBX 11 12 0 -3
BITMAP
0F80
3FC0
70E0
6060
FFE0
FFE0
C000
7F80
3F80
0C00
1800
0E00
ENDCHAR
STARTCHAR edieresis
ENCODING 235
SWIDTH 600 0
DWIDTH 11 0
BBX 11 12 0 0
BITMAP
0CC0
0CC0
0000
0F80
3FC0
70E0
6060
FFE0
FFE0
C000
7F80
3F80
ENDCHAR
STARTCHAR ecaron
ENCODING 236
SWIDTH 600 0
DWIDTH 11 0
BBX 11 13 0 0
BITMAP
0660
07C0
0380
0000
0F80
3FC0
70E0
6060
FFE0
FFE0
C000
7F80
3F80
ENDCHAR
STARTCHAR iacute
ENCODING 237
SWIDTH 600 0
DWIDTH 11 0
BBX 8 13 1 0
BITMAP
03
06
0C
00
3C
3C
0C
0C
0C
18
18
FF
FF
ENDCHAR
STARTCHAR icircumflex
ENCODING 238
SWIDTH 600 0
DWIDTH 11 0
BBX 8 13 1 0
BITMAP
0C
1E
33
00
3C
3C
0C
0C
0C
18
18
FF
FF
ENDCHAR
STARTCHAR dcaron
ENCODING 239
SWIDTH 600 0
DWIDTH 11 0
BBX 14 12 0 0
BITMAP
00E4
00EC
0068
0F78
3FD0
71C0
60C0
C0C0
C180
E380
7FC0
3DC0
ENDCHAR
STARTCHAR dmacron
ENCODING 240
SWIDTH 600 0
DWIDTH 11 0
BBX 12 12 0 0
BITMAP
00E0
0FF0
0FF0
0F60
3FC0
71C0
60C0
C0C0
C180
E380
7FC0
3DC0
ENDCHAR
STARTCHAR nacute
ENCODING 241
SWIDTH 600 0
DWIDTH 11 0
BBX 10 13 0 0
BITMAP
00C0
0180
0300
0000
7B80
7FC0
38C0
30C0
30C0
6180
6180
F3C0
F3C0
ENDCHAR
STARTCHAR ncaron
ENCODING 242
SWIDTH 600 0
DWIDTH 11 0
BBX 11 13 0 0
BITMAP
0660
07C0
0380
0000
7B80
7FC0
38C0
30C0
30C0
6180
6180
F3C0
F3C0
ENDCHAR
STARTCHAR oacute
ENCODING 243
SWIDTH 600 0
DWIDTH 11 0
BBX 11 13 0 0
BITMAP
00C0
0180
0300
0000
0F80
3FC0
70E0
6060
C060
C0C0
E1C0
7F80
3E00
ENDCHAR
STARTCHAR ocircumflex
ENCODING 244
SWIDTH 600 0
DWIDTH 11 0
BBX 11 13 0 0
BITMAP
0300
0780
0CC0
0000
0F80
3FC0
70E0
6060
C060
C0C0
E1C0
7F80
3E00
ENDCHAR
STARTCHAR ohungarumlaut
ENCODING 245
SWIDTH 600 0
DWIDTH 11 0
BBX 11 13 0 0
BITMAP
0360
06C0
0D80
0000
0F80
3FC0
70E0
6060
C060
C0C0
E1C0
7F80
3E00
ENDCHAR
STARTCHAR odieresis
ENCODING 246
SWIDTH 600 0
DWIDTH 11 0
BBX 11 12 0 0
BITMAP
0CC0
0CC0
0000
0F80
3FC0
70E0
6060
C060
C0C0
E1C0
7F80
3E00
ENDCHAR
STARTCHAR divide
ENCODING 247
SWIDTH 600 0
DWIDTH 11 0
BBX 8 10 1 0
BITMAP
0C
0C
00
00
FF
FF
00
00
30
30
ENDCHAR
STARTCHAR rcaron
ENCODING 248
SWIDTH 600 0
DWIDTH 11 0
BBX 11 13 0 0
BITMAP
0660
07C0
0380
0000
7DC0
7FE0
1C60
1800
1800
3000
3000
FF00
FF00
ENDCHAR
STARTCHAR uring
ENCODING 249
SWIDTH 600 0
DWIDTH 11 0
BBX 9 14 1 0
BITMAP
0700
0900
0900
0E00
0000
E380
E380
6180
6180
C300
C300
C700
FF80
7B80
ENDCHAR
STARTCHAR uacute
ENCODING 250
SWIDTH 600 0
DWIDTH 11 0
BBX 9 13 1 0
BITMAP
0300
0600
0C00
0000
E380
E380
6180
6180
C300
C300
C700
FF80
7B80
ENDCHAR
STARTCHAR uhungarumlaut
ENCODING 251
SWIDTH 600 0
DWIDTH 11 0
BBX 10 13 1 0
BITMAP
06C0
0D80
1B00
0000
E380
E380
6180
6180
C300
C300
C700
FF80
7B80
ENDCHAR
STARTCHAR udieresis
ENCODING 252
SWIDTH 600 0
DWIDTH 11 0
BBX 9 12 1 0
BITMAP
3300
3300
0000
E380
E380
6180
6180
C300
C300
C700
FF80
7B80
ENDCHAR
STARTCHAR yacute
ENCODING 253
SWIDTH 600 0
DWIDTH 11 0
BBX 12 17 -1 -4
BITMAP
0060
00C0
0180
0000
3CF0
3CF0
1860
0CC0
0D80
0700
0600
0600
0C00
1800
3000
F800
F800
ENDCHAR
STARTCHAR tcedilla
ENCODING 254
SWIDTH 600 0
DWIDTH 11 0
BBX 9 16 1 -4
BITMAP
1800
1800
1800
FF80
FF80
3000
3000
6000
6180
6180
7F00
3E00
0800
1C00
0C00
3800
ENDCHAR
STARTCHAR dotaccent
ENCODING 255
SWIDTH 600 0
DWIDTH 11 0
BBX 2 2 4 9
BITMAP
C0
C0
ENDCHAR
ENDFONT
