STARTFONT 2.1
COMMENT +
COMMENT  Copyright 1984-1989, 1994 Adobe Systems Incorporated.
COMMENT  Copyright 1988, 1994 Digital Equipment Corporation.
COMMENT  Copyright 1996 BIZNET Poland, Inc.
COMMENT
COMMENT  Permission to use, copy, modify, distribute and sell this software
COMMENT  and its documentation for any purpose and without fee is hereby
COMMENT  granted, provided that the above copyright notices appear in all
COMMENT  copies and that both those copyright notices and this permission
COMMENT  notice appear in supporting documentation, and that the names of
COMMENT  Adobe Systems and Digital Equipment Corporation not be used in
COMMENT  advertising or publicity pertaining to distribution of the software
COMMENT  without specific, written prior permission.  Adobe Systems and
COMMENT  Digital Equipment Corporation make no representations about the
COMMENT  suitability of this software for any purpose.  It is provided "as
COMMENT  is" without express or implied warranty.
COMMENT -
FONT -BIZNET-Anagnostiko-Bold-I-Normal--17-120-100-100-P-99-ISO8859-2
SIZE 12 100 100
FONTBOUNDINGBOX 19 16 -3 -3
STARTPROPERTIES 25
FOUNDRY "BIZNET"
FAMILY_NAME "BIZNET Anagnostiko"
WEIGHT_NAME "Bold"
SLANT "I"
SETWIDTH_NAME "Normal"
ADD_STYLE_NAME ""
PIXEL_SIZE 17
POINT_SIZE 120
RESOLUTION_X 100
RESOLUTION_Y 100
SPACING "P"
AVERAGE_WIDTH 99
CHARSET_REGISTRY "ISO8859"
CHARSET_ENCODING "2"
CAP_HEIGHT 12
X_HEIGHT 8
FONT_ASCENT 14
FONT_DESCENT 3
FACE_NAME "BIZNET Anagnostiko Bold Italic"
DEFAULT_CHAR 32
RELATIVE_SETWIDTH 50
RELATIVE_WEIGHT 70
CHARSET_COLLECTIONS "ASCII ISO8859-2"
COPYRIGHT "Copyright (c) 1984, 1987 Adobe Systems Incorporated. All Rights Reserved. Copyright (c) 1988, 1991 Digital Equipment Corporation. All Rights Reserved. Copyright (c) 1996 BIZNET Poland, Inc. All Rights Reserved."
NOTICE "The name "BIZNET" is a registered trademark of BIZNET Poland, Inc."
ENDPROPERTIES
CHARS 190
STARTCHAR space
ENCODING 32
SWIDTH 287 0
DWIDTH 4 0
BBX 1 1 1 0
BITMAP
00
ENDCHAR
STARTCHAR exclam
ENCODING 33
SWIDTH 333 0
DWIDTH 6 0
BBX 6 12 0 0
BITMAP
18
3C
38
38
30
30
20
20
00
60
F0
60
ENDCHAR
STARTCHAR quotedbl
ENCODING 34
SWIDTH 400 0
DWIDTH 7 0
BBX 7 5 1 7
BITMAP
CC
EE
CC
88
88
ENDCHAR
STARTCHAR numbersign
ENCODING 35
SWIDTH 606 0
DWIDTH 10 0
BBX 10 12 0 0
BITMAP
0900
0900
0900
0900
7FC0
1200
1200
FF80
2400
2400
2400
2400
ENDCHAR
STARTCHAR dollar
ENCODING 36
SWIDTH 574 0
DWIDTH 9 0
BBX 9 15 0 -1
BITMAP
0200
0200
1F00
2480
6580
6580
7800
3E00
0F00
0B00
D300
D300
9600
7800
2000
ENDCHAR
STARTCHAR percent
ENCODING 37
SWIDTH 889 0
DWIDTH 15 0
BBX 12 12 2 0
BITMAP
3880
7780
6500
C500
CA00
CAE0
75D0
0590
0B10
0B20
1320
11C0
ENDCHAR
STARTCHAR ampersand
ENCODING 38
SWIDTH 889 0
DWIDTH 15 0
BBX 14 12 0 0
BITMAP
03C0
0660
0E60
0EC0
0700
1E7C
7730
63A0
E3A0
F1C4
7BF8
3CF0
ENDCHAR
STARTCHAR quoteright
ENCODING 39
SWIDTH 259 0
DWIDTH 4 0
BBX 4 6 1 6
BITMAP
60
F0
70
20
40
80
ENDCHAR
STARTCHAR parenleft
ENCODING 40
SWIDTH 407 0
DWIDTH 7 0
BBX 6 14 1 -2
BITMAP
04
18
30
30
60
60
E0
C0
C0
C0
C0
40
40
20
ENDCHAR
STARTCHAR parenright
ENCODING 41
SWIDTH 407 0
DWIDTH 7 0
BBX 6 14 -1 -2
BITMAP
10
08
08
0C
0C
0C
0C
1C
18
18
30
30
60
80
ENDCHAR
STARTCHAR asterisk
ENCODING 42
SWIDTH 500 0
DWIDTH 8 0
BBX 7 7 1 5
BITMAP
10
54
D6
38
D6
54
10
ENDCHAR
STARTCHAR plus
ENCODING 43
SWIDTH 606 0
DWIDTH 10 0
BBX 8 8 1 0
BITMAP
18
18
18
FF
FF
18
18
18
ENDCHAR
STARTCHAR comma
ENCODING 44
SWIDTH 287 0
DWIDTH 5 0
BBX 4 6 0 -3
BITMAP
60
F0
70
20
40
80
ENDCHAR
STARTCHAR minus
ENCODING 45
SWIDTH 606 0
DWIDTH 10 0
BBX 8 2 1 3
BITMAP
FF
FF
ENDCHAR
STARTCHAR period
ENCODING 46
SWIDTH 287 0
DWIDTH 5 0
BBX 4 3 0 0
BITMAP
60
F0
60
ENDCHAR
STARTCHAR slash
ENCODING 47
SWIDTH 278 0
DWIDTH 5 0
BBX 5 12 0 0
BITMAP
08
18
10
10
30
20
20
60
40
40
C0
80
ENDCHAR
STARTCHAR zero
ENCODING 48
SWIDTH 574 0
DWIDTH 9 0
BBX 8 12 1 0
BITMAP
1E
37
63
63
E3
C3
C3
C7
C6
C6
EC
78
ENDCHAR
STARTCHAR one
ENCODING 49
SWIDTH 574 0
DWIDTH 9 0
BBX 8 12 0 0
BITMAP
03
3F
06
0E
0C
0C
1C
1C
18
38
38
FE
ENDCHAR
STARTCHAR two
ENCODING 50
SWIDTH 574 0
DWIDTH 9 0
BBX 10 12 -1 0
BITMAP
0F00
1180
21C0
38C0
39C0
1380
0700
0E00
1880
2100
7F00
FE00
ENDCHAR
STARTCHAR three
ENCODING 51
SWIDTH 574 0
DWIDTH 9 0
BBX 9 12 0 0
BITMAP
1F00
3380
7980
3380
0700
1C00
0600
4700
E300
C700
CE00
7C00
ENDCHAR
STARTCHAR four
ENCODING 52
SWIDTH 574 0
DWIDTH 9 0
BBX 9 12 0 0
BITMAP
0180
0380
0700
0B00
1700
2600
4600
8E00
FF00
0C00
0C00
3E00
ENDCHAR
STARTCHAR five
ENCODING 53
SWIDTH 574 0
DWIDTH 9 0
BBX 11 12 0 0
BITMAP
1FE0
1FC0
3000
3000
2000
3E00
0700
0380
6380
E300
C700
7C00
ENDCHAR
STARTCHAR six
ENCODING 54
SWIDTH 574 0
DWIDTH 9 0
BBX 9 12 1 0
BITMAP
0F00
3380
3300
6000
6E00
F700
E300
C300
C700
C600
CE00
7800
ENDCHAR
STARTCHAR seven
ENCODING 55
SWIDTH 574 0
DWIDTH 9 0
BBX 9 12 1 0
BITMAP
7F80
7F00
C200
8600
0400
0C00
1800
3800
3000
7000
7000
6000
ENDCHAR
STARTCHAR eight
ENCODING 56
SWIDTH 574 0
DWIDTH 9 0
BBX 9 12 0 0
BITMAP
0F00
1180
3180
3100
3B00
1E00
3E00
6300
C300
C300
C600
7C00
ENDCHAR
STARTCHAR nine
ENCODING 57
SWIDTH 574 0
DWIDTH 9 0
BBX 9 12 0 0
BITMAP
0F00
1B80
3180
7180
6180
6380
7780
3B00
0300
6600
E600
7800
ENDCHAR
STARTCHAR colon
ENCODING 58
SWIDTH 287 0
DWIDTH 5 0
BBX 5 8 0 0
BITMAP
30
78
30
00
00
60
F0
60
ENDCHAR
STARTCHAR semicolon
ENCODING 59
SWIDTH 287 0
DWIDTH 5 0
BBX 5 11 0 -3
BITMAP
30
78
30
00
00
60
F0
70
20
40
80
ENDCHAR
STARTCHAR less
ENCODING 60
SWIDTH 606 0
DWIDTH 10 0
BBX 8 8 1 0
BITMAP
03
0E
38
E0
E0
38
0E
03
ENDCHAR
STARTCHAR equal
ENCODING 61
SWIDTH 606 0
DWIDTH 10 0
BBX 8 5 1 2
BITMAP
FF
FF
00
FF
FF
ENDCHAR
STARTCHAR greater
ENCODING 62
SWIDTH 606 0
DWIDTH 10 0
BBX 8 8 1 0
BITMAP
C0
70
1C
07
07
1C
70
C0
ENDCHAR
STARTCHAR question
ENCODING 63
SWIDTH 481 0
DWIDTH 8 0
BBX 7 12 1 0
BITMAP
3C
46
8E
9E
3C
70
44
38
00
60
F0
60
ENDCHAR
STARTCHAR at
ENCODING 64
SWIDTH 747 0
DWIDTH 12 0
BBX 12 12 0 0
BITMAP
0F80
38E0
2020
66B0
CD90
9990
9990
9130
DB60
6C90
7060
1FC0
ENDCHAR
STARTCHAR A
ENCODING 65
SWIDTH 741 0
DWIDTH 12 0
BBX 13 12 -1 0
BITMAP
0180
0180
0380
0380
05C0
0DC0
09C0
1FC0
30E0
20E0
60E0
FBF8
ENDCHAR
STARTCHAR B
ENCODING 66
SWIDTH 759 0
DWIDTH 13 0
BBX 13 12 -1 0
BITMAP
3FF0
0E38
0E38
0E38
1C70
1FC0
1CE0
1C70
3870
3870
38E0
FFC0
ENDCHAR
STARTCHAR C
ENCODING 67
SWIDTH 759 0
DWIDTH 13 0
BBX 12 12 1 0
BITMAP
07D0
1C70
3820
7020
7020
E000
E000
E000
E020
6040
7080
1F00
ENDCHAR
STARTCHAR D
ENCODING 68
SWIDTH 833 0
DWIDTH 14 0
BBX 14 12 -1 0
BITMAP
3FE0
0E38
0E18
0E1C
1C1C
1C1C
1C1C
1C38
3838
3870
38E0
FF80
ENDCHAR
STARTCHAR E
ENCODING 69
SWIDTH 741 0
DWIDTH 12 0
BBX 13 12 -1 0
BITMAP
3FF8
0E18
0E10
0E50
1CC0
1F80
1D80
1C90
3830
3820
3860
FFE0
ENDCHAR
STARTCHAR F
ENCODING 70
SWIDTH 704 0
DWIDTH 12 0
BBX 13 12 -1 0
BITMAP
3FF8
0E18
0E10
0E50
1CC0
1F80
1D80
1C80
3800
3800
3800
FE00
ENDCHAR
STARTCHAR G
ENCODING 71
SWIDTH 815 0
DWIDTH 14 0
BBX 13 12 1 0
BITMAP
07D0
1C70
3820
7020
7000
E000
E3F8
E0E0
E0E0
61C0
71C0
1E40
ENDCHAR
STARTCHAR H
ENCODING 72
SWIDTH 870 0
DWIDTH 14 0
BBX 16 12 -1 0
BITMAP
3FBF
0E1C
0E1C
0E1C
1C38
1FF8
1C38
1C38
3870
3870
3870
FDFC
ENDCHAR
STARTCHAR I
ENCODING 73
SWIDTH 444 0
DWIDTH 7 0
BBX 9 12 -1 0
BITMAP
3F80
0E00
0E00
0E00
1C00
1C00
1C00
1C00
3800
3800
3800
FE00
ENDCHAR
STARTCHAR J
ENCODING 74
SWIDTH 667 0
DWIDTH 11 0
BBX 12 12 0 0
BITMAP
07F0
01C0
01C0
01C0
0380
0380
0380
6380
F700
E700
8600
7C00
ENDCHAR
STARTCHAR K
ENCODING 75
SWIDTH 778 0
DWIDTH 13 0
BBX 15 12 -1 0
BITMAP
3FBE
0E18
0E30
0E60
1CC0
1FC0
1FC0
1CE0
38E0
3870
3870
FDFC
ENDCHAR
STARTCHAR L
ENCODING 76
SWIDTH 704 0
DWIDTH 12 0
BBX 12 12 -1 0
BITMAP
3F80
0E00
0E00
0E00
1C00
1C00
1C00
1C10
3830
3820
38E0
FFE0
ENDCHAR
STARTCHAR M
ENCODING 77
SWIDTH 944 0
DWIDTH 16 0
BBX 19 12 -2 0
BITMAP
1F07E0
070780
070F80
070F80
0F9700
0B9700
0BA700
19E700
11CE00
118E00
318E00
FD3F80
ENDCHAR
STARTCHAR N
ENCODING 78
SWIDTH 852 0
DWIDTH 14 0
BBX 16 12 -1 0
BITMAP
3E1F
0F04
0F04
0B8C
1B88
11C8
11D8
10F0
30F0
2070
2060
F820
ENDCHAR
STARTCHAR O
ENCODING 79
SWIDTH 833 0
DWIDTH 14 0
BBX 13 12 1 0
BITMAP
07C0
1C70
3830
7038
7038
E038
E038
E070
E070
60E0
71C0
1F00
ENDCHAR
STARTCHAR P
ENCODING 80
SWIDTH 741 0
DWIDTH 12 0
BBX 13 12 -1 0
BITMAP
3FF0
0E38
0E18
0E38
1C38
1C70
1FC0
1C00
3800
3800
3800
FE00
ENDCHAR
STARTCHAR Q
ENCODING 81
SWIDTH 833 0
DWIDTH 14 0
BBX 13 15 1 -3
BITMAP
07C0
1C70
3830
7038
7038
E038
E038
E630
E970
71E0
71C0
1FC0
01D0
01D0
00E0
ENDCHAR
STARTCHAR R
ENCODING 82
SWIDTH 796 0
DWIDTH 14 0
BBX 14 12 -1 0
BITMAP
3FF8
0E1C
0E1C
0E3C
1C78
1FE0
1C60
1C70
38F0
38F4
38E4
FE78
ENDCHAR
STARTCHAR S
ENCODING 83
SWIDTH 685 0
DWIDTH 11 0
BBX 11 12 0 0
BITMAP
0FA0
18C0
30C0
3040
3C00
3F80
1FC0
43C0
40C0
60C0
F180
9F00
ENDCHAR
STARTCHAR T
ENCODING 84
SWIDTH 722 0
DWIDTH 12 0
BBX 13 12 0 0
BITMAP
7FF8
6738
C710
8710
8E10
0E00
0E00
0E00
1C00
1C00
1C00
7F00
ENDCHAR
STARTCHAR U
ENCODING 85
SWIDTH 833 0
DWIDTH 14 0
BBX 14 12 1 0
BITMAP
FEFC
3830
3830
7020
7020
7060
7040
E040
E040
E0C0
7180
3E00
ENDCHAR
STARTCHAR V
ENCODING 86
SWIDTH 741 0
DWIDTH 12 0
BBX 14 12 0 0
BITMAP
FEFC
3830
3860
3840
1CC0
1C80
1D80
1D00
0E00
0E00
0C00
0C00
ENDCHAR
STARTCHAR W
ENCODING 87
SWIDTH 944 0
DWIDTH 16 0
BBX 18 12 0 0
BITMAP
FDF7C0
38E300
38E200
38E600
39E400
39EC00
1A6800
1E7800
1C7000
1C7000
186000
186000
ENDCHAR
STARTCHAR X
ENCODING 88
SWIDTH 741 0
DWIDTH 12 0
BBX 15 12 -2 0
BITMAP
3FBE
0E18
0E30
0760
07C0
0380
0380
07C0
0DC0
18E0
30E0
FBF8
ENDCHAR
STARTCHAR Y
ENCODING 89
SWIDTH 704 0
DWIDTH 12 0
BBX 13 12 0 0
BITMAP
FEF8
3830
3860
1CC0
1D80
1F00
0E00
0E00
1C00
1C00
1C00
7F00
ENDCHAR
STARTCHAR Z
ENCODING 90
SWIDTH 704 0
DWIDTH 12 0
BBX 13 12 -1 0
BITMAP
1FF8
1CF0
30E0
21C0
0380
0700
0F00
1E10
1C30
3860
71E0
FFE0
ENDCHAR
STARTCHAR bracketleft
ENCODING 91
SWIDTH 407 0
DWIDTH 7 0
BBX 7 14 0 -2
BITMAP
1E
18
18
30
30
30
30
60
60
60
60
C0
C0
F0
ENDCHAR
STARTCHAR backslash
ENCODING 92
SWIDTH 606 0
DWIDTH 10 0
BBX 8 12 1 0
BITMAP
C0
40
60
20
30
10
18
0C
04
06
02
03
ENDCHAR
STARTCHAR bracketright
ENCODING 93
SWIDTH 407 0
DWIDTH 7 0
BBX 7 14 -1 -2
BITMAP
1E
06
06
0C
0C
0C
0C
18
18
18
18
30
30
F0
ENDCHAR
STARTCHAR asciicircum
ENCODING 94
SWIDTH 606 0
DWIDTH 10 0
BBX 8 7 1 5
BITMAP
18
18
3C
24
66
42
C3
ENDCHAR
STARTCHAR underscore
ENCODING 95
SWIDTH 500 0
DWIDTH 8 0
BBX 8 2 -1 -3
BITMAP
FF
FF
ENDCHAR
STARTCHAR quoteleft
ENCODING 96
SWIDTH 259 0
DWIDTH 4 0
BBX 4 6 0 6
BITMAP
10
20
40
E0
F0
60
ENDCHAR
STARTCHAR a
ENCODING 97
SWIDTH 667 0
DWIDTH 11 0
BBX 10 8 0 0
BITMAP
1DC0
7780
6380
E380
C300
C700
EF40
7B80
ENDCHAR
STARTCHAR b
ENCODING 98
SWIDTH 611 0
DWIDTH 10 0
BBX 9 12 0 0
BITMAP
7800
3800
3000
3000
7700
7B80
7180
E180
E380
C300
CE00
7800
ENDCHAR
STARTCHAR c
ENCODING 99
SWIDTH 537 0
DWIDTH 9 0
BBX 8 8 1 0
BITMAP
1E
73
67
E2
C0
C0
E4
78
ENDCHAR
STARTCHAR d
ENCODING 100
SWIDTH 667 0
DWIDTH 11 0
BBX 11 12 0 0
BITMAP
01E0
00E0
00C0
01C0
1D80
7780
6380
E380
C300
C700
E740
7B80
ENDCHAR
STARTCHAR e
ENCODING 101
SWIDTH 519 0
DWIDTH 9 0
BBX 8 8 1 0
BITMAP
1E
77
63
CE
FC
C0
E2
7C
ENDCHAR
STARTCHAR f
ENCODING 102
SWIDTH 389 0
DWIDTH 6 0
BBX 10 15 -1 -3
BITMAP
0380
06C0
0CC0
0C00
3F00
1C00
1800
1800
3800
3000
3000
7000
6000
6000
E000
ENDCHAR
STARTCHAR g
ENCODING 103
SWIDTH 611 0
DWIDTH 10 0
BBX 11 12 -1 -3
BITMAP
0060
07A0
1CC0
38E0
38E0
19C0
3F00
6000
3F00
7F80
C180
7F00
ENDCHAR
STARTCHAR h
ENCODING 104
SWIDTH 685 0
DWIDTH 11 0
BBX 10 12 0 0
BITMAP
3C00
1C00
1800
3800
3380
35C0
39C0
7980
7380
6300
E740
E380
ENDCHAR
STARTCHAR i
ENCODING 105
SWIDTH 389 0
DWIDTH 6 0
BBX 6 12 0 0
BITMAP
18
3C
18
00
78
38
30
70
70
E0
E8
70
ENDCHAR
STARTCHAR j
ENCODING 106
SWIDTH 370 0
DWIDTH 6 0
BBX 9 15 -3 -3
BITMAP
0300
0780
0300
0000
0F00
0700
0600
0600
0E00
0E00
0C00
0C00
CC00
D800
7000
ENDCHAR
STARTCHAR k
ENCODING 107
SWIDTH 648 0
DWIDTH 11 0
BBX 10 12 0 0
BITMAP
1E00
0E00
0C00
1C00
1B80
1CC0
39C0
3180
7E00
7700
6340
E380
ENDCHAR
STARTCHAR l
ENCODING 108
SWIDTH 389 0
DWIDTH 6 0
BBX 6 12 0 0
BITMAP
3C
1C
18
38
30
30
70
70
60
E0
E8
70
ENDCHAR
STARTCHAR m
ENCODING 109
SWIDTH 944 0
DWIDTH 15 0
BBX 15 8 -1 0
BITMAP
739C
35EE
39CE
318C
739C
6318
633A
E71C
ENDCHAR
STARTCHAR n
ENCODING 110
SWIDTH 685 0
DWIDTH 11 0
BBX 10 8 0 0
BITMAP
7380
35C0
39C0
7180
7380
6300
E740
E380
ENDCHAR
STARTCHAR o
ENCODING 111
SWIDTH 574 0
DWIDTH 10 0
BBX 9 8 0 0
BITMAP
1E00
7300
6380
E180
C380
E300
6700
3C00
ENDCHAR
STARTCHAR p
ENCODING 112
SWIDTH 648 0
DWIDTH 11 0
BBX 11 11 -1 -3
BITMAP
3DC0
1EE0
1C60
1860
38E0
38C0
3DC0
7700
6000
6000
F000
ENDCHAR
STARTCHAR q
ENCODING 113
SWIDTH 630 0
DWIDTH 10 0
BBX 10 11 0 -3
BITMAP
1EC0
7380
6180
E380
C300
C700
EF00
7A00
0600
0600
0F00
ENDCHAR
STARTCHAR r
ENCODING 114
SWIDTH 519 0
DWIDTH 9 0
BBX 9 8 0 0
BITMAP
3B80
1D80
3980
3800
3000
7000
6000
E000
ENDCHAR
STARTCHAR s
ENCODING 115
SWIDTH 481 0
DWIDTH 8 0
BBX 8 8 0 0
BITMAP
1E
73
63
7C
3E
C6
CE
78
ENDCHAR
STARTCHAR t
ENCODING 116
SWIDTH 407 0
DWIDTH 7 0
BBX 6 11 1 0
BITMAP
18
18
30
FC
70
60
60
E0
C8
D0
E0
ENDCHAR
STARTCHAR u
ENCODING 117
SWIDTH 685 0
DWIDTH 11 0
BBX 10 8 0 0
BITMAP
79C0
39C0
3180
7380
6300
E700
EB40
7380
ENDCHAR
STARTCHAR v
ENCODING 118
SWIDTH 556 0
DWIDTH 9 0
BBX 7 8 1 0
BITMAP
F6
66
62
E6
C6
C4
CC
78
ENDCHAR
STARTCHAR w
ENCODING 119
SWIDTH 833 0
DWIDTH 14 0
BBX 13 8 0 0
BITMAP
79D8
39D8
3188
7398
6710
E730
EB60
73C0
ENDCHAR
STARTCHAR x
ENCODING 120
SWIDTH 574 0
DWIDTH 9 0
BBX 10 8 -1 0
BITMAP
39C0
5AC0
1E00
0C00
0C00
1E00
D680
E700
ENDCHAR
STARTCHAR y
ENCODING 121
SWIDTH 519 0
DWIDTH 9 0
BBX 9 11 -1 -3
BITMAP
3180
7980
B880
1D80
1D00
0E00
0C00
0C00
C800
D000
6000
ENDCHAR
STARTCHAR z
ENCODING 122
SWIDTH 519 0
DWIDTH 9 0
BBX 8 8 0 0
BITMAP
39
7F
46
0C
38
61
FE
9C
ENDCHAR
STARTCHAR braceleft
ENCODING 123
SWIDTH 407 0
DWIDTH 7 0
BBX 6 14 1 -2
BITMAP
0C
10
18
38
30
20
C0
20
60
60
60
C0
80
60
ENDCHAR
STARTCHAR bar
ENCODING 124
SWIDTH 606 0
DWIDTH 10 0
BBX 1 12 5 0
BITMAP
80
80
80
80
80
80
80
80
80
80
80
80
ENDCHAR
STARTCHAR braceright
ENCODING 125
SWIDTH 407 0
DWIDTH 7 0
BBX 6 14 0 -2
BITMAP
18
04
0C
18
18
18
10
0C
30
30
30
20
20
C0
ENDCHAR
STARTCHAR asciitilde
ENCODING 126
SWIDTH 606 0
DWIDTH 10 0
BBX 8 3 1 3
BITMAP
71
FF
8E
ENDCHAR
STARTCHAR Aogonek
ENCODING 161
SWIDTH 741 0
DWIDTH 12 0
BBX 13 15 -1 -3
BITMAP
0180
0180
0380
0380
05C0
0DC0
09C0
1FC0
30E0
20E0
60E0
FBF8
0020
0040
0070
ENDCHAR
STARTCHAR breve
ENCODING 162
SWIDTH 531 0
DWIDTH 9 0
BBX 5 3 2 9
BITMAP
88
88
70
ENDCHAR
STARTCHAR Lslash
ENCODING 163
SWIDTH 704 0
DWIDTH 12 0
BBX 12 12 -1 0
BITMAP
3F80
0E00
0E00
0E00
1C80
1F00
7C00
9C10
3830
3860
38E0
FFE0
ENDCHAR
STARTCHAR currency
ENCODING 164
SWIDTH 574 0
DWIDTH 10 0
BBX 8 8 1 2
BITMAP
5A
FF
66
C3
C3
66
FF
5A
ENDCHAR
STARTCHAR Lcaron
ENCODING 165
SWIDTH 704 0
DWIDTH 12 0
BBX 13 12 -1 0
BITMAP
3F90
0E38
0E18
0E10
1C10
1C20
1C00
1C10
3830
3820
38E0
FFE0
ENDCHAR
STARTCHAR Sacute
ENCODING 166
SWIDTH 685 0
DWIDTH 11 0
BBX 11 16 0 0
BITMAP
0060
00C0
0100
0000
0FA0
18C0
30C0
3040
3C00
3F80
1FC0
43C0
40C0
60C0
F180
9F00
ENDCHAR
STARTCHAR section
ENCODING 167
SWIDTH 500 0
DWIDTH 9 0
BBX 10 15 -1 -3
BITMAP
0780
08C0
19C0
1C80
0E00
3F00
6380
6180
7180
3F00
1C00
4E00
E600
C400
7800
ENDCHAR
STARTCHAR dieresis
ENCODING 168
SWIDTH 333 0
DWIDTH 6 0
BBX 5 2 1 9
BITMAP
D8
D8
ENDCHAR
STARTCHAR Scaron
ENCODING 169
SWIDTH 685 0
DWIDTH 11 0
BBX 11 16 0 0
BITMAP
0660
03C0
0180
0000
0FA0
18C0
30C0
3040
3C00
3F80
1FC0
43C0
40C0
60C0
F180
9F00
ENDCHAR
STARTCHAR Scedilla
ENCODING 170
SWIDTH 685 0
DWIDTH 11 0
BBX 11 15 0 -3
BITMAP
0FA0
18C0
30C0
3040
3C00
3F80
1FC0
43C0
40C0
60C0
F180
9F00
1800
0C00
3800
ENDCHAR
STARTCHAR Tcaron
ENCODING 171
SWIDTH 722 0
DWIDTH 12 0
BBX 13 16 0 0
BITMAP
0CC0
0780
0300
0000
7FF8
6738
C710
8710
8E10
0E00
0E00
0E00
1C00
1C00
1C00
7F00
ENDCHAR
STARTCHAR Zacute
ENCODING 172
SWIDTH 704 0
DWIDTH 12 0
BBX 13 16 -1 0
BITMAP
0030
0060
0080
0000
1FF8
1CF0
30E0
21C0
0380
0700
0F00
1E10
1C30
3860
71E0
FFE0
ENDCHAR
STARTCHAR hyphen
ENCODING 173
SWIDTH 333 0
DWIDTH 5 0
BBX 4 2 0 3
BITMAP
F0
F0
ENDCHAR
STARTCHAR Zcaron
ENCODING 174
SWIDTH 704 0
DWIDTH 12 0
BBX 13 16 -1 0
BITMAP
0660
03C0
0180
0000
1FF8
1CF0
30E0
21C0
0380
0700
0F00
1E10
1C30
3860
71E0
FFE0
ENDCHAR
STARTCHAR Zdotaccent
ENCODING 175
SWIDTH 704 0
DWIDTH 12 0
BBX 13 15 -1 0
BITMAP
0180
0180
0000
1FF8
1CF0
30E0
21C0
0380
0700
0F00
1E10
1C30
3860
71E0
FFE0
ENDCHAR
STARTCHAR degree
ENCODING 176
SWIDTH 400 0
DWIDTH 7 0
BBX 5 5 2 7
BITMAP
70
D8
88
D8
70
ENDCHAR
STARTCHAR aogonek
ENCODING 177
SWIDTH 667 0
DWIDTH 11 0
BBX 10 11 0 -3
BITMAP
1DC0
7780
6380
E380
C300
C700
EF40
7B80
0080
0100
01C0
ENDCHAR
STARTCHAR ogonek
ENCODING 178
SWIDTH 531 0
DWIDTH 9 0
BBX 3 3 3 -3
BITMAP
40
80
E0
ENDCHAR
STARTCHAR lslash
ENCODING 179
SWIDTH 389 0
DWIDTH 6 0
BBX 8 12 -1 0
BITMAP
3E
0E
0C
1C
1F
F8
38
38
30
72
74
38
ENDCHAR
STARTCHAR acute
ENCODING 180
SWIDTH 333 0
DWIDTH 6 0
BBX 4 3 2 9
BITMAP
30
60
80
ENDCHAR
STARTCHAR lcaron
ENCODING 181
SWIDTH 583 0
DWIDTH 9 0
BBX 11 12 0 0
BITMAP
3C40
1CE0
1860
3840
3040
3080
7000
7000
6000
E000
E800
7000
ENDCHAR
STARTCHAR sacute
ENCODING 182
SWIDTH 481 0
DWIDTH 8 0
BBX 9 12 0 0
BITMAP
0180
0300
0400
0000
1E00
7300
6300
7C00
3E00
C600
CE00
7800
ENDCHAR
STARTCHAR caron
ENCODING 183
SWIDTH 590 0
DWIDTH 10 0
BBX 6 3 2 9
BITMAP
CC
78
30
ENDCHAR
STARTCHAR cedilla
ENCODING 184
SWIDTH 590 0
DWIDTH 10 0
BBX 4 4 3 -3
BITMAP
60
60
30
E0
ENDCHAR
STARTCHAR scaron
ENCODING 185
SWIDTH 481 0
DWIDTH 8 0
BBX 8 12 0 0
BITMAP
33
1E
0C
00
1E
73
63
7C
3E
C6
CE
78
ENDCHAR
STARTCHAR scedilla
ENCODING 186
SWIDTH 481 0
DWIDTH 8 0
BBX 8 11 0 -3
BITMAP
1E
73
63
7C
3E
C6
CE
78
30
18
70
ENDCHAR
STARTCHAR tcaron
ENCODING 187
SWIDTH 407 0
DWIDTH 7 0
BBX 9 14 1 0
BITMAP
0100
0380
0180
1900
1900
3200
FC00
7000
6000
6000
E000
C800
D000
E000
ENDCHAR
STARTCHAR zacute
ENCODING 188
SWIDTH 519 0
DWIDTH 9 0
BBX 9 12 0 0
BITMAP
0180
0300
0400
0000
3900
7F00
4600
0C00
3800
6100
FE00
9C00
ENDCHAR
STARTCHAR hungarumlaut
ENCODING 189
SWIDTH 649 0
DWIDTH 11 0
BBX 7 3 2 9
BITMAP
36
6C
90
ENDCHAR
STARTCHAR zcaron
ENCODING 190
SWIDTH 519 0
DWIDTH 9 0
BBX 8 12 0 0
BITMAP
33
1E
0C
00
39
7F
46
0C
38
61
FE
9C
ENDCHAR
STARTCHAR zdotaccent
ENCODING 191
SWIDTH 519 0
DWIDTH 9 0
BBX 8 11 0 0
BITMAP
0C
0C
00
39
7F
46
0C
38
61
FE
9C
ENDCHAR
STARTCHAR Racute
ENCODING 192
SWIDTH 796 0
DWIDTH 14 0
BBX 14 16 -1 0
BITMAP
0060
00C0
0100
0000
3FF8
0E1C
0E1C
0E3C
1C78
1FE0
1C60
1C70
38F0
38F4
38E4
FE78
ENDCHAR
STARTCHAR Aacute
ENCODING 193
SWIDTH 741 0
DWIDTH 12 0
BBX 13 16 -1 0
BITMAP
0060
00C0
0100
0000
0180
0180
0380
0380
05C0
0DC0
09C0
1FC0
30E0
20E0
60E0
FBF8
ENDCHAR
STARTCHAR Acircumflex
ENCODING 194
SWIDTH 741 0
DWIDTH 12 0
BBX 13 16 -1 0
BITMAP
0180
03C0
0660
0000
0180
0180
0380
0380
05C0
0DC0
09C0
1FC0
30E0
20E0
60E0
FBF8
ENDCHAR
STARTCHAR Abreve
ENCODING 195
SWIDTH 741 0
DWIDTH 12 0
BBX 13 16 -1 0
BITMAP
0220
0220
01C0
0000
0180
0180
0380
0380
05C0
0DC0
09C0
1FC0
30E0
20E0
60E0
FBF8
ENDCHAR
STARTCHAR Adieresis
ENCODING 196
SWIDTH 741 0
DWIDTH 12 0
BBX 13 15 -1 0
BITMAP
0660
0660
0000
0180
0180
0380
0380
05C0
0DC0
09C0
1FC0
30E0
20E0
60E0
FBF8
ENDCHAR
STARTCHAR Lacute
ENCODING 197
SWIDTH 704 0
DWIDTH 12 0
BBX 12 16 -1 0
BITMAP
0180
0300
0400
0000
3F80
0E00
0E00
0E00
1C00
1C00
1C00
1C10
3830
3820
38E0
FFE0
ENDCHAR
STARTCHAR Cacute
ENCODING 198
SWIDTH 759 0
DWIDTH 13 0
BBX 12 16 1 0
BITMAP
0030
0060
0080
0000
07D0
1C70
3820
7020
7020
E000
E000
E000
E020
6040
7080
1F00
ENDCHAR
STARTCHAR Ccedilla
ENCODING 199
SWIDTH 759 0
DWIDTH 13 0
BBX 12 15 1 -3
BITMAP
07D0
1C70
3820
7020
7020
E000
E000
E000
E020
6040
7080
1F00
0C00
0600
1C00
ENDCHAR
STARTCHAR Ccaron
ENCODING 200
SWIDTH 759 0
DWIDTH 13 0
BBX 12 16 1 0
BITMAP
0330
01E0
00C0
0000
07D0
1C70
3820
7020
7020
E000
E000
E000
E020
6040
7080
1F00
ENDCHAR
STARTCHAR Eacute
ENCODING 201
SWIDTH 741 0
DWIDTH 12 0
BBX 13 16 -1 0
BITMAP
0060
00C0
0100
0000
3FF8
0E18
0E10
0E50
1CC0
1F80
1D80
1C90
3830
3820
3860
FFE0
ENDCHAR
STARTCHAR Eogonek
ENCODING 202
SWIDTH 741 0
DWIDTH 12 0
BBX 13 15 -1 -3
BITMAP
3FF8
0E18
0E10
0E50
1CC0
1F80
1D80
1C90
3830
3820
3860
FFE0
0040
0080
00E0
ENDCHAR
STARTCHAR Edieresis
ENCODING 203
SWIDTH 741 0
DWIDTH 12 0
BBX 13 15 -1 0
BITMAP
0660
0660
0000
3FF8
0E18
0E10
0E50
1CC0
1F80
1D80
1C90
3830
3820
3860
FFE0
ENDCHAR
STARTCHAR Ecaron
ENCODING 204
SWIDTH 741 0
DWIDTH 12 0
BBX 13 16 -1 0
BITMAP
0660
03C0
0180
0000
3FF8
0E18
0E10
0E50
1CC0
1F80
1D80
1C90
3830
3820
3860
FFE0
ENDCHAR
STARTCHAR Iacute
ENCODING 205
SWIDTH 444 0
DWIDTH 7 0
BBX 9 16 -1 0
BITMAP
0180
0300
0400
0000
3F80
0E00
0E00
0E00
1C00
1C00
1C00
1C00
3800
3800
3800
FE00
ENDCHAR
STARTCHAR Icircumflex
ENCODING 206
SWIDTH 444 0
DWIDTH 7 0
BBX 9 16 -1 0
BITMAP
0600
0F00
1980
0000
3F80
0E00
0E00
0E00
1C00
1C00
1C00
1C00
3800
3800
3800
FE00
ENDCHAR
STARTCHAR Dcaron
ENCODING 207
SWIDTH 833 0
DWIDTH 14 0
BBX 14 16 -1 0
BITMAP
0660
03C0
0180
0000
3FE0
0E38
0E18
0E1C
1C1C
1C1C
1C1C
1C38
3838
3870
38E0
FF80
ENDCHAR
STARTCHAR Eth
ENCODING 208
SWIDTH 833 0
DWIDTH 14 0
BBX 14 12 -1 0
BITMAP
3FE0
0E38
0E18
0E1C
1C1C
7F1C
1C1C
1C38
3838
3870
38E0
FF80
ENDCHAR
STARTCHAR Nacute
ENCODING 209
SWIDTH 852 0
DWIDTH 14 0
BBX 16 16 -1 0
BITMAP
0018
0030
0040
0000
3E1F
0F04
0F04
0B8C
1B88
11C8
11D8
10F0
30F0
2070
2060
F820
ENDCHAR
STARTCHAR Ncaron
ENCODING 210
SWIDTH 852 0
DWIDTH 14 0
BBX 16 16 -1 0
BITMAP
0198
00F0
0060
0000
3E1F
0F04
0F04
0B8C
1B88
11C8
11D8
10F0
30F0
2070
2060
F820
ENDCHAR
STARTCHAR Oacute
ENCODING 211
SWIDTH 833 0
DWIDTH 14 0
BBX 13 16 1 0
BITMAP
0060
00C0
0100
0000
07C0
1C70
3830
7038
7038
E038
E038
E070
E070
60E0
71C0
1F00
ENDCHAR
STARTCHAR Ocircumflex
ENCODING 212
SWIDTH 833 0
DWIDTH 14 0
BBX 13 16 1 0
BITMAP
0180
03C0
0660
0000
07C0
1C70
3830
7038
7038
E038
E038
E070
E070
60E0
71C0
1F00
ENDCHAR
STARTCHAR Ohungarumlaut
ENCODING 213
SWIDTH 833 0
DWIDTH 14 0
BBX 13 16 1 0
BITMAP
00D8
01B0
0240
0000
07C0
1C70
3830
7038
7038
E038
E038
E070
E070
60E0
71C0
1F00
ENDCHAR
STARTCHAR Odieresis
ENCODING 214
SWIDTH 833 0
DWIDTH 14 0
BBX 13 15 1 0
BITMAP
0660
0660
0000
07C0
1C70
3830
7038
7038
E038
E038
E070
E070
60E0
71C0
1F00
ENDCHAR
STARTCHAR multiply
ENCODING 215
SWIDTH 606 0
DWIDTH 10 0
BBX 8 8 1 0
BITMAP
42
E7
7E
1C
38
7E
E7
42
ENDCHAR
STARTCHAR Rcaron
ENCODING 216
SWIDTH 796 0
DWIDTH 14 0
BBX 14 16 -1 0
BITMAP
0330
01E0
00C0
0000
3FF8
0E1C
0E1C
0E3C
1C78
1FE0
1C60
1C70
38F0
38F4
38E4
FE78
ENDCHAR
STARTCHAR Uring
ENCODING 217
SWIDTH 833 0
DWIDTH 14 0
BBX 14 16 1 0
BITMAP
0300
0480
0480
0300
FEFC
3830
3830
7020
7020
7060
7040
E040
E040
E0C0
7180
3E00
ENDCHAR
STARTCHAR Uacute
ENCODING 218
SWIDTH 833 0
DWIDTH 14 0
BBX 14 16 1 0
BITMAP
0060
00C0
0100
0000
FEFC
3830
3830
7020
7020
7060
7040
E040
E040
E0C0
7180
3E00
ENDCHAR
STARTCHAR Uhungarumlaut
ENCODING 219
SWIDTH 833 0
DWIDTH 14 0
BBX 14 16 1 0
BITMAP
01B0
0360
0480
0000
FEFC
3830
3830
7020
7020
7060
7040
E040
E040
E0C0
7180
3E00
ENDCHAR
STARTCHAR Udieresis
ENCODING 220
SWIDTH 833 0
DWIDTH 14 0
BBX 14 15 1 0
BITMAP
0660
0660
0000
FEFC
3830
3830
7020
7020
7060
7040
E040
E040
E0C0
7180
3E00
ENDCHAR
STARTCHAR Yacute
ENCODING 221
SWIDTH 704 0
DWIDTH 12 0
BBX 13 16 0 0
BITMAP
0060
00C0
0100
0000
FEF8
3830
3860
1CC0
1D80
1F00
0E00
0E00
1C00
1C00
1C00
7F00
ENDCHAR
STARTCHAR Tcedilla
ENCODING 222
SWIDTH 722 0
DWIDTH 12 0
BBX 13 15 0 -3
BITMAP
7FF8
6738
C710
8710
8E10
0E00
0E00
0E00
1C00
1C00
1C00
7F00
0C00
0600
1C00
ENDCHAR
STARTCHAR germandbls
ENCODING 223
SWIDTH 574 0
DWIDTH 10 0
BBX 10 15 -1 -3
BITMAP
0780
0CC0
0CC0
18C0
1980
1B00
1980
39C0
31C0
31C0
3180
7700
7000
6000
E000
ENDCHAR
STARTCHAR racute
ENCODING 224
SWIDTH 519 0
DWIDTH 9 0
BBX 9 12 0 0
BITMAP
0180
0300
0400
0000
3B80
1D80
3980
3800
3000
7000
6000
E000
ENDCHAR
STARTCHAR aacute
ENCODING 225
SWIDTH 667 0
DWIDTH 11 0
BBX 11 12 0 0
BITMAP
0180
0300
0400
0000
1DC0
7780
6380
E380
C300
C720
EF40
7B80
ENDCHAR
STARTCHAR acircumflex
ENCODING 226
SWIDTH 667 0
DWIDTH 11 0
BBX 11 12 0 0
BITMAP
0600
0F00
1980
0000
1DC0
7780
6380
E380
C300
C720
EF40
7B80
ENDCHAR
STARTCHAR abreve
ENCODING 227
SWIDTH 667 0
DWIDTH 11 0
BBX 10 12 0 0
BITMAP
0880
0880
0700
0000
1DC0
7780
6380
E380
C300
C700
EF40
7B80
ENDCHAR
STARTCHAR adieresis
ENCODING 228
SWIDTH 667 0
DWIDTH 11 0
BBX 11 11 0 0
BITMAP
1B00
1B00
0000
1DC0
7780
6380
E380
C300
C720
EF40
7B80
ENDCHAR
STARTCHAR lacute
ENCODING 229
SWIDTH 389 0
DWIDTH 6 0
BBX 8 16 0 0
BITMAP
03
06
08
00
3C
1C
18
38
30
30
70
70
60
E0
E8
70
ENDCHAR
STARTCHAR cacute
ENCODING 230
SWIDTH 537 0
DWIDTH 9 0
BBX 9 12 1 0
BITMAP
0180
0300
0400
0000
1E00
7300
6700
E200
C000
C000
E400
7800
ENDCHAR
STARTCHAR ccedilla
ENCODING 231
SWIDTH 537 0
DWIDTH 9 0
BBX 8 11 0 -3
BITMAP
1E
73
67
E2
C0
C2
E4
78
30
18
70
ENDCHAR
STARTCHAR ccaron
ENCODING 232
SWIDTH 537 0
DWIDTH 9 0
BBX 8 12 1 0
BITMAP
33
1E
0C
00
1E
73
67
E2
C0
C0
E4
78
ENDCHAR
STARTCHAR eacute
ENCODING 233
SWIDTH 519 0
DWIDTH 9 0
BBX 8 12 1 0
BITMAP
03
06
08
00
1E
77
63
CE
FC
C0
E2
7C
ENDCHAR
STARTCHAR eogonek
ENCODING 234
SWIDTH 519 0
DWIDTH 9 0
BBX 8 11 1 -3
BITMAP
1E
77
63
CE
FC
C0
E2
7C
20
40
70
ENDCHAR
STARTCHAR edieresis
ENCODING 235
SWIDTH 519 0
DWIDTH 9 0
BBX 8 11 1 0
BITMAP
1B
1B
00
1E
77
63
CE
F8
C0
E2
7C
ENDCHAR
STARTCHAR ecaron
ENCODING 236
SWIDTH 519 0
DWIDTH 9 0
BBX 8 12 1 0
BITMAP
33
1E
0C
00
1E
77
63
CE
FC
C0
E2
7C
ENDCHAR
STARTCHAR iacute
ENCODING 237
SWIDTH 389 0
DWIDTH 6 0
BBX 6 12 0 0
BITMAP
0C
18
20
00
78
38
30
70
60
EC
E8
70
ENDCHAR
STARTCHAR icircumflex
ENCODING 238
SWIDTH 389 0
DWIDTH 6 0
BBX 6 12 0 0
BITMAP
30
78
CC
00
78
38
30
70
60
EC
E8
70
ENDCHAR
STARTCHAR dcaron
ENCODING 239
SWIDTH 727 0
DWIDTH 12 0
BBX 14 12 0 0
BITMAP
01E8
00FC
00CC
01C8
1D88
7790
6380
E380
C300
C700
E740
7B80
ENDCHAR
STARTCHAR dmacron
ENCODING 240
SWIDTH 667 0
DWIDTH 11 0
BBX 12 12 0 0
BITMAP
01E0
00E0
0FF0
01C0
1D80
7780
6380
E380
C300
C700
E740
7B80
ENDCHAR
STARTCHAR nacute
ENCODING 241
SWIDTH 685 0
DWIDTH 11 0
BBX 10 12 0 0
BITMAP
0180
0300
0400
0000
7380
35C0
39C0
7180
7380
6300
E740
E380
ENDCHAR
STARTCHAR ncaron
ENCODING 242
SWIDTH 685 0
DWIDTH 11 0
BBX 10 12 0 0
BITMAP
0CC0
0780
0300
0000
7380
35C0
39C0
7180
7380
6300
E740
E380
ENDCHAR
STARTCHAR oacute
ENCODING 243
SWIDTH 574 0
DWIDTH 10 0
BBX 9 12 0 0
BITMAP
0300
0600
0800
0000
1E00
7300
6380
E180
C380
E300
6700
3C00
ENDCHAR
STARTCHAR ocircumflex
ENCODING 244
SWIDTH 574 0
DWIDTH 10 0
BBX 9 12 0 0
BITMAP
0C00
1E00
3300
0000
1E00
7300
6380
E180
C380
E300
6700
3C00
ENDCHAR
STARTCHAR ohungarumlaut
ENCODING 245
SWIDTH 574 0
DWIDTH 10 0
BBX 10 12 0 0
BITMAP
06C0
0D80
1200
0000
1E00
7300
6380
E180
C380
E300
6700
3C00
ENDCHAR
STARTCHAR odieresis
ENCODING 246
SWIDTH 574 0
DWIDTH 10 0
BBX 9 11 0 0
BITMAP
3300
3300
0000
1E00
7300
6380
E180
C380
E300
6700
3C00
ENDCHAR
STARTCHAR divide
ENCODING 247
SWIDTH 606 0
DWIDTH 10 0
BBX 8 8 1 0
BITMAP
18
18
00
FF
FF
00
18
18
ENDCHAR
STARTCHAR rcaron
ENCODING 248
SWIDTH 519 0
DWIDTH 9 0
BBX 9 12 0 0
BITMAP
1980
0F00
0600
0000
3B80
1D80
3980
3800
3000
7000
6000
E000
ENDCHAR
STARTCHAR uring
ENCODING 249
SWIDTH 685 0
DWIDTH 11 0
BBX 10 13 0 0
BITMAP
0600
0900
0900
0600
0000
79C0
39C0
3180
7380
6300
E700
EB40
7380
ENDCHAR
STARTCHAR uacute
ENCODING 250
SWIDTH 685 0
DWIDTH 11 0
BBX 11 12 0 0
BITMAP
0180
0300
0400
0000
79C0
39C0
3180
7380
6300
E720
EB40
7380
ENDCHAR
STARTCHAR uhungarumlaut
ENCODING 251
SWIDTH 685 0
DWIDTH 11 0
BBX 11 12 0 0
BITMAP
0360
06C0
0900
0000
79C0
39C0
3180
7380
6300
E700
EB40
7380
ENDCHAR
STARTCHAR udieresis
ENCODING 252
SWIDTH 685 0
DWIDTH 11 0
BBX 11 11 0 0
BITMAP
1980
1980
0000
79C0
39C0
3180
7380
6300
E720
EB40
7380
ENDCHAR
STARTCHAR yacute
ENCODING 253
SWIDTH 519 0
DWIDTH 9 0
BBX 9 15 0 -3
BITMAP
0180
0300
0400
0000
3180
7980
B880
1D80
1D00
0E00
0C00
0C00
C800
D000
6000
ENDCHAR
STARTCHAR tcedilla
ENCODING 254
SWIDTH 407 0
DWIDTH 7 0
BBX 6 14 1 -3
BITMAP
18
18
30
FC
70
60
60
E0
C8
D0
E0
60
30
E0
ENDCHAR
STARTCHAR dotaccent
ENCODING 255
SWIDTH 472 0
DWIDTH 8 0
BBX 2 2 3 9
BITMAP
C0
C0
ENDCHAR
ENDFONT
