STARTFONT 2.1
COMMENT +
COMMENT  Copyright 1984-1989, 1994 Adobe Systems Incorporated.
COMMENT  Copyright 1988, 1994 Digital Equipment Corporation.
COMMENT  Copyright 1996 BIZNET Poland, Inc.
COMMENT
COMMENT  Permission to use, copy, modify, distribute and sell this software
COMMENT  and its documentation for any purpose and without fee is hereby
COMMENT  granted, provided that the above copyright notices appear in all
COMMENT  copies and that both those copyright notices and this permission
COMMENT  notice appear in supporting documentation, and that the names of
COMMENT  Adobe Systems and Digital Equipment Corporation not be used in
COMMENT  advertising or publicity pertaining to distribution of the software
COMMENT  without specific, written prior permission.  Adobe Systems and
COMMENT  Digital Equipment Corporation make no representations about the
COMMENT  suitability of this software for any purpose.  It is provided "as
COMMENT  is" without express or implied warranty.
COMMENT -
FONT -BIZNET-Courier-Medium-O-Normal--24-240-75-75-M-150-ISO8859-2
SIZE 24 75 75
FONTBOUNDINGBOX 16 21 -1 -5
STARTPROPERTIES 25
FOUNDRY "BIZNET"
FAMILY_NAME "Courier"
WEIGHT_NAME "Medium"
SLANT "O"
SETWIDTH_NAME "Normal"
ADD_STYLE_NAME ""
PIXEL_SIZE 24
POINT_SIZE 240
RESOLUTION_X 75
RESOLUTION_Y 75
SPACING "M"
AVERAGE_WIDTH 150
CHARSET_REGISTRY "ISO8859"
CHARSET_ENCODING "2"
CAP_HEIGHT 14
X_HEIGHT 11
FONT_ASCENT 19
FONT_DESCENT 5
FACE_NAME "Courier Oblique"
DEFAULT_CHAR 32
RELATIVE_SETWIDTH 50
RELATIVE_WEIGHT 50
CHARSET_COLLECTIONS "ASCII ISO8859-2"
COPYRIGHT "Copyright (c) 1984, 1987 Adobe Systems Incorporated. All Rights Reserved. Copyright (c) 1988, 1991 Digital Equipment Corporation. All Rights Reserved. Copyright (c) 1996 BIZNET Poland, Inc. All Rights Reserved."
NOTICE "The name "BIZNET" is a registered trademark of BIZNET Poland, Inc."
ENDPROPERTIES
CHARS 190
STARTCHAR space
ENCODING 32
SWIDTH 600 0
DWIDTH 15 0
BBX 1 1 0 0
BITMAP
00
ENDCHAR
STARTCHAR exclam
ENCODING 33
SWIDTH 600 0
DWIDTH 15 0
BBX 5 16 6 0
BITMAP
18
18
18
38
38
30
30
30
20
20
20
00
00
00
E0
E0
ENDCHAR
STARTCHAR quotedbl
ENCODING 34
SWIDTH 600 0
DWIDTH 15 0
BBX 8 7 6 8
BITMAP
E7
E7
C6
C6
C6
84
84
ENDCHAR
STARTCHAR numbersign
ENCODING 35
SWIDTH 600 0
DWIDTH 15 0
BBX 10 17 4 -1
BITMAP
0480
0480
0480
0900
0900
0900
7FC0
1200
1200
1200
FF80
2400
2400
2400
4800
4800
4800
ENDCHAR
STARTCHAR dollar
ENCODING 36
SWIDTH 600 0
DWIDTH 15 0
BBX 11 19 3 -2
BITMAP
0080
0080
0100
0FA0
18E0
3040
2000
2000
3000
1F80
00C0
0040
4040
40C0
E180
BF00
0800
1000
1000
ENDCHAR
STARTCHAR percent
ENCODING 37
SWIDTH 600 0
DWIDTH 15 0
BBX 11 16 3 0
BITMAP
0E00
1100
2100
2100
2100
2200
1C60
0380
1C00
E380
0440
0840
0840
0840
0880
0700
ENDCHAR
STARTCHAR ampersand
ENCODING 38
SWIDTH 600 0
DWIDTH 15 0
BBX 11 13 3 0
BITMAP
0F40
1180
2000
2000
2000
1000
30E0
4880
8500
8200
8200
4500
38C0
ENDCHAR
STARTCHAR quoteright
ENCODING 39
SWIDTH 600 0
DWIDTH 15 0
BBX 5 7 5 8
BITMAP
18
38
30
70
60
C0
80
ENDCHAR
STARTCHAR parenleft
ENCODING 40
SWIDTH 600 0
DWIDTH 15 0
BBX 6 19 7 -3
BITMAP
04
08
10
20
20
40
40
40
80
80
80
80
80
80
80
80
40
40
20
ENDCHAR
STARTCHAR parenright
ENCODING 41
SWIDTH 600 0
DWIDTH 15 0
BBX 6 19 5 -3
BITMAP
10
08
08
04
04
04
04
04
04
04
04
08
08
08
10
10
20
40
80
ENDCHAR
STARTCHAR asterisk
ENCODING 42
SWIDTH 600 0
DWIDTH 15 0
BBX 8 9 6 7
BITMAP
08
08
08
CB
2C
18
24
44
84
ENDCHAR
STARTCHAR plus
ENCODING 43
SWIDTH 600 0
DWIDTH 15 0
BBX 12 13 3 1
BITMAP
0100
0100
0100
0200
0200
0200
FFF0
0400
0400
0400
0800
0800
0800
ENDCHAR
STARTCHAR comma
ENCODING 44
SWIDTH 600 0
DWIDTH 15 0
BBX 5 6 3 -3
BITMAP
38
38
70
60
C0
80
ENDCHAR
STARTCHAR minus
ENCODING 45
SWIDTH 600 0
DWIDTH 15 0
BBX 10 1 4 7
BITMAP
FFC0
ENDCHAR
STARTCHAR period
ENCODING 46
SWIDTH 600 0
DWIDTH 15 0
BBX 4 3 6 0
BITMAP
70
F0
E0
ENDCHAR
STARTCHAR slash
ENCODING 47
SWIDTH 600 0
DWIDTH 15 0
BBX 12 18 3 -2
BITMAP
0010
0020
0020
0040
0080
0080
0100
0200
0200
0400
0800
0800
1000
2000
2000
4000
8000
8000
ENDCHAR
STARTCHAR zero
ENCODING 48
SWIDTH 600 0
DWIDTH 15 0
BBX 9 15 4 0
BITMAP
0E00
1100
2080
2080
4080
4080
4080
8080
8080
8100
8100
8200
8200
4400
3800
ENDCHAR
STARTCHAR one
ENCODING 49
SWIDTH 600 0
DWIDTH 15 0
BBX 9 15 3 0
BITMAP
0300
1F00
0100
0200
0200
0200
0200
0400
0400
0400
0400
0800
0800
0800
FF80
ENDCHAR
STARTCHAR two
ENCODING 50
SWIDTH 600 0
DWIDTH 15 0
BBX 11 15 2 0
BITMAP
0780
0840
1020
1020
0020
0040
0080
0100
0200
0400
0800
1000
2000
4080
FF80
ENDCHAR
STARTCHAR three
ENCODING 51
SWIDTH 600 0
DWIDTH 15 0
BBX 10 15 4 0
BITMAP
0F00
1080
2040
0040
0040
0080
0100
0E00
0100
0080
0080
0080
8080
4100
3E00
ENDCHAR
STARTCHAR four
ENCODING 52
SWIDTH 600 0
DWIDTH 15 0
BBX 10 15 3 0
BITMAP
00C0
0140
0240
0240
0480
0880
0880
1080
2100
4100
FF80
0200
0200
0200
0F80
ENDCHAR
STARTCHAR five
ENCODING 53
SWIDTH 600 0
DWIDTH 15 0
BBX 12 15 2 0
BITMAP
0FF0
0800
0800
0800
1000
1380
1C40
1820
0020
0020
0020
0040
8040
6180
1E00
ENDCHAR
STARTCHAR six
ENCODING 54
SWIDTH 600 0
DWIDTH 15 0
BBX 11 15 4 0
BITMAP
01E0
0600
0800
1000
2000
2000
5E00
6100
4080
8080
8080
8080
8100
4300
3C00
ENDCHAR
STARTCHAR seven
ENCODING 55
SWIDTH 600 0
DWIDTH 15 0
BBX 9 15 5 0
BITMAP
FF80
8080
8080
0100
0100
0200
0200
0400
0400
0800
0800
1000
2000
2000
4000
ENDCHAR
STARTCHAR eight
ENCODING 56
SWIDTH 600 0
DWIDTH 15 0
BBX 10 15 4 0
BITMAP
0700
0880
1040
2040
2040
2080
1100
1E00
2100
4080
8080
8080
8100
4200
3C00
ENDCHAR
STARTCHAR nine
ENCODING 57
SWIDTH 600 0
DWIDTH 15 0
BBX 11 15 3 0
BITMAP
0380
0C40
1820
1020
2020
2020
2020
2060
10A0
0F40
0040
0080
0300
0C00
F000
ENDCHAR
STARTCHAR colon
ENCODING 58
SWIDTH 600 0
DWIDTH 15 0
BBX 6 10 5 0
BITMAP
1C
3C
38
00
00
00
00
70
F0
E0
ENDCHAR
STARTCHAR semicolon
ENCODING 59
SWIDTH 600 0
DWIDTH 15 0
BBX 8 13 3 -3
BITMAP
07
0F
0E
00
00
00
00
38
38
70
60
C0
80
ENDCHAR
STARTCHAR less
ENCODING 60
SWIDTH 600 0
DWIDTH 15 0
BBX 13 10 2 2
BITMAP
0038
00E0
0380
0E00
3800
E000
3800
0E00
0380
00E0
ENDCHAR
STARTCHAR equal
ENCODING 61
SWIDTH 600 0
DWIDTH 15 0
BBX 13 4 2 5
BITMAP
7FF8
0000
0000
FFF0
ENDCHAR
STARTCHAR greater
ENCODING 62
SWIDTH 600 0
DWIDTH 15 0
BBX 13 10 2 2
BITMAP
3800
0E00
0380
00E0
0038
00E0
0380
0E00
3800
E000
ENDCHAR
STARTCHAR question
ENCODING 63
SWIDTH 600 0
DWIDTH 15 0
BBX 8 14 5 0
BITMAP
3E
C1
81
01
01
02
06
18
20
20
00
00
70
70
ENDCHAR
STARTCHAR at
ENCODING 64
SWIDTH 600 0
DWIDTH 15 0
BBX 10 18 3 -2
BITMAP
0700
1880
1040
2040
2040
41C0
4640
4440
8880
8880
8880
8880
87C0
8000
8000
4000
6180
1E00
ENDCHAR
STARTCHAR A
ENCODING 65
SWIDTH 600 0
DWIDTH 15 0
BBX 13 14 1 0
BITMAP
0780
0180
0280
0240
0440
0440
0820
0820
0FE0
1020
1010
2010
2010
F878
ENDCHAR
STARTCHAR B
ENCODING 66
SWIDTH 600 0
DWIDTH 15 0
BBX 13 14 1 0
BITMAP
1FE0
0410
0408
0808
0808
0830
0FC0
1030
1008
1008
2008
2010
2030
FFC0
ENDCHAR
STARTCHAR C
ENCODING 67
SWIDTH 600 0
DWIDTH 15 0
BBX 13 14 2 0
BITMAP
07C8
1838
3010
2010
4000
4000
8000
8000
8000
8000
8000
4060
60C0
1F00
ENDCHAR
STARTCHAR D
ENCODING 68
SWIDTH 600 0
DWIDTH 15 0
BBX 13 14 1 0
BITMAP
1FE0
0410
0408
0808
0808
0808
0808
1008
1010
1010
2020
2020
20C0
FF00
ENDCHAR
STARTCHAR E
ENCODING 69
SWIDTH 600 0
DWIDTH 15 0
BBX 14 14 1 0
BITMAP
1FFC
0404
0408
0808
0880
0880
0F00
1100
1100
1000
2010
2010
2020
FFE0
ENDCHAR
STARTCHAR F
ENCODING 70
SWIDTH 600 0
DWIDTH 15 0
BBX 14 14 1 0
BITMAP
1FFC
0404
0408
0808
0880
0880
0F00
1100
1100
1000
2000
2000
2000
FE00
ENDCHAR
STARTCHAR G
ENCODING 71
SWIDTH 600 0
DWIDTH 15 0
BBX 13 14 2 0
BITMAP
07C8
1838
3010
2010
4000
4000
8000
8000
83F0
8020
8020
4060
60C0
1F00
ENDCHAR
STARTCHAR H
ENCODING 72
SWIDTH 600 0
DWIDTH 15 0
BBX 15 14 1 0
BITMAP
1F3E
0408
0408
0810
0810
0810
0FF0
1020
1020
1020
2040
2040
2040
F9F0
ENDCHAR
STARTCHAR I
ENCODING 73
SWIDTH 600 0
DWIDTH 15 0
BBX 12 14 3 0
BITMAP
1FF0
0100
0100
0200
0200
0200
0200
0400
0400
0400
0800
0800
0800
FF80
ENDCHAR
STARTCHAR J
ENCODING 74
SWIDTH 600 0
DWIDTH 15 0
BBX 15 14 2 0
BITMAP
03FE
0010
0010
0010
0020
0020
0020
4020
4040
8040
8040
8080
4180
3E00
ENDCHAR
STARTCHAR K
ENCODING 75
SWIDTH 600 0
DWIDTH 15 0
BBX 14 14 1 0
BITMAP
1F3C
0410
0420
0840
0880
0900
0E00
1900
1080
1040
2040
2020
2020
FC38
ENDCHAR
STARTCHAR L
ENCODING 76
SWIDTH 600 0
DWIDTH 15 0
BBX 13 14 1 0
BITMAP
1FC0
0400
0400
0800
0800
0800
0800
1000
1008
1008
2008
2010
2010
FFF0
ENDCHAR
STARTCHAR M
ENCODING 77
SWIDTH 600 0
DWIDTH 15 0
BBX 16 14 1 0
BITMAP
1E07
0606
060A
0A14
0A14
0924
0924
1148
1088
1088
2010
2010
2010
F87C
ENDCHAR
STARTCHAR N
ENCODING 78
SWIDTH 600 0
DWIDTH 15 0
BBX 16 14 1 0
BITMAP
1F1F
0404
0404
0A08
0A08
0A08
0908
1110
1110
1090
20A0
20A0
2060
F860
ENDCHAR
STARTCHAR O
ENCODING 79
SWIDTH 600 0
DWIDTH 15 0
BBX 13 14 2 0
BITMAP
07C0
1830
3010
2008
4008
4008
8008
8008
8010
8010
8020
4060
60C0
1F00
ENDCHAR
STARTCHAR P
ENCODING 80
SWIDTH 600 0
DWIDTH 15 0
BBX 13 14 1 0
BITMAP
1FE0
0410
0408
0808
0808
0810
0830
1FC0
1000
1000
2000
2000
2000
FE00
ENDCHAR
STARTCHAR Q
ENCODING 81
SWIDTH 600 0
DWIDTH 15 0
BBX 13 16 2 -2
BITMAP
07C0
1830
3010
2008
4008
4008
8008
8008
8010
8010
8020
4060
60C0
1F00
3860
6780
ENDCHAR
STARTCHAR R
ENCODING 82
SWIDTH 600 0
DWIDTH 15 0
BBX 13 14 1 0
BITMAP
1FE0
0410
0408
0808
0808
0810
0830
1FC0
1080
1040
2020
2020
2010
FC18
ENDCHAR
STARTCHAR S
ENCODING 83
SWIDTH 600 0
DWIDTH 15 0
BBX 12 14 2 0
BITMAP
0390
0C70
0820
1020
1000
1000
0E00
0180
0040
0040
4040
4080
E180
9E00
ENDCHAR
STARTCHAR T
ENCODING 84
SWIDTH 600 0
DWIDTH 15 0
BBX 12 14 4 0
BITMAP
7FF0
4210
4210
8420
8420
0400
0400
0800
0800
0800
1000
1000
1000
FE00
ENDCHAR
STARTCHAR U
ENCODING 85
SWIDTH 600 0
DWIDTH 15 0
BBX 14 14 3 0
BITMAP
F87C
2010
2010
2010
4020
4020
4020
4020
8040
8040
8040
8080
4180
3E00
ENDCHAR
STARTCHAR V
ENCODING 86
SWIDTH 600 0
DWIDTH 15 0
BBX 14 14 3 0
BITMAP
F87C
2010
2020
2020
1040
1040
1080
1080
1100
0900
0A00
0A00
0C00
0C00
ENDCHAR
STARTCHAR W
ENCODING 87
SWIDTH 600 0
DWIDTH 15 0
BBX 14 14 2 0
BITMAP
783C
2008
2008
2310
4510
4510
4920
4920
5120
5140
A140
A140
C180
C180
ENDCHAR
STARTCHAR X
ENCODING 88
SWIDTH 600 0
DWIDTH 15 0
BBX 16 14 1 0
BITMAP
1E0F
0404
0408
0210
0220
0140
0180
0180
0280
0440
0840
1020
2020
F8F8
ENDCHAR
STARTCHAR Y
ENCODING 89
SWIDTH 600 0
DWIDTH 15 0
BBX 13 14 4 0
BITMAP
F078
2020
2040
1080
1100
0A00
0C00
0800
0800
0800
1000
1000
1000
FE00
ENDCHAR
STARTCHAR Z
ENCODING 90
SWIDTH 600 0
DWIDTH 15 0
BBX 12 14 2 0
BITMAP
1FF0
1010
2020
2040
0080
0100
0200
0400
0800
1000
2020
4020
8040
FFC0
ENDCHAR
STARTCHAR bracketleft
ENCODING 91
SWIDTH 600 0
DWIDTH 15 0
BBX 7 19 6 -3
BITMAP
0E
08
08
08
10
10
10
10
20
20
20
20
40
40
40
80
80
80
E0
ENDCHAR
STARTCHAR backslash
ENCODING 92
SWIDTH 600 0
DWIDTH 15 0
BBX 5 19 6 -2
BITMAP
80
80
80
40
40
40
40
20
20
20
20
10
10
10
10
08
08
08
08
ENDCHAR
STARTCHAR bracketright
ENCODING 93
SWIDTH 600 0
DWIDTH 15 0
BBX 7 19 5 -3
BITMAP
0E
02
02
02
04
04
04
08
08
08
08
10
10
10
10
20
20
20
E0
ENDCHAR
STARTCHAR asciicircum
ENCODING 94
SWIDTH 600 0
DWIDTH 15 0
BBX 10 7 4 9
BITMAP
0200
0500
0900
1080
2080
4040
8040
ENDCHAR
STARTCHAR underscore
ENCODING 95
SWIDTH 600 0
DWIDTH 15 0
BBX 15 1 0 -4
BITMAP
FFFE
ENDCHAR
STARTCHAR quoteleft
ENCODING 96
SWIDTH 600 0
DWIDTH 15 0
BBX 3 7 9 8
BITMAP
E0
E0
60
60
60
20
20
ENDCHAR
STARTCHAR a
ENCODING 97
SWIDTH 600 0
DWIDTH 15 0
BBX 10 11 2 0
BITMAP
0F80
3040
0040
0040
1FC0
6080
4080
8100
8300
8500
79C0
ENDCHAR
STARTCHAR b
ENCODING 98
SWIDTH 600 0
DWIDTH 15 0
BBX 13 16 1 0
BITMAP
1C00
0400
0400
0400
0800
09E0
0A10
0C08
1008
1008
1008
1008
2010
3030
2860
E780
ENDCHAR
STARTCHAR c
ENCODING 99
SWIDTH 600 0
DWIDTH 15 0
BBX 11 11 2 0
BITMAP
0FA0
3060
6040
4040
8000
8000
8000
8000
80C0
4180
3E00
ENDCHAR
STARTCHAR d
ENCODING 100
SWIDTH 600 0
DWIDTH 15 0
BBX 13 16 1 0
BITMAP
0038
0008
0008
0010
0010
0F90
3050
6020
4020
8020
8020
8040
8040
80C0
4340
3C70
ENDCHAR
STARTCHAR e
ENCODING 101
SWIDTH 600 0
DWIDTH 15 0
BBX 11 11 2 0
BITMAP
0F80
3040
6020
4020
8020
FFE0
8000
8000
8000
4180
3E00
ENDCHAR
STARTCHAR f
ENCODING 102
SWIDTH 600 0
DWIDTH 15 0
BBX 13 16 2 0
BITMAP
00F8
0100
0200
0200
0200
3FE0
0400
0400
0400
0800
0800
0800
1000
1000
1000
FF80
ENDCHAR
STARTCHAR g
ENCODING 103
SWIDTH 600 0
DWIDTH 15 0
BBX 12 16 2 -5
BITMAP
0F30
30A0
6040
4040
8040
8040
8080
8080
8180
4280
3C80
0100
0100
0200
0600
F800
ENDCHAR
STARTCHAR h
ENCODING 104
SWIDTH 600 0
DWIDTH 15 0
BBX 12 16 1 0
BITMAP
1C00
0400
0400
0400
0800
09E0
0A10
0C10
1010
1020
1020
1020
2040
2040
2040
F9F0
ENDCHAR
STARTCHAR i
ENCODING 105
SWIDTH 600 0
DWIDTH 15 0
BBX 10 16 3 0
BITMAP
0300
0300
0300
0000
0000
1E00
0200
0200
0400
0400
0400
0400
0800
0800
0800
FFC0
ENDCHAR
STARTCHAR j
ENCODING 106
SWIDTH 600 0
DWIDTH 15 0
BBX 10 21 3 -5
BITMAP
00C0
00C0
00C0
0000
0000
1FC0
0040
0040
0080
0080
0080
0080
0100
0100
0100
0100
0100
0200
0200
0C00
F000
ENDCHAR
STARTCHAR k
ENCODING 107
SWIDTH 600 0
DWIDTH 15 0
BBX 13 16 1 0
BITMAP
1C00
0400
0400
0400
0800
08F8
0860
0980
1600
1C00
1400
1200
2100
2080
2040
E0F0
ENDCHAR
STARTCHAR l
ENCODING 108
SWIDTH 600 0
DWIDTH 15 0
BBX 10 16 3 0
BITMAP
0F00
0100
0100
0100
0200
0200
0200
0200
0400
0400
0400
0400
0800
0800
0800
FFC0
ENDCHAR
STARTCHAR m
ENCODING 109
SWIDTH 600 0
DWIDTH 15 0
BBX 15 11 0 0
BITMAP
398C
0A52
0C62
0842
1084
1084
1084
2108
2108
2108
F9CE
ENDCHAR
STARTCHAR n
ENCODING 110
SWIDTH 600 0
DWIDTH 15 0
BBX 12 11 1 0
BITMAP
39E0
0A10
0C10
0810
1020
1020
1020
2040
2040
2040
F9F0
ENDCHAR
STARTCHAR o
ENCODING 111
SWIDTH 600 0
DWIDTH 15 0
BBX 11 11 2 0
BITMAP
0F80
3040
6020
4020
8020
8020
8020
8040
80C0
4180
3E00
ENDCHAR
STARTCHAR p
ENCODING 112
SWIDTH 600 0
DWIDTH 15 0
BBX 15 16 -1 -5
BITMAP
1CF8
0504
0602
0402
0802
0802
0802
0804
140C
1218
11E0
1000
2000
2000
2000
FC00
ENDCHAR
STARTCHAR q
ENCODING 113
SWIDTH 600 0
DWIDTH 15 0
BBX 14 16 1 -5
BITMAP
0F9C
3050
6020
4020
8020
8020
8040
8040
80C0
4340
3C40
0040
0080
0080
0080
07E0
ENDCHAR
STARTCHAR r
ENCODING 114
SWIDTH 600 0
DWIDTH 15 0
BBX 13 11 2 0
BITMAP
1C70
0588
0600
0800
0800
0800
0800
1000
1000
1000
FF80
ENDCHAR
STARTCHAR s
ENCODING 115
SWIDTH 600 0
DWIDTH 15 0
BBX 11 11 2 0
BITMAP
0FA0
1060
2020
2000
1000
0F00
0080
0040
8040
C080
BF00
ENDCHAR
STARTCHAR t
ENCODING 116
SWIDTH 600 0
DWIDTH 15 0
BBX 9 15 3 0
BITMAP
1000
1000
1000
1000
FF80
2000
2000
2000
2000
4000
4000
4000
4000
2180
1E00
ENDCHAR
STARTCHAR u
ENCODING 117
SWIDTH 600 0
DWIDTH 15 0
BBX 10 11 3 0
BITMAP
E1C0
2040
2040
4040
4080
4080
8080
8100
8300
4500
39C0
ENDCHAR
STARTCHAR v
ENCODING 118
SWIDTH 600 0
DWIDTH 15 0
BBX 13 11 3 0
BITMAP
F8F8
2020
2040
2040
1080
1080
1100
1100
0A00
0C00
0C00
ENDCHAR
STARTCHAR w
ENCODING 119
SWIDTH 600 0
DWIDTH 15 0
BBX 13 11 2 0
BITMAP
F078
4010
4010
4620
4620
4A40
4A40
5280
5280
6300
6300
ENDCHAR
STARTCHAR x
ENCODING 120
SWIDTH 600 0
DWIDTH 15 0
BBX 13 11 1 0
BITMAP
3C78
1010
0820
0440
0280
0300
0500
0880
1040
2020
F0F0
ENDCHAR
STARTCHAR y
ENCODING 121
SWIDTH 600 0
DWIDTH 15 0
BBX 14 16 1 -5
BITMAP
1E1C
0808
0808
0810
0420
0420
0440
0440
0280
0300
0300
0200
0400
0800
1000
FE00
ENDCHAR
STARTCHAR z
ENCODING 122
SWIDTH 600 0
DWIDTH 15 0
BBX 11 11 3 0
BITMAP
3FE0
4040
4080
0100
0200
0400
0800
1000
2040
4040
FF80
ENDCHAR
STARTCHAR braceleft
ENCODING 123
SWIDTH 600 0
DWIDTH 15 0
BBX 7 19 6 -3
BITMAP
06
08
08
10
10
10
20
20
C0
20
20
20
20
40
40
40
40
40
30
ENDCHAR
STARTCHAR bar
ENCODING 124
SWIDTH 600 0
DWIDTH 15 0
BBX 4 19 7 -3
BITMAP
10
10
10
10
20
20
20
20
20
40
40
40
40
40
80
80
80
80
80
ENDCHAR
STARTCHAR braceright
ENCODING 125
SWIDTH 600 0
DWIDTH 15 0
BBX 7 19 5 -3
BITMAP
18
04
04
04
04
04
08
08
08
06
08
08
08
10
10
10
20
20
C0
ENDCHAR
STARTCHAR asciitilde
ENCODING 126
SWIDTH 600 0
DWIDTH 15 0
BBX 11 3 3 6
BITMAP
3860
64C0
C380
ENDCHAR
STARTCHAR Aogonek
ENCODING 161
SWIDTH 600 0
DWIDTH 15 0
BBX 13 18 1 -4
BITMAP
0780
0180
0280
0240
0440
0440
0820
0820
0FE0
1020
1010
2010
2010
F878
0020
0040
0090
0060
ENDCHAR
STARTCHAR breve
ENCODING 162
SWIDTH 600 0
DWIDTH 15 0
BBX 7 3 4 12
BITMAP
82
C6
7C
ENDCHAR
STARTCHAR Lslash
ENCODING 163
SWIDTH 600 0
DWIDTH 15 0
BBX 13 14 1 0
BITMAP
1FC0
0400
0400
0800
0800
0980
0E00
1800
7008
1008
2008
2010
2010
FFF0
ENDCHAR
STARTCHAR currency
ENCODING 164
SWIDTH 600 0
DWIDTH 15 0
BBX 11 9 3 2
BITMAP
4F20
30C0
2040
4040
4040
4080
2180
7E80
8040
ENDCHAR
STARTCHAR Lcaron
ENCODING 165
SWIDTH 600 0
DWIDTH 15 0
BBX 13 14 1 0
BITMAP
1FD0
0410
0430
0820
0820
0840
0840
1000
1008
1008
2008
2010
2010
FFF0
ENDCHAR
STARTCHAR Sacute
ENCODING 166
SWIDTH 600 0
DWIDTH 15 0
BBX 13 19 2 0
BITMAP
0008
0010
0020
0040
0000
0390
0C70
0820
1020
1000
1000
0E00
0180
0040
0040
4040
4080
E180
9E00
ENDCHAR
STARTCHAR section
ENCODING 167
SWIDTH 600 0
DWIDTH 15 0
BBX 12 18 3 -2
BITMAP
03F0
0410
0810
0810
0800
3C00
4200
4100
4080
2040
1020
0820
0420
03C0
8100
8100
8200
FC00
ENDCHAR
STARTCHAR dieresis
ENCODING 168
SWIDTH 600 0
DWIDTH 15 0
BBX 7 2 7 12
BITMAP
C6
C6
ENDCHAR
STARTCHAR Scaron
ENCODING 169
SWIDTH 600 0
DWIDTH 15 0
BBX 13 19 2 0
BITMAP
0318
01B0
00E0
0000
0000
0390
0C70
0820
1020
1000
1000
0E00
0180
0040
0040
4040
4080
E180
9E00
ENDCHAR
STARTCHAR Scedilla
ENCODING 170
SWIDTH 600 0
DWIDTH 15 0
BBX 12 18 2 -4
BITMAP
0390
0C70
0820
1020
1000
1000
0E00
0180
0040
0040
4040
4080
E180
9E00
1000
0800
4800
7000
ENDCHAR
STARTCHAR Tcaron
ENCODING 171
SWIDTH 600 0
DWIDTH 15 0
BBX 12 19 4 0
BITMAP
18C0
0D80
0700
0000
0000
7FF0
4210
4210
8420
8420
0400
0400
0800
0800
0800
1000
1000
1000
FE00
ENDCHAR
STARTCHAR Zacute
ENCODING 172
SWIDTH 600 0
DWIDTH 15 0
BBX 12 19 2 0
BITMAP
0020
0040
0080
0100
0000
1FF0
1010
2020
2040
0080
0100
0200
0400
0800
1000
2020
4020
8040
FFC0
ENDCHAR
STARTCHAR hyphen
ENCODING 173
SWIDTH 600 0
DWIDTH 15 0
BBX 10 1 3 7
BITMAP
FFC0
ENDCHAR
STARTCHAR Zcaron
ENCODING 174
SWIDTH 600 0
DWIDTH 15 0
BBX 12 19 2 0
BITMAP
0C60
06C0
0380
0000
0000
1FF0
1010
2020
2040
0080
0100
0200
0400
0800
1000
2020
4020
8040
FFC0
ENDCHAR
STARTCHAR Zdotaccent
ENCODING 175
SWIDTH 600 0
DWIDTH 15 0
BBX 12 18 2 0
BITMAP
0180
0180
0000
0000
1FF0
1010
2020
2040
0080
0100
0200
0400
0800
1000
2020
4020
8040
FFC0
ENDCHAR
STARTCHAR degree
ENCODING 176
SWIDTH 600 0
DWIDTH 15 0
BBX 7 7 5 9
BITMAP
3C
46
82
82
82
C4
78
ENDCHAR
STARTCHAR aogonek
ENCODING 177
SWIDTH 600 0
DWIDTH 15 0
BBX 10 15 2 -4
BITMAP
0F80
3040
0040
0040
1FC0
6080
4080
8100
8300
8500
79C0
0080
0100
0240
0180
ENDCHAR
STARTCHAR ogonek
ENCODING 178
SWIDTH 600 0
DWIDTH 15 0
BBX 4 5 4 -4
BITMAP
20
40
80
90
60
ENDCHAR
STARTCHAR lslash
ENCODING 179
SWIDTH 600 0
DWIDTH 15 0
BBX 10 16 3 0
BITMAP
0F00
0100
0100
0100
0200
0200
02C0
0300
0C00
3400
0400
0400
0800
0800
0800
FFC0
ENDCHAR
STARTCHAR acute
ENCODING 180
SWIDTH 600 0
DWIDTH 15 0
BBX 5 4 9 12
BITMAP
18
30
60
C0
ENDCHAR
STARTCHAR lcaron
ENCODING 181
SWIDTH 600 0
DWIDTH 15 0
BBX 12 16 3 0
BITMAP
0F10
0110
0130
0120
0220
0240
0240
0200
0400
0400
0400
0400
0800
0800
0800
FFC0
ENDCHAR
STARTCHAR sacute
ENCODING 182
SWIDTH 600 0
DWIDTH 15 0
BBX 11 16 2 0
BITMAP
0020
0040
0080
0100
0000
0FA0
1060
2020
2000
1000
0F00
0080
0040
8040
C080
BF00
ENDCHAR
STARTCHAR caron
ENCODING 183
SWIDTH 600 0
DWIDTH 15 0
BBX 7 3 4 12
BITMAP
C6
6C
38
ENDCHAR
STARTCHAR cedilla
ENCODING 184
SWIDTH 600 0
DWIDTH 15 0
BBX 4 5 4 -4
BITMAP
20
20
10
90
E0
ENDCHAR
STARTCHAR scaron
ENCODING 185
SWIDTH 600 0
DWIDTH 15 0
BBX 11 16 2 0
BITMAP
0C60
06C0
0380
0000
0000
0FA0
1060
2020
2000
1000
0F00
0080
0040
8040
C080
BF00
ENDCHAR
STARTCHAR scedilla
ENCODING 186
SWIDTH 600 0
DWIDTH 15 0
BBX 11 15 2 -4
BITMAP
0FA0
1060
2020
2000
1000
0F00
0080
0040
8040
C080
BF00
0800
0400
2400
3800
ENDCHAR
STARTCHAR tcaron
ENCODING 187
SWIDTH 600 0
DWIDTH 15 0
BBX 9 19 3 0
BITMAP
0080
0080
0180
0100
1100
1200
1200
1000
FF80
2000
2000
2000
2000
4000
4000
4000
4000
2180
1E00
ENDCHAR
STARTCHAR zacute
ENCODING 188
SWIDTH 600 0
DWIDTH 15 0
BBX 11 16 3 0
BITMAP
0040
0080
0100
0200
0000
3FE0
4040
4080
0100
0200
0400
0800
1000
2040
4040
FF80
ENDCHAR
STARTCHAR hungarumlaut
ENCODING 189
SWIDTH 600 0
DWIDTH 15 0
BBX 9 4 3 12
BITMAP
1980
3300
6600
CC00
ENDCHAR
STARTCHAR zcaron
ENCODING 190
SWIDTH 600 0
DWIDTH 15 0
BBX 11 16 3 0
BITMAP
18C0
0D80
0700
0000
0000
3FE0
4040
4080
0100
0200
0400
0800
1000
2040
4040
FF80
ENDCHAR
STARTCHAR zdotaccent
ENCODING 191
SWIDTH 600 0
DWIDTH 15 0
BBX 11 15 3 0
BITMAP
0300
0300
0000
0000
3FE0
4040
4080
0100
0200
0400
0800
1000
2040
4040
FF80
ENDCHAR
STARTCHAR Racute
ENCODING 192
SWIDTH 600 0
DWIDTH 15 0
BBX 13 19 1 0
BITMAP
0010
0020
0040
0080
0000
1FE0
0410
0408
0808
0808
0810
0830
1FC0
1080
1040
2020
2020
2010
FC18
ENDCHAR
STARTCHAR Aacute
ENCODING 193
SWIDTH 600 0
DWIDTH 15 0
BBX 13 19 1 0
BITMAP
0040
0080
0100
0200
0000
0780
0180
0280
0240
0440
0440
0820
0820
0FE0
1020
1010
2010
2010
F878
ENDCHAR
STARTCHAR Acircumflex
ENCODING 194
SWIDTH 600 0
DWIDTH 15 0
BBX 13 18 1 0
BITMAP
0180
0240
0420
0000
0780
0180
0280
0240
0440
0440
0820
0820
0FE0
1020
1010
2010
2010
F878
ENDCHAR
STARTCHAR Abreve
ENCODING 195
SWIDTH 600 0
DWIDTH 15 0
BBX 13 19 1 0
BITMAP
0410
0630
03E0
0000
0000
0780
0180
0280
0240
0440
0440
0820
0820
0FE0
1020
1010
2010
2010
F878
ENDCHAR
STARTCHAR Adieresis
ENCODING 196
SWIDTH 600 0
DWIDTH 15 0
BBX 13 17 1 0
BITMAP
0C60
0C60
0000
0780
0180
0280
0240
0440
0440
0820
0820
0FE0
1020
1010
2010
2010
F878
ENDCHAR
STARTCHAR Lacute
ENCODING 197
SWIDTH 600 0
DWIDTH 15 0
BBX 13 19 1 0
BITMAP
0020
0040
0080
0100
0000
1FC0
0400
0400
0800
0800
0800
0800
1000
1008
1008
2008
2010
2010
FFF0
ENDCHAR
STARTCHAR Cacute
ENCODING 198
SWIDTH 600 0
DWIDTH 15 0
BBX 13 19 2 0
BITMAP
0010
0020
0040
0080
0000
07C8
1838
3010
2010
4000
4000
8000
8000
8000
8000
8000
4060
60C0
1F00
ENDCHAR
STARTCHAR Ccedilla
ENCODING 199
SWIDTH 600 0
DWIDTH 15 0
BBX 13 18 2 -4
BITMAP
07C8
1838
3010
2010
4000
4000
8000
8000
8000
8000
8000
4060
60C0
1F00
1000
0800
4800
7000
ENDCHAR
STARTCHAR Ccaron
ENCODING 200
SWIDTH 600 0
DWIDTH 15 0
BBX 13 19 2 0
BITMAP
0630
0360
01C0
0000
0000
07C8
1838
3010
2010
4000
4000
8000
8000
8000
8000
8000
4060
60C0
1F00
ENDCHAR
STARTCHAR Eacute
ENCODING 201
SWIDTH 600 0
DWIDTH 15 0
BBX 14 19 1 0
BITMAP
0010
0020
0040
0080
0000
1FFC
0404
0408
0808
0880
0880
0F00
1100
1100
1000
2010
2010
2020
FFE0
ENDCHAR
STARTCHAR Eogonek
ENCODING 202
SWIDTH 600 0
DWIDTH 15 0
BBX 14 18 1 -4
BITMAP
1FFC
0404
0408
0808
0880
0880
0F00
1100
1100
1000
2010
2010
2020
FFE0
0040
0080
0120
00C0
ENDCHAR
STARTCHAR Edieresis
ENCODING 203
SWIDTH 600 0
DWIDTH 15 0
BBX 14 17 1 0
BITMAP
0630
0630
0000
1FFC
0404
0408
0808
0880
0880
0F00
1100
1100
1000
2010
2010
2020
FFE0
ENDCHAR
STARTCHAR Ecaron
ENCODING 204
SWIDTH 600 0
DWIDTH 15 0
BBX 14 19 1 0
BITMAP
0630
0360
01C0
0000
0000
1FFC
0404
0408
0808
0880
0880
0F00
1100
1100
1000
2010
2010
2020
FFE0
ENDCHAR
STARTCHAR Iacute
ENCODING 205
SWIDTH 600 0
DWIDTH 15 0
BBX 12 19 3 0
BITMAP
0020
0040
0080
0100
0000
1FF0
0100
0100
0200
0200
0200
0200
0400
0400
0400
0800
0800
0800
FF80
ENDCHAR
STARTCHAR Icircumflex
ENCODING 206
SWIDTH 600 0
DWIDTH 15 0
BBX 12 18 3 0
BITMAP
0180
0240
0420
0000
1FF0
0100
0100
0200
0200
0200
0200
0400
0400
0400
0800
0800
0800
FF80
ENDCHAR
STARTCHAR Dcaron
ENCODING 207
SWIDTH 600 0
DWIDTH 15 0
BBX 13 19 1 0
BITMAP
0630
0360
01C0
0000
0000
1FE0
0410
0408
0808
0808
0808
0808
1008
1010
1010
2020
2020
20C0
FF00
ENDCHAR
STARTCHAR Eth
ENCODING 208
SWIDTH 600 0
DWIDTH 15 0
BBX 13 14 1 0
BITMAP
1FE0
0410
0408
0808
0808
0808
3E08
1008
1010
1010
2020
2020
20C0
FF00
ENDCHAR
STARTCHAR Nacute
ENCODING 209
SWIDTH 600 0
DWIDTH 15 0
BBX 16 19 1 0
BITMAP
0008
0010
0020
0040
0000
1F1F
0404
0404
0A08
0A08
0A08
0908
1110
1110
1090
20A0
20A0
2060
F860
ENDCHAR
STARTCHAR Ncaron
ENCODING 210
SWIDTH 600 0
DWIDTH 15 0
BBX 16 19 1 0
BITMAP
018C
00D8
0070
0000
0000
1F1F
0404
0404
0A08
0A08
0A08
0908
1110
1110
1090
20A0
20A0
2060
F860
ENDCHAR
STARTCHAR Oacute
ENCODING 211
SWIDTH 600 0
DWIDTH 15 0
BBX 13 19 2 0
BITMAP
0040
0080
0100
0200
0000
07C0
1830
3010
2008
4008
4008
8008
8008
8010
8010
8020
4060
60C0
1F00
ENDCHAR
STARTCHAR Ocircumflex
ENCODING 212
SWIDTH 600 0
DWIDTH 15 0
BBX 13 18 2 0
BITMAP
0180
0240
0420
0000
07C0
1830
3010
2008
4008
4008
8008
8008
8010
8010
8020
4060
60C0
1F00
ENDCHAR
STARTCHAR Ohungarumlaut
ENCODING 213
SWIDTH 600 0
DWIDTH 15 0
BBX 14 19 2 0
BITMAP
00CC
0198
0330
0660
0000
07C0
1830
3010
2008
4008
4008
8008
8008
8010
8010
8020
4060
60C0
1F00
ENDCHAR
STARTCHAR Odieresis
ENCODING 214
SWIDTH 600 0
DWIDTH 15 0
BBX 13 17 2 0
BITMAP
0C60
0C60
0000
07C0
1830
3010
2008
4008
4008
8008
8008
8010
8010
8020
4060
60C0
1F00
ENDCHAR
STARTCHAR multiply
ENCODING 215
SWIDTH 600 0
DWIDTH 15 0
BBX 12 11 2 2
BITMAP
4010
2020
1040
0880
0500
0600
0A00
1100
2080
4040
8020
ENDCHAR
STARTCHAR Rcaron
ENCODING 216
SWIDTH 600 0
DWIDTH 15 0
BBX 13 19 1 0
BITMAP
0630
0360
01C0
0000
0000
1FE0
0410
0408
0808
0808
0810
0830
1FC0
1080
1040
2020
2020
2010
FC18
ENDCHAR
STARTCHAR Uring
ENCODING 217
SWIDTH 600 0
DWIDTH 15 0
BBX 14 19 3 0
BITMAP
0180
0240
0440
0480
0300
F87C
2010
2010
2010
4020
4020
4020
4020
8040
8040
8040
8080
4180
3E00
ENDCHAR
STARTCHAR Uacute
ENCODING 218
SWIDTH 600 0
DWIDTH 15 0
BBX 14 19 3 0
BITMAP
0020
0040
0080
0100
0000
F87C
2010
2010
2010
4020
4020
4020
4020
8040
8040
8040
8080
4180
3E00
ENDCHAR
STARTCHAR Uhungarumlaut
ENCODING 219
SWIDTH 600 0
DWIDTH 15 0
BBX 14 19 3 0
BITMAP
0198
0330
0660
0CC0
0000
F87C
2010
2010
2010
4020
4020
4020
4020
8040
8040
8040
8080
4180
3E00
ENDCHAR
STARTCHAR Udieresis
ENCODING 220
SWIDTH 600 0
DWIDTH 15 0
BBX 14 17 3 0
BITMAP
0C60
0C60
0000
F87C
2010
2010
2010
4020
4020
4020
4020
8040
8040
8040
8080
4180
3E00
ENDCHAR
STARTCHAR Yacute
ENCODING 221
SWIDTH 600 0
DWIDTH 15 0
BBX 13 19 4 0
BITMAP
0040
0080
0100
0200
0000
F078
2020
2040
1080
1100
0A00
0C00
0800
0800
0800
1000
1000
1000
FE00
ENDCHAR
STARTCHAR Tcedilla
ENCODING 222
SWIDTH 600 0
DWIDTH 15 0
BBX 12 18 4 -4
BITMAP
7FF0
4210
4210
8420
8420
0400
0400
0800
0800
0800
1000
1000
1000
FE00
1000
0800
4800
7000
ENDCHAR
STARTCHAR germandbls
ENCODING 223
SWIDTH 600 0
DWIDTH 15 0
BBX 12 16 1 0
BITMAP
01C0
0220
0410
0410
0410
0820
0840
09C0
0820
1010
1010
1010
2020
2420
2440
F380
ENDCHAR
STARTCHAR racute
ENCODING 224
SWIDTH 600 0
DWIDTH 15 0
BBX 13 16 2 0
BITMAP
0020
0040
0080
0100
0000
1C70
0588
0600
0800
0800
0800
0800
1000
1000
1000
FF80
ENDCHAR
STARTCHAR aacute
ENCODING 225
SWIDTH 600 0
DWIDTH 15 0
BBX 10 16 2 0
BITMAP
0040
0080
0100
0200
0000
0F80
3040
0040
0040
1FC0
6080
4080
8100
8300
8500
79C0
ENDCHAR
STARTCHAR acircumflex
ENCODING 226
SWIDTH 600 0
DWIDTH 15 0
BBX 10 15 2 0
BITMAP
0600
0900
1080
0000
0F80
3040
0040
0040
1FC0
6080
4080
8100
8300
8500
79C0
ENDCHAR
STARTCHAR abreve
ENCODING 227
SWIDTH 600 0
DWIDTH 15 0
BBX 11 16 2 0
BITMAP
0820
0C60
07C0
0000
0000
0F80
3040
0040
0040
1FC0
6080
4080
8100
8300
8500
79C0
ENDCHAR
STARTCHAR adieresis
ENCODING 228
SWIDTH 600 0
DWIDTH 15 0
BBX 10 14 2 0
BITMAP
18C0
18C0
0000
0F80
3040
0040
0040
1FC0
6080
4080
8100
8300
8500
79C0
ENDCHAR
STARTCHAR lacute
ENCODING 229
SWIDTH 600 0
DWIDTH 15 0
BBX 10 19 3 0
BITMAP
0040
0080
0100
0F00
0100
0100
0100
0200
0200
0200
0200
0400
0400
0400
0400
0800
0800
0800
FFC0
ENDCHAR
STARTCHAR cacute
ENCODING 230
SWIDTH 600 0
DWIDTH 15 0
BBX 11 16 2 0
BITMAP
0020
0040
0080
0100
0000
0FA0
3060
6040
4040
8000
8000
8000
8000
80C0
4180
3E00
ENDCHAR
STARTCHAR ccedilla
ENCODING 231
SWIDTH 600 0
DWIDTH 15 0
BBX 11 15 2 -4
BITMAP
0FA0
3060
6040
4040
8000
8000
8000
8000
80C0
4180
3E00
2000
1000
9000
E000
ENDCHAR
STARTCHAR ccaron
ENCODING 232
SWIDTH 600 0
DWIDTH 15 0
BBX 11 16 2 0
BITMAP
0C60
06C0
0380
0000
0000
0FA0
3060
6040
4040
8000
8000
8000
8000
80C0
4180
3E00
ENDCHAR
STARTCHAR eacute
ENCODING 233
SWIDTH 600 0
DWIDTH 15 0
BBX 11 16 2 0
BITMAP
0040
0080
0100
0200
0000
0F80
3040
6020
4020
8020
FFE0
8000
8000
8000
4180
3E00
ENDCHAR
STARTCHAR eogonek
ENCODING 234
SWIDTH 600 0
DWIDTH 15 0
BBX 11 15 2 -4
BITMAP
0F80
3040
6020
4020
8020
FFE0
8000
8000
8000
4180
3E00
0800
1000
2400
1800
ENDCHAR
STARTCHAR edieresis
ENCODING 235
SWIDTH 600 0
DWIDTH 15 0
BBX 11 14 2 0
BITMAP
18C0
18C0
0000
0F80
3040
6020
4020
8020
FFE0
8000
8000
8000
4180
3E00
ENDCHAR
STARTCHAR ecaron
ENCODING 236
SWIDTH 600 0
DWIDTH 15 0
BBX 11 16 2 0
BITMAP
0C60
06C0
0380
0000
0000
0F80
3040
6020
4020
8020
FFE0
8000
8000
8000
4180
3E00
ENDCHAR
STARTCHAR iacute
ENCODING 237
SWIDTH 600 0
DWIDTH 15 0
BBX 10 16 3 0
BITMAP
0080
0100
0200
0400
0000
1E00
0200
0200
0400
0400
0400
0400
0800
0800
0800
FFC0
ENDCHAR
STARTCHAR icircumflex
ENCODING 238
SWIDTH 600 0
DWIDTH 15 0
BBX 10 15 3 0
BITMAP
0600
0900
1080
0000
1E00
0200
0200
0400
0400
0400
0400
0800
0800
0800
FFC0
ENDCHAR
STARTCHAR dcaron
ENCODING 239
SWIDTH 600 0
DWIDTH 15 0
BBX 16 16 1 0
BITMAP
0039
0009
000B
0012
0012
0F94
3054
6020
4020
8020
8020
8040
8040
80C0
4340
3C70
ENDCHAR
STARTCHAR dmacron
ENCODING 240
SWIDTH 600 0
DWIDTH 15 0
BBX 15 16 1 0
BITMAP
0038
0008
03FE
0010
0010
0F90
3050
6020
4020
8020
8020
8040
8040
80C0
4340
3C70
ENDCHAR
STARTCHAR nacute
ENCODING 241
SWIDTH 600 0
DWIDTH 15 0
BBX 12 16 1 0
BITMAP
0010
0020
0040
0080
0000
39E0
0A10
0C10
0810
1020
1020
1020
2040
2040
2040
F9F0
ENDCHAR
STARTCHAR ncaron
ENCODING 242
SWIDTH 600 0
DWIDTH 15 0
BBX 12 16 1 0
BITMAP
0630
0360
01C0
0000
0000
39E0
0A10
0C10
0810
1020
1020
1020
2040
2040
2040
F9F0
ENDCHAR
STARTCHAR oacute
ENCODING 243
SWIDTH 600 0
DWIDTH 15 0
BBX 11 16 2 0
BITMAP
0080
0100
0200
0400
0000
0F80
3040
6020
4020
8020
8020
8020
8040
80C0
4180
3E00
ENDCHAR
STARTCHAR ocircumflex
ENCODING 244
SWIDTH 600 0
DWIDTH 15 0
BBX 11 15 2 0
BITMAP
0600
0900
1080
0000
0F80
3040
6020
4020
8020
8020
8020
8040
80C0
4180
3E00
ENDCHAR
STARTCHAR ohungarumlaut
ENCODING 245
SWIDTH 600 0
DWIDTH 15 0
BBX 13 16 2 0
BITMAP
0198
0330
0660
0CC0
0000
0F80
3040
6020
4020
8020
8020
8020
8040
80C0
4180
3E00
ENDCHAR
STARTCHAR odieresis
ENCODING 246
SWIDTH 600 0
DWIDTH 15 0
BBX 11 14 2 0
BITMAP
18C0
18C0
0000
0F80
3040
6020
4020
8020
8020
8020
8040
80C0
4180
3E00
ENDCHAR
STARTCHAR divide
ENCODING 247
SWIDTH 600 0
DWIDTH 15 0
BBX 11 13 3 1
BITMAP
0380
0780
0700
0000
0000
0000
FFE0
0000
0000
0000
1C00
3C00
3800
ENDCHAR
STARTCHAR rcaron
ENCODING 248
SWIDTH 600 0
DWIDTH 15 0
BBX 13 16 2 0
BITMAP
0630
0360
01C0
0000
0000
1C70
0588
0600
0800
0800
0800
0800
1000
1000
1000
FF80
ENDCHAR
STARTCHAR uring
ENCODING 249
SWIDTH 600 0
DWIDTH 15 0
BBX 10 16 3 0
BITMAP
0300
0480
0880
0900
0600
E1C0
2040
2040
4040
4080
4080
8080
8100
8300
4500
39C0
ENDCHAR
STARTCHAR uacute
ENCODING 250
SWIDTH 600 0
DWIDTH 15 0
BBX 10 16 3 0
BITMAP
0080
0100
0200
0400
0000
61C0
2040
2040
4040
4080
4080
8080
8100
8300
4500
39C0
ENDCHAR
STARTCHAR uhungarumlaut
ENCODING 251
SWIDTH 600 0
DWIDTH 15 0
BBX 11 16 3 0
BITMAP
0660
0CC0
1980
3300
0000
E1C0
2040
2040
4040
4080
4080
8080
8100
8300
4500
39C0
ENDCHAR
STARTCHAR udieresis
ENCODING 252
SWIDTH 600 0
DWIDTH 15 0
BBX 10 14 3 0
BITMAP
1980
1980
0000
E1C0
2040
2040
4040
4080
4080
8080
8100
8300
4500
39C0
ENDCHAR
STARTCHAR yacute
ENCODING 253
SWIDTH 600 0
DWIDTH 15 0
BBX 14 21 1 -5
BITMAP
0010
0020
0040
0080
0000
1E1C
0808
0808
0810
0420
0420
0440
0440
0280
0300
0300
0200
0400
0800
1000
FE00
ENDCHAR
STARTCHAR tcedilla
ENCODING 254
SWIDTH 600 0
DWIDTH 15 0
BBX 9 19 3 -4
BITMAP
1000
1000
1000
1000
FF80
2000
2000
2000
2000
4000
4000
4000
4000
2180
1E00
0400
0200
1200
1C00
ENDCHAR
STARTCHAR dotaccent
ENCODING 255
SWIDTH 600 0
DWIDTH 15 0
BBX 2 2 6 12
BITMAP
C0
C0
ENDCHAR
ENDFONT
