STARTFONT 2.1
COMMENT +
COMMENT  Copyright 1986, 1985 Bigelow & Holmes. 
COMMENT  Copyright 1996 BIZNET Poland, Inc.
COMMENT -
FONT -BIZNET-FotinosBright-DemiBold-R-Normal--19-190-75-75-P-114-ISO8859-2
SIZE 19 72 72
FONTBOUNDINGBOX 18 18 -1 -4
STARTPROPERTIES 21
FOUNDRY "BIZNET"
FAMILY_NAME "BIZNET FotinosBright"
WEIGHT_NAME "DemiBold"
SLANT "R"
SETWIDTH_NAME "Normal"
ADD_STYLE_NAME ""
PIXEL_SIZE 19
POINT_SIZE 190
RESOLUTION_X 100
RESOLUTION_Y 100
SPACING "P"
AVERAGE_WIDTH 114
CHARSET_REGISTRY "ISO8859"
CHARSET_ENCODING "2"
FONT_ASCENT 17
FONT_DESCENT 4
FACE_NAME "BIZNET Fotinos Bright Demibold"
DEFAULT_CHAR 0
CHARSET_COLLECTIONS "ASCII ISO8859-2"
COPYRIGHT "Copyright Bigelow & Holmes 1986, 1985. Copyright (c) 1996 BIZNET Poland, Inc. All Rights Reserved."
NOTICE "The name "BIZNET" is a registered trademark of BIZNET Poland, Inc."
ENDPROPERTIES
CHARS 190
STARTCHAR space
ENCODING 32
SWIDTH 333 0
DWIDTH 6 0
BBX 1 1 0 0
BITMAP
00
ENDCHAR
STARTCHAR exclam
ENCODING 33
SWIDTH 265 0
DWIDTH 5 0
BBX 3 14 1 0
BITMAP
E0
E0
E0
E0
E0
E0
40
40
40
40
00
E0
E0
E0
ENDCHAR
STARTCHAR quotedbl
ENCODING 34
SWIDTH 461 0
DWIDTH 9 0
BBX 7 5 1 9
BITMAP
EE
EE
EE
44
44
ENDCHAR
STARTCHAR numbersign
ENCODING 35
SWIDTH 663 0
DWIDTH 13 0
BBX 12 14 0 0
BITMAP
0440
0440
0440
0880
7FF0
0880
0880
1100
1100
FFE0
1100
2200
2200
2200
ENDCHAR
STARTCHAR dollar
ENCODING 36
SWIDTH 623 0
DWIDTH 12 0
BBX 8 18 2 -2
BITMAP
08
08
7F
79
E9
E8
E8
78
3C
1E
0F
0F
0F
8F
CF
FE
08
08
ENDCHAR
STARTCHAR percent
ENCODING 37
SWIDTH 759 0
DWIDTH 14 0
BBX 15 14 0 0
BITMAP
3806
4408
C610
C620
C640
44C0
3980
0338
0644
04C6
08C6
10C6
2044
C038
ENDCHAR
STARTCHAR ampersand
ENCODING 38
SWIDTH 765 0
DWIDTH 15 0
BBX 14 14 0 0
BITMAP
0F00
39C0
39C0
39C0
1F80
0F00
3C7C
6618
E718
E390
E3F0
F1E0
70F0
1F7C
ENDCHAR
STARTCHAR quoteright
ENCODING 39
SWIDTH 265 0
DWIDTH 5 0
BBX 3 5 1 9
BITMAP
E0
E0
60
60
C0
ENDCHAR
STARTCHAR parenleft
ENCODING 40
SWIDTH 327 0
DWIDTH 6 0
BBX 5 18 1 -4
BITMAP
08
18
30
30
60
60
E0
E0
E0
E0
E0
E0
60
60
30
30
10
08
ENDCHAR
STARTCHAR parenright
ENCODING 41
SWIDTH 327 0
DWIDTH 6 0
BBX 5 18 1 -4
BITMAP
80
C0
60
60
30
30
38
38
38
38
38
38
30
30
60
60
40
80
ENDCHAR
STARTCHAR asterisk
ENCODING 42
SWIDTH 434 0
DWIDTH 8 0
BBX 7 7 1 7
BITMAP
10
52
D6
6C
28
6C
28
ENDCHAR
STARTCHAR plus
ENCODING 43
SWIDTH 623 0
DWIDTH 12 0
BBX 11 12 0 0
BITMAP
0400
0400
0400
0400
0400
0400
FFE0
0400
0400
0400
0400
0400
ENDCHAR
STARTCHAR comma
ENCODING 44
SWIDTH 265 0
DWIDTH 5 0
BBX 3 7 1 -4
BITMAP
E0
E0
E0
60
60
60
C0
ENDCHAR
STARTCHAR minus
ENCODING 45
SWIDTH 623 0
DWIDTH 12 0
BBX 11 1 0 5
BITMAP
FFE0
ENDCHAR
STARTCHAR period
ENCODING 46
SWIDTH 265 0
DWIDTH 5 0
BBX 3 3 1 0
BITMAP
E0
E0
E0
ENDCHAR
STARTCHAR slash
ENCODING 47
SWIDTH 527 0
DWIDTH 10 0
BBX 10 18 0 -4
BITMAP
00C0
0080
0080
0100
0100
0200
0200
0400
0400
0800
0800
1000
1000
2000
2000
4000
4000
C000
ENDCHAR
STARTCHAR zero
ENCODING 48
SWIDTH 623 0
DWIDTH 12 0
BBX 11 14 0 0
BITMAP
1F00
3180
71C0
60C0
E0E0
E0E0
E0E0
E0E0
E0E0
E0E0
60C0
71C0
3180
1F00
ENDCHAR
STARTCHAR one
ENCODING 49
SWIDTH 623 0
DWIDTH 12 0
BBX 7 14 3 0
BITMAP
F8
38
38
38
38
38
38
38
38
38
38
38
38
FE
ENDCHAR
STARTCHAR two
ENCODING 50
SWIDTH 623 0
DWIDTH 12 0
BBX 9 14 1 0
BITMAP
7E00
C700
8380
0380
0380
0300
0700
0C00
1800
2000
6000
7F80
FF80
FF80
ENDCHAR
STARTCHAR three
ENCODING 51
SWIDTH 623 0
DWIDTH 12 0
BBX 9 14 1 0
BITMAP
FE00
C700
8380
0380
0380
0700
7C00
0F00
0380
0380
0380
8380
8700
FC00
ENDCHAR
STARTCHAR four
ENCODING 52
SWIDTH 623 0
DWIDTH 12 0
BBX 12 14 0 0
BITMAP
01C0
03C0
07C0
0DC0
19C0
11C0
21C0
41C0
FFF0
FFF0
01C0
01C0
01C0
03F0
ENDCHAR
STARTCHAR five
ENCODING 53
SWIDTH 623 0
DWIDTH 12 0
BBX 8 14 2 0
BITMAP
FF
FF
80
80
80
F8
1E
0F
07
07
07
87
8E
F8
ENDCHAR
STARTCHAR six
ENCODING 54
SWIDTH 623 0
DWIDTH 12 0
BBX 10 14 1 0
BITMAP
1F80
3880
7080
6000
E000
EF00
F380
E1C0
E1C0
E1C0
61C0
61C0
3380
1F00
ENDCHAR
STARTCHAR seven
ENCODING 55
SWIDTH 623 0
DWIDTH 12 0
BBX 9 14 2 0
BITMAP
FF80
FF80
FF80
0100
0200
0600
0400
0C00
1800
1800
3000
3000
7000
7000
ENDCHAR
STARTCHAR eight
ENCODING 56
SWIDTH 623 0
DWIDTH 12 0
BBX 10 14 1 0
BITMAP
3F00
7380
E1C0
E1C0
F180
7F00
1E00
3F80
63C0
E1C0
E1C0
E1C0
7380
3F00
ENDCHAR
STARTCHAR nine
ENCODING 57
SWIDTH 623 0
DWIDTH 12 0
BBX 10 14 1 0
BITMAP
3E00
7300
E180
E180
E1C0
E1C0
E1C0
73C0
3DC0
01C0
0180
4380
4700
7E00
ENDCHAR
STARTCHAR colon
ENCODING 58
SWIDTH 265 0
DWIDTH 5 0
BBX 3 10 1 0
BITMAP
E0
E0
E0
00
00
00
00
E0
E0
E0
ENDCHAR
STARTCHAR semicolon
ENCODING 59
SWIDTH 265 0
DWIDTH 5 0
BBX 3 14 1 -4
BITMAP
E0
E0
E0
00
00
00
00
E0
E0
E0
60
60
60
80
ENDCHAR
STARTCHAR less
ENCODING 60
SWIDTH 623 0
DWIDTH 12 0
BBX 10 12 -1 0
BITMAP
0040
00C0
0300
0C00
3000
C000
C000
3000
0C00
0300
00C0
0040
ENDCHAR
STARTCHAR equal
ENCODING 61
SWIDTH 623 0
DWIDTH 12 0
BBX 11 5 0 3
BITMAP
FFE0
0000
0000
0000
FFE0
ENDCHAR
STARTCHAR greater
ENCODING 62
SWIDTH 623 0
DWIDTH 12 0
BBX 10 12 0 0
BITMAP
8000
C000
3000
0C00
0300
00C0
00C0
0300
0C00
3000
C000
8000
ENDCHAR
STARTCHAR question
ENCODING 63
SWIDTH 505 0
DWIDTH 10 0
BBX 9 14 0 0
BITMAP
FE00
C700
8380
0380
0300
0200
0400
1800
3800
3800
0000
3800
3800
3800
ENDCHAR
STARTCHAR at
ENCODING 64
SWIDTH 861 0
DWIDTH 16 0
BBX 14 14 2 0
BITMAP
03E0
0C30
1008
2384
4464
4C44
98C4
98C4
99C8
9BD8
8EE0
4000
2080
1F00
ENDCHAR
STARTCHAR A
ENCODING 65
SWIDTH 795 0
DWIDTH 15 0
BBX 15 14 0 0
BITMAP
0100
0380
0380
03C0
05C0
05E0
08E0
08F0
1070
1FF0
2038
2038
601C
F07E
ENDCHAR
STARTCHAR B
ENCODING 66
SWIDTH 639 0
DWIDTH 12 0
BBX 10 14 1 0
BITMAP
FF00
73C0
71C0
71C0
71C0
7380
7E00
7300
7180
71C0
71C0
71C0
7380
FF00
ENDCHAR
STARTCHAR C
ENCODING 67
SWIDTH 711 0
DWIDTH 13 0
BBX 12 14 1 0
BITMAP
0FE0
3C30
7010
7010
E000
E000
E000
E000
E000
E000
7000
7000
3C10
0FE0
ENDCHAR
STARTCHAR D
ENCODING 68
SWIDTH 794 0
DWIDTH 15 0
BBX 13 14 1 0
BITMAP
FF80
70E0
7070
7030
7038
7038
7038
7038
7038
7038
7030
7070
70E0
FF80
ENDCHAR
STARTCHAR E
ENCODING 69
SWIDTH 601 0
DWIDTH 11 0
BBX 10 14 1 0
BITMAP
FF80
7080
7080
7000
7000
7100
7F00
7100
7000
7000
7000
7040
70C0
FFC0
ENDCHAR
STARTCHAR F
ENCODING 70
SWIDTH 584 0
DWIDTH 11 0
BBX 9 14 1 0
BITMAP
FF80
7080
7080
7000
7000
7100
7F00
7100
7000
7000
7000
7000
7000
FC00
ENDCHAR
STARTCHAR G
ENCODING 71
SWIDTH 753 0
DWIDTH 14 0
BBX 13 14 1 0
BITMAP
0FF0
3C30
7010
7000
E000
E000
E000
E000
E0F8
E070
7070
7070
3870
0FF0
ENDCHAR
STARTCHAR H
ENCODING 72
SWIDTH 798 0
DWIDTH 15 0
BBX 13 14 1 0
BITMAP
F8F8
7070
7070
7070
7070
7070
7FF0
7070
7070
7070
7070
7070
7070
F8F8
ENDCHAR
STARTCHAR I
ENCODING 73
SWIDTH 349 0
DWIDTH 7 0
BBX 5 14 1 0
BITMAP
F8
70
70
70
70
70
70
70
70
70
70
70
70
F8
ENDCHAR
STARTCHAR J
ENCODING 74
SWIDTH 452 0
DWIDTH 9 0
BBX 8 18 0 -4
BITMAP
1F
0E
0E
0E
0E
0E
0E
0E
0E
0E
0E
0E
0E
0E
0E
8E
9C
F8
ENDCHAR
STARTCHAR K
ENCODING 75
SWIDTH 747 0
DWIDTH 14 0
BBX 14 14 0 0
BITMAP
F8F8
7020
7040
7180
7300
7600
7E00
7F00
7780
73C0
71E0
71E0
70F8
F9FC
ENDCHAR
STARTCHAR L
ENCODING 76
SWIDTH 584 0
DWIDTH 11 0
BBX 10 14 1 0
BITMAP
F800
7000
7000
7000
7000
7000
7000
7000
7000
7000
7000
7040
7040
FFC0
ENDCHAR
STARTCHAR M
ENCODING 77
SWIDTH 904 0
DWIDTH 17 0
BBX 16 14 1 0
BITMAP
F81F
781C
783C
5C3C
5C3C
5E5C
4E5C
4E9C
479C
479C
471C
431C
401C
E03F
ENDCHAR
STARTCHAR N
ENCODING 78
SWIDTH 788 0
DWIDTH 15 0
BBX 13 14 1 0
BITMAP
F038
7010
7810
7C10
5E10
5E10
4F10
4790
4390
41D0
41F0
40F0
4070
E030
ENDCHAR
STARTCHAR O
ENCODING 79
SWIDTH 810 0
DWIDTH 15 0
BBX 14 14 1 0
BITMAP
0FC0
3870
7038
7038
E01C
E01C
E01C
E01C
E01C
E01C
7038
7038
3870
0FC0
ENDCHAR
STARTCHAR P
ENCODING 80
SWIDTH 614 0
DWIDTH 12 0
BBX 10 14 1 0
BITMAP
FF00
7180
71C0
71C0
71C0
71C0
7380
7E00
7000
7000
7000
7000
7000
FC00
ENDCHAR
STARTCHAR Q
ENCODING 81
SWIDTH 810 0
DWIDTH 15 0
BBX 16 18 1 -4
BITMAP
0FC0
3870
7038
7038
E01C
E01C
E01C
E01C
E01C
E01C
7038
7038
3870
0FC0
0070
003C
001F
0004
ENDCHAR
STARTCHAR R
ENCODING 82
SWIDTH 720 0
DWIDTH 14 0
BBX 13 14 1 0
BITMAP
FF00
7180
71C0
71C0
71C0
71C0
7380
7F00
7700
7380
73C0
71E0
70F0
F8F8
ENDCHAR
STARTCHAR S
ENCODING 83
SWIDTH 556 0
DWIDTH 11 0
BBX 9 14 1 0
BITMAP
3F00
7100
E100
E000
F000
F800
7E00
1F00
0780
0380
0380
8380
C700
FE00
ENDCHAR
STARTCHAR T
ENCODING 84
SWIDTH 714 0
DWIDTH 14 0
BBX 13 14 0 0
BITMAP
FFF8
C708
8708
0700
0700
0700
0700
0700
0700
0700
0700
0700
0700
1FC0
ENDCHAR
STARTCHAR U
ENCODING 85
SWIDTH 747 0
DWIDTH 14 0
BBX 14 14 0 0
BITMAP
F83C
7010
7010
7010
7010
7010
7010
7010
7010
7010
7010
7030
3820
1FC0
ENDCHAR
STARTCHAR V
ENCODING 86
SWIDTH 753 0
DWIDTH 14 0
BBX 14 14 0 0
BITMAP
FC3C
7818
3810
3810
1C20
1C20
1E60
0E40
0E40
0780
0780
0380
0300
0300
ENDCHAR
STARTCHAR W
ENCODING 87
SWIDTH 955 0
DWIDTH 18 0
BBX 18 14 0 0
BITMAP
F843C0
706080
78E100
38E100
38F100
397200
3D7200
1D7A00
1E3C00
1E3C00
0E3C00
0C1C00
0C1800
0C1800
ENDCHAR
STARTCHAR X
ENCODING 88
SWIDTH 702 0
DWIDTH 13 0
BBX 13 14 0 0
BITMAP
FC78
7830
3C20
1C40
1EC0
0E80
0F00
0780
0B80
19C0
11E0
20E0
60F0
F1F8
ENDCHAR
STARTCHAR Y
ENCODING 89
SWIDTH 717 0
DWIDTH 14 0
BBX 13 14 0 0
BITMAP
FC38
7030
3820
3C60
1C40
1E80
0F80
0700
0700
0700
0700
0700
0700
1F80
ENDCHAR
STARTCHAR Z
ENCODING 90
SWIDTH 639 0
DWIDTH 12 0
BBX 10 14 1 0
BITMAP
7FC0
43C0
4380
0780
0700
0F00
0E00
1C00
3C00
3800
7800
7040
F0C0
FFC0
ENDCHAR
STARTCHAR bracketleft
ENCODING 91
SWIDTH 327 0
DWIDTH 6 0
BBX 5 18 1 -4
BITMAP
F8
E0
E0
E0
E0
E0
E0
E0
E0
E0
E0
E0
E0
E0
E0
E0
E0
F8
ENDCHAR
STARTCHAR backslash
ENCODING 92
SWIDTH 527 0
DWIDTH 10 0
BBX 10 18 0 -4
BITMAP
C000
4000
6000
2000
2000
1000
1000
0800
0800
0400
0400
0200
0200
0100
0100
0080
0080
0040
ENDCHAR
STARTCHAR bracketright
ENCODING 93
SWIDTH 327 0
DWIDTH 6 0
BBX 5 18 0 -4
BITMAP
F8
38
38
38
38
38
38
38
38
38
38
38
38
38
38
38
38
F8
ENDCHAR
STARTCHAR asciicircum
ENCODING 94
SWIDTH 623 0
DWIDTH 12 0
BBX 11 12 0 2
BITMAP
0400
0400
0400
0A00
0A00
1100
1100
2080
2080
4040
4040
C060
ENDCHAR
STARTCHAR underscore
ENCODING 95
SWIDTH 500 0
DWIDTH 9 0
BBX 8 1 1 -2
BITMAP
FF
ENDCHAR
STARTCHAR quoteleft
ENCODING 96
SWIDTH 265 0
DWIDTH 5 0
BBX 3 5 1 9
BITMAP
60
C0
C0
E0
E0
ENDCHAR
STARTCHAR a
ENCODING 97
SWIDTH 556 0
DWIDTH 11 0
BBX 10 10 0 0
BITMAP
3E00
6380
4380
0380
3F80
F380
E380
E380
E380
7DC0
ENDCHAR
STARTCHAR b
ENCODING 98
SWIDTH 640 0
DWIDTH 12 0
BBX 11 14 0 0
BITMAP
F000
7000
7000
7000
7380
77C0
79E0
70E0
70E0
70E0
70E0
70C0
79C0
7F80
ENDCHAR
STARTCHAR c
ENCODING 99
SWIDTH 541 0
DWIDTH 10 0
BBX 9 10 0 0
BITMAP
1F80
7080
6080
E000
E000
E000
E000
7000
7880
1F80
ENDCHAR
STARTCHAR d
ENCODING 100
SWIDTH 652 0
DWIDTH 12 0
BBX 11 14 1 0
BITMAP
07C0
01C0
01C0
01C0
3DC0
73C0
61C0
E1C0
E1C0
E1C0
E1C0
F3C0
7DC0
39E0
ENDCHAR
STARTCHAR e
ENCODING 101
SWIDTH 568 0
DWIDTH 11 0
BBX 9 10 1 0
BITMAP
1E00
6300
6380
E380
FF80
E000
E000
7000
7880
1F80
ENDCHAR
STARTCHAR f
ENCODING 102
SWIDTH 416 0
DWIDTH 8 0
BBX 9 14 0 0
BITMAP
1F80
3880
3880
3800
FF00
3800
3800
3800
3800
3800
3800
3800
3800
FC00
ENDCHAR
STARTCHAR g
ENCODING 103
SWIDTH 599 0
DWIDTH 11 0
BBX 11 14 0 -4
BITMAP
1FE0
3360
7380
7380
7380
3300
1E00
3000
7F80
3FC0
61C0
E1C0
F380
3F00
ENDCHAR
STARTCHAR h
ENCODING 104
SWIDTH 654 0
DWIDTH 12 0
BBX 12 14 0 0
BITMAP
F800
3800
3800
3800
39C0
3BE0
3CE0
38E0
38E0
38E0
38E0
38E0
38E0
FDF0
ENDCHAR
STARTCHAR i
ENCODING 105
SWIDTH 325 0
DWIDTH 6 0
BBX 6 14 0 0
BITMAP
38
38
38
00
F8
38
38
38
38
38
38
38
38
FC
ENDCHAR
STARTCHAR j
ENCODING 106
SWIDTH 355 0
DWIDTH 7 0
BBX 6 18 0 -4
BITMAP
1C
1C
1C
00
3C
1C
1C
1C
1C
1C
1C
1C
1C
1C
1C
9C
9C
F8
ENDCHAR
STARTCHAR k
ENCODING 107
SWIDTH 654 0
DWIDTH 12 0
BBX 12 14 0 0
BITMAP
F800
3800
3800
3800
38E0
38C0
3980
3900
3B00
3F80
3B80
3BC0
39E0
FCF0
ENDCHAR
STARTCHAR l
ENCODING 108
SWIDTH 325 0
DWIDTH 6 0
BBX 6 14 0 0
BITMAP
F8
38
38
38
38
38
38
38
38
38
38
38
38
FC
ENDCHAR
STARTCHAR m
ENCODING 109
SWIDTH 967 0
DWIDTH 18 0
BBX 18 10 0 0
BITMAP
FBCF00
3FFF80
3CF380
38E380
38E380
38E380
38E380
38E380
38E380
FDF7C0
ENDCHAR
STARTCHAR n
ENCODING 110
SWIDTH 654 0
DWIDTH 12 0
BBX 12 10 0 0
BITMAP
F9C0
7BE0
3CE0
38E0
38E0
38E0
38E0
38E0
38E0
FDF0
ENDCHAR
STARTCHAR o
ENCODING 111
SWIDTH 617 0
DWIDTH 12 0
BBX 11 10 0 0
BITMAP
1F00
71C0
60C0
E0E0
E0E0
E0E0
E0E0
60C0
71C0
1F00
ENDCHAR
STARTCHAR p
ENCODING 112
SWIDTH 652 0
DWIDTH 12 0
BBX 11 14 0 -4
BITMAP
F380
77C0
79E0
70E0
70E0
70E0
70E0
70C0
79C0
7780
7000
7000
7000
F800
ENDCHAR
STARTCHAR q
ENCODING 113
SWIDTH 640 0
DWIDTH 12 0
BBX 11 14 1 -4
BITMAP
3DC0
73C0
61C0
E1C0
E1C0
E1C0
E1C0
F3C0
7DC0
39C0
01C0
01C0
01C0
07E0
ENDCHAR
STARTCHAR r
ENCODING 114
SWIDTH 462 0
DWIDTH 9 0
BBX 9 10 0 0
BITMAP
F980
3F80
3C80
3800
3800
3800
3800
3800
3800
FE00
ENDCHAR
STARTCHAR s
ENCODING 115
SWIDTH 525 0
DWIDTH 10 0
BBX 8 10 1 0
BITMAP
3E
E2
E2
F0
FE
7F
0F
87
87
FC
ENDCHAR
STARTCHAR t
ENCODING 116
SWIDTH 389 0
DWIDTH 7 0
BBX 6 13 1 0
BITMAP
30
70
70
FC
70
70
70
70
70
70
70
70
3C
ENDCHAR
STARTCHAR u
ENCODING 117
SWIDTH 654 0
DWIDTH 12 0
BBX 11 10 1 0
BITMAP
F7C0
71C0
71C0
71C0
71C0
71C0
71C0
73C0
7DC0
39E0
ENDCHAR
STARTCHAR v
ENCODING 118
SWIDTH 657 0
DWIDTH 12 0
BBX 12 10 0 0
BITMAP
F8F0
7860
3840
3840
1C80
1D80
0F00
0F00
0600
0600
ENDCHAR
STARTCHAR w
ENCODING 119
SWIDTH 880 0
DWIDTH 17 0
BBX 17 10 0 0
BITMAP
F84780
70E300
78E200
39F200
397400
1F7400
1E3C00
1E3800
0C3800
0C1000
ENDCHAR
STARTCHAR x
ENCODING 120
SWIDTH 608 0
DWIDTH 12 0
BBX 12 10 0 0
BITMAP
FCF0
7840
3C80
1F00
0F00
0F00
1F80
13C0
61E0
F3F0
ENDCHAR
STARTCHAR y
ENCODING 121
SWIDTH 654 0
DWIDTH 12 0
BBX 12 14 0 -4
BITMAP
FCF0
7020
3840
3840
1C80
1C80
1F00
0F00
0E00
0600
0400
0800
1800
3000
ENDCHAR
STARTCHAR z
ENCODING 122
SWIDTH 584 0
DWIDTH 11 0
BBX 9 10 1 0
BITMAP
FF80
C780
8F00
0E00
1E00
3C00
7800
7080
F080
FF80
ENDCHAR
STARTCHAR braceleft
ENCODING 123
SWIDTH 366 0
DWIDTH 7 0
BBX 5 18 1 -4
BITMAP
38
70
70
70
70
70
70
70
E0
60
70
70
70
70
70
70
70
38
ENDCHAR
STARTCHAR bar
ENCODING 124
SWIDTH 259 0
DWIDTH 5 0
BBX 1 18 2 -4
BITMAP
80
80
80
80
80
80
80
80
80
80
80
80
80
80
80
80
80
80
ENDCHAR
STARTCHAR braceright
ENCODING 125
SWIDTH 366 0
DWIDTH 7 0
BBX 5 18 1 -4
BITMAP
E0
70
70
70
70
70
70
70
38
30
70
70
70
70
70
70
70
E0
ENDCHAR
STARTCHAR asciitilde
ENCODING 126
SWIDTH 623 0
DWIDTH 12 0
BBX 11 4 0 3
BITMAP
7020
4C20
8640
81C0
ENDCHAR
STARTCHAR Aogonek
ENCODING 161
SWIDTH 795 0
DWIDTH 15 0
BBX 15 17 0 -3
BITMAP
0100
0380
0380
03C0
05C0
05E0
08E0
08F0
1070
1FF0
2038
2038
601C
F07E
0004
0008
000E
ENDCHAR
STARTCHAR breve
ENCODING 162
SWIDTH 583 0
DWIDTH 11 0
BBX 7 3 2 11
BITMAP
82
7C
38
ENDCHAR
STARTCHAR Lslash
ENCODING 163
SWIDTH 584 0
DWIDTH 11 0
BBX 11 14 0 0
BITMAP
FC00
3800
3800
3800
3A00
3C00
3800
F800
B800
3800
3800
3820
3820
FFE0
ENDCHAR
STARTCHAR currency
ENCODING 164
SWIDTH 623 0
DWIDTH 12 0
BBX 12 12 0 1
BITMAP
8010
4020
3FC0
39C0
30C0
2040
2040
30C0
39C0
3FC0
4020
8010
ENDCHAR
STARTCHAR Lcaron
ENCODING 165
SWIDTH 584 0
DWIDTH 11 0
BBX 10 14 1 0
BITMAP
FB80
7380
7180
7180
7300
7000
7000
7000
7000
7000
7000
7040
7040
FFC0
ENDCHAR
STARTCHAR Sacute
ENCODING 166
SWIDTH 556 0
DWIDTH 11 0
BBX 9 18 1 0
BITMAP
0380
0600
0C00
0000
3F00
7100
E100
E000
F000
F800
7E00
1F00
0780
0380
0380
8380
C700
FE00
ENDCHAR
STARTCHAR section
ENCODING 167
SWIDTH 623 0
DWIDTH 12 0
BBX 9 18 2 -4
BITMAP
3F00
7100
E100
E000
F000
7E00
3F00
CF80
C380
E180
F980
7F00
3F00
0F80
0380
8380
C700
FE00
ENDCHAR
STARTCHAR dieresis
ENCODING 168
SWIDTH 617 0
DWIDTH 12 0
BBX 6 2 3 12
BITMAP
CC
CC
ENDCHAR
STARTCHAR Scaron
ENCODING 169
SWIDTH 556 0
DWIDTH 11 0
BBX 9 18 1 0
BITMAP
6600
3C00
1800
0000
3F00
7100
E100
E000
F000
F800
7E00
1F00
0780
0380
0380
8380
C700
FE00
ENDCHAR
STARTCHAR Scedilla
ENCODING 170
SWIDTH 556 0
DWIDTH 11 0
BBX 9 18 1 -4
BITMAP
3F00
7100
E100
E000
F000
F800
7E00
1F00
0780
0380
0380
8380
C700
FE00
1000
3800
1800
3800
ENDCHAR
STARTCHAR Tcaron
ENCODING 171
SWIDTH 714 0
DWIDTH 14 0
BBX 13 18 0 0
BITMAP
0CC0
0780
0300
0000
FFF8
C708
8708
0700
0700
0700
0700
0700
0700
0700
0700
0700
0700
1FC0
ENDCHAR
STARTCHAR Zacute
ENCODING 172
SWIDTH 639 0
DWIDTH 12 0
BBX 10 18 1 0
BITMAP
01C0
0300
0600
0000
7FC0
43C0
4380
0780
0700
0F00
0E00
1C00
3C00
3800
7800
7040
F0C0
FFC0
ENDCHAR
STARTCHAR hyphen
ENCODING 173
SWIDTH 289 0
DWIDTH 5 0
BBX 4 2 1 5
BITMAP
F0
F0
ENDCHAR
STARTCHAR Zcaron
ENCODING 174
SWIDTH 639 0
DWIDTH 12 0
BBX 10 18 1 0
BITMAP
3300
1E00
0C00
0000
7FC0
43C0
4380
0780
0700
0F00
0E00
1C00
3C00
3800
7800
7040
F0C0
FFC0
ENDCHAR
STARTCHAR Zdotaccent
ENCODING 175
SWIDTH 639 0
DWIDTH 12 0
BBX 10 18 1 0
BITMAP
0600
0600
0600
0000
7FC0
43C0
4380
0780
0700
0F00
0E00
1C00
3C00
3800
7800
7040
F0C0
FFC0
ENDCHAR
STARTCHAR degree
ENCODING 176
SWIDTH 259 0
DWIDTH 5 0
BBX 3 3 1 11
BITMAP
E0
A0
E0
ENDCHAR
STARTCHAR aogonek
ENCODING 177
SWIDTH 556 0
DWIDTH 11 0
BBX 11 13 0 -3
BITMAP
3E00
6380
4380
0380
3F80
F380
E380
E380
E380
7DC0
0040
0080
00E0
ENDCHAR
STARTCHAR ogonek
ENCODING 178
SWIDTH 477 0
DWIDTH 9 0
BBX 3 3 3 -4
BITMAP
40
80
E0
ENDCHAR
STARTCHAR lslash
ENCODING 179
SWIDTH 325 0
DWIDTH 6 0
BBX 7 14 0 0
BITMAP
F8
38
38
38
38
3E
38
78
B8
38
38
38
38
FE
ENDCHAR
STARTCHAR acute
ENCODING 180
SWIDTH 617 0
DWIDTH 12 0
BBX 5 3 4 11
BITMAP
38
60
C0
ENDCHAR
STARTCHAR lcaron
ENCODING 181
SWIDTH 487 0
DWIDTH 9 0
BBX 10 14 0 0
BITMAP
F9C0
39C0
38C0
38C0
3980
3800
3800
3800
3800
3800
3800
3800
3800
FC00
ENDCHAR
STARTCHAR sacute
ENCODING 182
SWIDTH 525 0
DWIDTH 10 0
BBX 8 14 1 0
BITMAP
07
0C
18
00
3E
E2
E2
F0
FE
7F
0F
87
87
FC
ENDCHAR
STARTCHAR caron
ENCODING 183
SWIDTH 530 0
DWIDTH 10 0
BBX 6 3 2 11
BITMAP
CC
78
30
ENDCHAR
STARTCHAR cedilla
ENCODING 184
SWIDTH 477 0
DWIDTH 9 0
BBX 3 4 3 -4
BITMAP
40
E0
60
E0
ENDCHAR
STARTCHAR scaron
ENCODING 185
SWIDTH 525 0
DWIDTH 10 0
BBX 8 14 1 0
BITMAP
66
3C
18
00
3E
E2
E2
F0
FE
7F
0F
87
87
FC
ENDCHAR
STARTCHAR scedilla
ENCODING 186
SWIDTH 525 0
DWIDTH 10 0
BBX 8 14 1 -4
BITMAP
3E
E2
E2
F0
FE
7F
0F
87
87
FC
10
38
18
38
ENDCHAR
STARTCHAR tcaron
ENCODING 187
SWIDTH 500 0
DWIDTH 9 0
BBX 8 17 1 0
BITMAP
07
07
03
03
36
70
70
FC
70
70
70
70
70
70
70
70
3C
ENDCHAR
STARTCHAR zacute
ENCODING 188
SWIDTH 584 0
DWIDTH 11 0
BBX 9 14 1 0
BITMAP
0380
0600
0C00
0000
FF80
C780
8F00
0E00
1E00
3C00
7800
7080
F080
FF80
ENDCHAR
STARTCHAR hungarumlaut
ENCODING 189
SWIDTH 583 0
DWIDTH 11 0
BBX 7 3 2 11
BITMAP
36
68
90
ENDCHAR
STARTCHAR zcaron
ENCODING 190
SWIDTH 584 0
DWIDTH 11 0
BBX 9 14 1 0
BITMAP
3300
1E00
0C00
0000
FF80
C780
8F00
0E00
1E00
3C00
7800
7080
F080
FF80
ENDCHAR
STARTCHAR zdotaccent
ENCODING 191
SWIDTH 584 0
DWIDTH 11 0
BBX 9 15 1 0
BITMAP
0C00
0C00
0C00
0000
0000
FF80
C780
8F00
0E00
1E00
3C00
7800
7080
F080
FF80
ENDCHAR
STARTCHAR Racute
ENCODING 192
SWIDTH 720 0
DWIDTH 14 0
BBX 13 18 1 0
BITMAP
0700
0C00
1800
0000
FF00
7180
71C0
71C0
71C0
71C0
7380
7F00
7700
7380
73C0
71E0
70F0
F8F8
ENDCHAR
STARTCHAR Aacute
ENCODING 193
SWIDTH 795 0
DWIDTH 15 0
BBX 15 18 0 0
BITMAP
00E0
0180
0300
0000
0100
0380
0380
03C0
05C0
05E0
08E0
08F0
1070
1FF0
2038
2038
601C
F07E
ENDCHAR
STARTCHAR Acircumflex
ENCODING 194
SWIDTH 795 0
DWIDTH 15 0
BBX 15 18 0 0
BITMAP
0180
03C0
0660
0000
0100
0380
0380
03C0
05C0
05E0
08E0
08F0
1070
1FF0
2038
2038
601C
F07E
ENDCHAR
STARTCHAR Abreve
ENCODING 195
SWIDTH 795 0
DWIDTH 15 0
BBX 15 18 0 0
BITMAP
0820
07C0
0380
0000
0100
0380
0380
03C0
05C0
05E0
08E0
08F0
1070
1FF0
2038
2038
601C
F07E
ENDCHAR
STARTCHAR Adieresis
ENCODING 196
SWIDTH 795 0
DWIDTH 15 0
BBX 15 17 0 0
BITMAP
0660
0660
0000
0100
0380
0380
03C0
05C0
05E0
08E0
08F0
1070
1FF0
2038
2038
601C
F07E
ENDCHAR
STARTCHAR Lacute
ENCODING 197
SWIDTH 584 0
DWIDTH 11 0
BBX 10 18 1 0
BITMAP
0E00
1800
3000
0000
F800
7000
7000
7000
7000
7000
7000
7000
7000
7000
7000
7040
7040
FFC0
ENDCHAR
STARTCHAR Cacute
ENCODING 198
SWIDTH 711 0
DWIDTH 13 0
BBX 12 18 1 0
BITMAP
00E0
0180
0300
0000
0FE0
3C30
7010
7010
E000
E000
E000
E000
E000
E000
7000
7000
3C10
0FE0
ENDCHAR
STARTCHAR Ccedilla
ENCODING 199
SWIDTH 711 0
DWIDTH 13 0
BBX 12 18 1 -4
BITMAP
0FE0
3C30
7010
7010
E000
E000
E000
E000
E000
E000
7000
7000
3C10
0FE0
0200
0700
0300
0700
ENDCHAR
STARTCHAR Ccaron
ENCODING 200
SWIDTH 711 0
DWIDTH 13 0
BBX 12 18 1 0
BITMAP
0660
03C0
0180
0000
0FE0
3C30
7010
7010
E000
E000
E000
E000
E000
E000
7000
7000
3C10
0FE0
ENDCHAR
STARTCHAR Eacute
ENCODING 201
SWIDTH 601 0
DWIDTH 11 0
BBX 10 18 1 0
BITMAP
0700
0C00
1800
0000
FF80
7080
7080
7000
7000
7100
7F00
7100
7000
7000
7000
7040
70C0
FFC0
ENDCHAR
STARTCHAR Eogonek
ENCODING 202
SWIDTH 601 0
DWIDTH 11 0
BBX 10 17 1 -3
BITMAP
FF80
7080
7080
7000
7000
7100
7F00
7100
7000
7000
7000
7040
70C0
FFC0
0080
0100
01C0
ENDCHAR
STARTCHAR Edieresis
ENCODING 203
SWIDTH 601 0
DWIDTH 11 0
BBX 10 17 1 0
BITMAP
3300
3300
0000
FF80
7080
7080
7000
7000
7100
7F00
7100
7000
7000
7000
7040
70C0
FFC0
ENDCHAR
STARTCHAR Ecaron
ENCODING 204
SWIDTH 601 0
DWIDTH 11 0
BBX 10 18 1 0
BITMAP
3300
1E00
0C00
0000
FF80
7080
7080
7000
7000
7100
7F00
7100
7000
7000
7000
7040
70C0
FFC0
ENDCHAR
STARTCHAR Iacute
ENCODING 205
SWIDTH 349 0
DWIDTH 7 0
BBX 6 18 1 0
BITMAP
1C
30
60
00
F8
70
70
70
70
70
70
70
70
70
70
70
70
F8
ENDCHAR
STARTCHAR Icircumflex
ENCODING 206
SWIDTH 349 0
DWIDTH 7 0
BBX 6 18 2 0
BITMAP
30
78
CC
00
7C
38
38
38
38
38
38
38
38
38
38
38
38
7C
ENDCHAR
STARTCHAR Dcaron
ENCODING 207
SWIDTH 794 0
DWIDTH 15 0
BBX 13 18 1 0
BITMAP
1980
0F00
0600
0000
FF80
70E0
7070
7030
7038
7038
7038
7038
7038
7038
7030
7070
70E0
FF80
ENDCHAR
STARTCHAR Eth
ENCODING 208
SWIDTH 794 0
DWIDTH 15 0
BBX 14 14 0 0
BITMAP
FFC0
3870
3838
3818
381C
381C
FF1C
381C
381C
381C
3818
3838
3870
FFC0
ENDCHAR
STARTCHAR Nacute
ENCODING 209
SWIDTH 788 0
DWIDTH 15 0
BBX 13 18 1 0
BITMAP
00E0
0180
0300
0000
F038
7010
7810
7C10
5E10
5E10
4F10
4790
4390
41D0
41F0
40F0
4070
E030
ENDCHAR
STARTCHAR Ncaron
ENCODING 210
SWIDTH 788 0
DWIDTH 15 0
BBX 13 18 1 0
BITMAP
0660
03C0
0180
0000
F038
7010
7810
7C10
5E10
5E10
4F10
4790
4390
41D0
41F0
40F0
4070
E030
ENDCHAR
STARTCHAR Oacute
ENCODING 211
SWIDTH 810 0
DWIDTH 15 0
BBX 14 18 1 0
BITMAP
01C0
0300
0600
0000
0FC0
3870
7038
7038
E01C
E01C
E01C
E01C
E01C
E01C
7038
7038
3870
0FC0
ENDCHAR
STARTCHAR Ocircumflex
ENCODING 212
SWIDTH 810 0
DWIDTH 15 0
BBX 14 18 1 0
BITMAP
0300
0780
0CC0
0000
0FC0
3870
7038
7038
E01C
E01C
E01C
E01C
E01C
E01C
7038
7038
3870
0FC0
ENDCHAR
STARTCHAR Ohungarumlaut
ENCODING 213
SWIDTH 810 0
DWIDTH 15 0
BBX 14 18 1 0
BITMAP
01B0
0340
0480
0000
0FC0
3870
7038
7038
E01C
E01C
E01C
E01C
E01C
E01C
7038
7038
3870
0FC0
ENDCHAR
STARTCHAR Odieresis
ENCODING 214
SWIDTH 810 0
DWIDTH 15 0
BBX 14 17 1 0
BITMAP
0CC0
0CC0
0000
0FC0
3870
7038
7038
E01C
E01C
E01C
E01C
E01C
E01C
7038
7038
3870
0FC0
ENDCHAR
STARTCHAR multiply
ENCODING 215
SWIDTH 623 0
DWIDTH 12 0
BBX 11 12 0 0
BITMAP
C020
4060
2080
1100
1B00
0E00
0E00
1B00
1100
2080
C040
8060
ENDCHAR
STARTCHAR Rcaron
ENCODING 216
SWIDTH 720 0
DWIDTH 14 0
BBX 13 18 1 0
BITMAP
3300
1E00
0C00
0000
FF00
7180
71C0
71C0
71C0
71C0
7380
7F00
7700
7380
73C0
71E0
70F0
F8F8
ENDCHAR
STARTCHAR Uring
ENCODING 217
SWIDTH 747 0
DWIDTH 14 0
BBX 14 18 0 0
BITMAP
0380
0280
0380
0000
F83C
7010
7010
7010
7010
7010
7010
7010
7010
7010
7010
7030
3820
1FC0
ENDCHAR
STARTCHAR Uacute
ENCODING 218
SWIDTH 747 0
DWIDTH 14 0
BBX 14 18 0 0
BITMAP
01C0
0300
0600
0000
F83C
7010
7010
7010
7010
7010
7010
7010
7010
7010
7010
7030
3820
1FC0
ENDCHAR
STARTCHAR Uhungarumlaut
ENCODING 219
SWIDTH 747 0
DWIDTH 14 0
BBX 14 18 0 0
BITMAP
01B0
0340
0480
0000
F83C
7010
7010
7010
7010
7010
7010
7010
7010
7010
7010
7030
3820
1FC0
ENDCHAR
STARTCHAR Udieresis
ENCODING 220
SWIDTH 747 0
DWIDTH 14 0
BBX 14 17 0 0
BITMAP
0CC0
0CC0
0000
F83C
7010
7010
7010
7010
7010
7010
7010
7010
7010
7010
7030
3820
1FC0
ENDCHAR
STARTCHAR Yacute
ENCODING 221
SWIDTH 717 0
DWIDTH 14 0
BBX 13 18 0 0
BITMAP
01C0
0300
0600
0000
FC38
7030
3820
3C60
1C40
1E80
0F80
0700
0700
0700
0700
0700
0700
1F80
ENDCHAR
STARTCHAR Tcedilla
ENCODING 222
SWIDTH 714 0
DWIDTH 14 0
BBX 13 18 0 -4
BITMAP
FFF8
C708
8708
0700
0700
0700
0700
0700
0700
0700
0700
0700
0700
1FC0
0200
0700
0300
0700
ENDCHAR
STARTCHAR germandbls
ENCODING 223
SWIDTH 700 0
DWIDTH 13 0
BBX 12 14 1 0
BITMAP
1F80
31C0
71C0
7180
7300
7200
7700
7780
73E0
71F0
70F0
7270
7270
FBE0
ENDCHAR
STARTCHAR racute
ENCODING 224
SWIDTH 462 0
DWIDTH 9 0
BBX 9 14 0 0
BITMAP
0380
0600
0C00
0000
F980
3F80
3C80
3800
3800
3800
3800
3800
3800
FE00
ENDCHAR
STARTCHAR aacute
ENCODING 225
SWIDTH 556 0
DWIDTH 11 0
BBX 10 14 0 0
BITMAP
0700
0C00
1800
0000
3E00
6380
4380
0380
3F80
F380
E380
E380
E380
7DC0
ENDCHAR
STARTCHAR acircumflex
ENCODING 226
SWIDTH 556 0
DWIDTH 11 0
BBX 10 14 0 0
BITMAP
0C00
1E00
3300
0000
3E00
6380
4380
0380
3F80
F380
E380
E380
E380
7DC0
ENDCHAR
STARTCHAR abreve
ENCODING 227
SWIDTH 556 0
DWIDTH 11 0
BBX 10 14 0 0
BITMAP
2080
1F00
0E00
0000
3E00
6380
4380
0380
3F80
F380
E380
E380
E380
7DC0
ENDCHAR
STARTCHAR adieresis
ENCODING 228
SWIDTH 556 0
DWIDTH 11 0
BBX 10 13 0 0
BITMAP
3300
3300
0000
3E00
6380
4380
0380
3F80
F380
E380
E380
E380
7DC0
ENDCHAR
STARTCHAR lacute
ENCODING 229
SWIDTH 325 0
DWIDTH 6 0
BBX 7 18 0 0
BITMAP
0E
18
30
00
F8
38
38
38
38
38
38
38
38
38
38
38
38
FC
ENDCHAR
STARTCHAR cacute
ENCODING 230
SWIDTH 541 0
DWIDTH 10 0
BBX 10 14 0 0
BITMAP
01C0
0300
0600
0000
1F80
7080
6080
E000
E000
E000
E000
7000
7880
1F80
ENDCHAR
STARTCHAR ccedilla
ENCODING 231
SWIDTH 541 0
DWIDTH 10 0
BBX 9 14 0 -4
BITMAP
1F80
7080
6080
E000
E000
E000
E000
7000
7880
1F80
0800
1C00
0C00
1C00
ENDCHAR
STARTCHAR ccaron
ENCODING 232
SWIDTH 541 0
DWIDTH 10 0
BBX 9 14 0 0
BITMAP
1980
0F00
0600
0000
1F80
7080
6080
E000
E000
E000
E000
7000
7880
1F80
ENDCHAR
STARTCHAR eacute
ENCODING 233
SWIDTH 568 0
DWIDTH 11 0
BBX 9 14 1 0
BITMAP
0700
0C00
1800
0000
1E00
6300
6380
E380
FF80
E000
E000
7000
7880
1F80
ENDCHAR
STARTCHAR eogonek
ENCODING 234
SWIDTH 568 0
DWIDTH 11 0
BBX 9 13 1 -3
BITMAP
1E00
6300
6380
E380
FF80
E000
E000
7000
7880
1F80
0400
0800
0E00
ENDCHAR
STARTCHAR edieresis
ENCODING 235
SWIDTH 568 0
DWIDTH 11 0
BBX 9 13 1 0
BITMAP
3300
3300
0000
1E00
6300
6380
E380
FF80
E000
E000
7000
7880
1F80
ENDCHAR
STARTCHAR ecaron
ENCODING 236
SWIDTH 568 0
DWIDTH 11 0
BBX 9 14 1 0
BITMAP
3300
1E00
0C00
0000
1E00
6300
6380
E380
FF80
E000
E000
7000
7880
1F80
ENDCHAR
STARTCHAR iacute
ENCODING 237
SWIDTH 325 0
DWIDTH 6 0
BBX 6 14 0 0
BITMAP
1C
30
60
00
F8
38
38
38
38
38
38
38
38
FC
ENDCHAR
STARTCHAR icircumflex
ENCODING 238
SWIDTH 325 0
DWIDTH 6 0
BBX 6 14 0 0
BITMAP
30
78
CC
00
F8
38
38
38
38
38
38
38
38
FC
ENDCHAR
STARTCHAR dcaron
ENCODING 239
SWIDTH 760 0
DWIDTH 14 0
BBX 14 14 1 0
BITMAP
07DC
01DC
01CC
01CC
3DD8
73C0
61C0
E1C0
E1C0
E1C0
E1C0
F3C0
7DC0
39E0
ENDCHAR
STARTCHAR dmacron
ENCODING 240
SWIDTH 652 0
DWIDTH 12 0
BBX 12 14 1 0
BITMAP
07C0
01C0
1FF0
1FF0
3DC0
73C0
61C0
E1C0
E1C0
E1C0
E1C0
F3C0
7DC0
39E0
ENDCHAR
STARTCHAR nacute
ENCODING 241
SWIDTH 654 0
DWIDTH 12 0
BBX 12 14 0 0
BITMAP
00E0
0180
0300
0000
F9C0
7BE0
3CE0
38E0
38E0
38E0
38E0
38E0
38E0
FDF0
ENDCHAR
STARTCHAR ncaron
ENCODING 242
SWIDTH 654 0
DWIDTH 12 0
BBX 12 14 0 0
BITMAP
0CC0
0780
0300
0000
F9C0
7BE0
3CE0
38E0
38E0
38E0
38E0
38E0
38E0
FDF0
ENDCHAR
STARTCHAR oacute
ENCODING 243
SWIDTH 617 0
DWIDTH 12 0
BBX 11 14 0 0
BITMAP
0380
0600
0C00
0000
1F00
71C0
60C0
E0E0
E0E0
E0E0
E0E0
60C0
71C0
1F00
ENDCHAR
STARTCHAR ocircumflex
ENCODING 244
SWIDTH 617 0
DWIDTH 12 0
BBX 11 14 0 0
BITMAP
0C00
1E00
3300
0000
1F00
71C0
60C0
E0E0
E0E0
E0E0
E0E0
60C0
71C0
1F00
ENDCHAR
STARTCHAR ohungarumlaut
ENCODING 245
SWIDTH 617 0
DWIDTH 12 0
BBX 11 14 0 0
BITMAP
0360
0680
0900
0000
1F00
71C0
60C0
E0E0
E0E0
E0E0
E0E0
60C0
71C0
1F00
ENDCHAR
STARTCHAR odieresis
ENCODING 246
SWIDTH 617 0
DWIDTH 12 0
BBX 11 13 0 0
BITMAP
3300
3300
0000
1F00
71C0
60C0
E0E0
E0E0
E0E0
E0E0
60C0
71C0
1F00
ENDCHAR
STARTCHAR divide
ENCODING 247
SWIDTH 623 0
DWIDTH 12 0
BBX 10 10 1 0
BITMAP
0C00
0C00
0000
0000
0000
FFC0
0000
0000
0C00
0C00
ENDCHAR
STARTCHAR rcaron
ENCODING 248
SWIDTH 462 0
DWIDTH 9 0
BBX 9 14 0 0
BITMAP
1980
0F00
0600
0000
F980
3F80
3C80
3800
3800
3800
3800
3800
3800
FE00
ENDCHAR
STARTCHAR uring
ENCODING 249
SWIDTH 654 0
DWIDTH 12 0
BBX 11 14 1 0
BITMAP
0E00
0A00
0E00
0000
F7C0
71C0
71C0
71C0
71C0
71C0
71C0
73C0
7DC0
39E0
ENDCHAR
STARTCHAR uacute
ENCODING 250
SWIDTH 654 0
DWIDTH 12 0
BBX 11 14 1 0
BITMAP
0380
0600
0C00
0000
F7C0
71C0
71C0
71C0
71C0
71C0
71C0
73C0
7DC0
39E0
ENDCHAR
STARTCHAR uhungarumlaut
ENCODING 251
SWIDTH 654 0
DWIDTH 12 0
BBX 11 14 1 0
BITMAP
06C0
0D00
1200
0000
F7C0
71C0
71C0
71C0
71C0
71C0
71C0
73C0
7DC0
39E0
ENDCHAR
STARTCHAR udieresis
ENCODING 252
SWIDTH 654 0
DWIDTH 12 0
BBX 11 13 1 0
BITMAP
1980
1980
0000
F7C0
71C0
71C0
71C0
71C0
71C0
71C0
73C0
7DC0
39E0
ENDCHAR
STARTCHAR yacute
ENCODING 253
SWIDTH 654 0
DWIDTH 12 0
BBX 12 18 0 -4
BITMAP
0380
0600
0C00
0000
FCF0
7020
3840
3840
1C80
1C80
1F00
0F00
0E00
0600
0400
0800
1800
3000
ENDCHAR
STARTCHAR tcedilla
ENCODING 254
SWIDTH 389 0
DWIDTH 7 0
BBX 6 17 1 -4
BITMAP
30
70
70
FC
70
70
70
70
70
70
70
70
3C
08
1C
0C
1C
ENDCHAR
STARTCHAR dotaccent
ENCODING 255
SWIDTH 424 0
DWIDTH 8 0
BBX 2 3 3 11
BITMAP
C0
C0
C0
ENDCHAR
ENDFONT
