STARTFONT 2.1
COMMENT +
COMMENT  Copyright 1986, 1985 Bigelow & Holmes. 
COMMENT  Copyright 1996 BIZNET Poland, Inc.
COMMENT -
FONT -BIZNET-FotinosBright-Medium-I-Normal--18-180-75-75-P-102-ISO8859-2
SIZE 18 72 72
FONTBOUNDINGBOX 17 17 -1 -3
STARTPROPERTIES 21
FOUNDRY "BIZNET"
FAMILY_NAME "BIZNET FotinosBright"
WEIGHT_NAME "Medium"
SLANT "I"
SETWIDTH_NAME "Normal"
ADD_STYLE_NAME ""
PIXEL_SIZE 18
POINT_SIZE 180
RESOLUTION_X 75
RESOLUTION_Y 75
SPACING "P"
AVERAGE_WIDTH 102
CHARSET_REGISTRY "ISO8859"
CHARSET_ENCODING "2"
FONT_ASCENT 16
FONT_DESCENT 4
FACE_NAME "BIZNET Fotinos Bright Italic"
DEFAULT_CHAR 0
CHARSET_COLLECTIONS "ASCII ISO8859-2"
COPYRIGHT "Copyright Bigelow & Holmes 1986, 1985. Copyright (c) 1996 BIZNET Poland, Inc. All Rights Reserved."
NOTICE "The name "BIZNET" is a registered trademark of BIZNET Poland, Inc."
ENDPROPERTIES
CHARS 190
STARTCHAR space
ENCODING 32
SWIDTH 333 0
DWIDTH 5 0
BBX 1 1 0 0
BITMAP
00
ENDCHAR
STARTCHAR exclam
ENCODING 33
SWIDTH 265 0
DWIDTH 5 0
BBX 4 13 2 0
BITMAP
30
30
30
20
20
20
40
40
40
40
00
00
C0
ENDCHAR
STARTCHAR quotedbl
ENCODING 34
SWIDTH 377 0
DWIDTH 7 0
BBX 5 4 3 9
BITMAP
D8
D0
90
90
ENDCHAR
STARTCHAR numbersign
ENCODING 35
SWIDTH 608 0
DWIDTH 11 0
BBX 11 13 1 0
BITMAP
0220
0240
0440
0480
7FE0
0900
1100
1200
FFC0
2400
4400
4800
8800
ENDCHAR
STARTCHAR dollar
ENCODING 36
SWIDTH 608 0
DWIDTH 11 0
BBX 9 15 3 -1
BITMAP
0400
1F80
3580
6900
6800
6800
3800
1C00
1E00
1300
1300
9200
9400
F800
2000
ENDCHAR
STARTCHAR percent
ENCODING 37
SWIDTH 759 0
DWIDTH 14 0
BBX 13 13 2 0
BITMAP
3C18
2420
4460
44C0
4C80
3900
02E0
0590
0910
1310
2330
6120
C1C0
ENDCHAR
STARTCHAR ampersand
ENCODING 38
SWIDTH 727 0
DWIDTH 13 0
BBX 13 13 1 0
BITMAP
0380
04C0
0CC0
0CC0
0D80
1E00
64F8
C620
C220
C340
C1C0
6180
3EE0
ENDCHAR
STARTCHAR quoteright
ENCODING 39
SWIDTH 265 0
DWIDTH 5 0
BBX 3 5 3 8
BITMAP
60
60
60
40
C0
ENDCHAR
STARTCHAR parenleft
ENCODING 40
SWIDTH 310 0
DWIDTH 6 0
BBX 6 16 2 -3
BITMAP
04
08
10
20
20
60
40
C0
C0
C0
C0
C0
80
40
40
20
ENDCHAR
STARTCHAR parenright
ENCODING 41
SWIDTH 310 0
DWIDTH 6 0
BBX 6 16 0 -3
BITMAP
10
08
08
0C
0C
0C
0C
0C
0C
08
18
10
10
20
40
80
ENDCHAR
STARTCHAR asterisk
ENCODING 42
SWIDTH 458 0
DWIDTH 8 0
BBX 7 7 3 6
BITMAP
18
10
D6
2C
30
C8
48
ENDCHAR
STARTCHAR plus
ENCODING 43
SWIDTH 608 0
DWIDTH 11 0
BBX 11 11 1 0
BITMAP
0200
0200
0400
0400
0400
FFE0
0400
0800
0800
0800
0800
ENDCHAR
STARTCHAR comma
ENCODING 44
SWIDTH 265 0
DWIDTH 5 0
BBX 3 5 1 -3
BITMAP
60
60
60
40
C0
ENDCHAR
STARTCHAR minus
ENCODING 45
SWIDTH 608 0
DWIDTH 11 0
BBX 11 1 1 5
BITMAP
FFE0
ENDCHAR
STARTCHAR period
ENCODING 46
SWIDTH 265 0
DWIDTH 5 0
BBX 3 2 1 0
BITMAP
E0
E0
ENDCHAR
STARTCHAR slash
ENCODING 47
SWIDTH 458 0
DWIDTH 8 0
BBX 11 16 0 -3
BITMAP
0020
0040
0080
0080
0100
0300
0200
0400
0400
0800
1800
1000
2000
2000
4000
8000
ENDCHAR
STARTCHAR zero
ENCODING 48
SWIDTH 608 0
DWIDTH 11 0
BBX 10 13 2 0
BITMAP
0F00
1980
3080
60C0
60C0
C0C0
C080
C180
C180
C100
C300
6600
3C00
ENDCHAR
STARTCHAR one
ENCODING 49
SWIDTH 608 0
DWIDTH 11 0
BBX 7 13 2 0
BITMAP
1E
06
04
04
0C
0C
0C
08
18
18
18
18
FE
ENDCHAR
STARTCHAR two
ENCODING 50
SWIDTH 608 0
DWIDTH 11 0
BBX 10 13 2 0
BITMAP
0F80
11C0
20C0
00C0
00C0
0180
0300
0400
1800
2000
6000
4000
FF00
ENDCHAR
STARTCHAR three
ENCODING 51
SWIDTH 608 0
DWIDTH 11 0
BBX 9 13 2 0
BITMAP
1F00
1180
2180
0180
0180
0300
3C00
0200
0300
0300
8300
8600
FC00
ENDCHAR
STARTCHAR four
ENCODING 52
SWIDTH 608 0
DWIDTH 11 0
BBX 9 13 1 0
BITMAP
0080
0380
0500
0900
1300
2300
2300
4200
FF80
0600
0600
0600
1F00
ENDCHAR
STARTCHAR five
ENCODING 53
SWIDTH 608 0
DWIDTH 11 0
BBX 10 13 2 0
BITMAP
1FC0
2000
2000
2000
3C00
0600
0300
0300
0300
0300
8300
8600
F800
ENDCHAR
STARTCHAR six
ENCODING 54
SWIDTH 608 0
DWIDTH 11 0
BBX 10 13 2 0
BITMAP
0780
18C0
3080
6000
6000
7F00
E300
C180
C180
C180
C300
6600
3C00
ENDCHAR
STARTCHAR seven
ENCODING 55
SWIDTH 608 0
DWIDTH 11 0
BBX 10 13 3 0
BITMAP
7FC0
0080
0080
0100
0200
0400
0800
1000
3000
2000
6000
C000
C000
ENDCHAR
STARTCHAR eight
ENCODING 56
SWIDTH 608 0
DWIDTH 11 0
BBX 9 13 2 0
BITMAP
0F00
1180
3180
2180
3100
1E00
3E00
4700
C300
C300
C300
C600
7C00
ENDCHAR
STARTCHAR nine
ENCODING 57
SWIDTH 608 0
DWIDTH 11 0
BBX 10 13 2 0
BITMAP
0F00
1180
2080
60C0
60C0
60C0
6180
3F80
0180
0300
8300
8600
7800
ENDCHAR
STARTCHAR colon
ENCODING 58
SWIDTH 265 0
DWIDTH 5 0
BBX 4 9 1 0
BITMAP
30
70
00
00
00
00
00
E0
C0
ENDCHAR
STARTCHAR semicolon
ENCODING 59
SWIDTH 265 0
DWIDTH 5 0
BBX 5 12 1 -3
BITMAP
18
38
00
00
00
00
00
60
60
60
60
C0
ENDCHAR
STARTCHAR less
ENCODING 60
SWIDTH 608 0
DWIDTH 11 0
BBX 11 11 2 0
BITMAP
0020
00C0
0300
0C00
3000
C000
3000
1800
0600
0100
0080
ENDCHAR
STARTCHAR equal
ENCODING 61
SWIDTH 608 0
DWIDTH 11 0
BBX 11 4 1 3
BITMAP
7FE0
0000
0000
FFC0
ENDCHAR
STARTCHAR greater
ENCODING 62
SWIDTH 608 0
DWIDTH 11 0
BBX 11 11 0 0
BITMAP
2000
1000
0C00
0300
0180
0060
0180
0600
1800
6000
8000
ENDCHAR
STARTCHAR question
ENCODING 63
SWIDTH 471 0
DWIDTH 8 0
BBX 7 13 3 0
BITMAP
7C
C6
86
06
04
08
10
20
60
40
00
00
C0
ENDCHAR
STARTCHAR at
ENCODING 64
SWIDTH 861 0
DWIDTH 16 0
BBX 14 13 2 0
BITMAP
03E0
0C18
3004
23E4
4444
8844
88C4
88C4
89C8
8E70
4000
2080
1F00
ENDCHAR
STARTCHAR A
ENCODING 65
SWIDTH 747 0
DWIDTH 13 0
BBX 13 13 0 0
BITMAP
00C0
00C0
01C0
03C0
02C0
0460
0C60
0860
1FE0
1060
2020
4030
F0F8
ENDCHAR
STARTCHAR B
ENCODING 66
SWIDTH 606 0
DWIDTH 11 0
BBX 11 13 0 0
BITMAP
3FC0
0C60
0C60
0860
1840
1880
1F00
19C0
10C0
30C0
30C0
31C0
FF00
ENDCHAR
STARTCHAR C
ENCODING 67
SWIDTH 714 0
DWIDTH 13 0
BBX 12 13 2 0
BITMAP
07F0
1C30
3030
3000
6000
6000
C000
C000
C000
C000
E000
70C0
3F00
ENDCHAR
STARTCHAR D
ENCODING 68
SWIDTH 770 0
DWIDTH 14 0
BBX 14 13 0 0
BITMAP
3FF0
0C38
0C1C
080C
180C
180C
180C
180C
3018
3018
3030
30E0
FF80
ENDCHAR
STARTCHAR E
ENCODING 69
SWIDTH 569 0
DWIDTH 10 0
BBX 11 13 1 0
BITMAP
3FE0
1820
1820
1800
1800
1880
1F80
3100
3000
3000
3080
3080
FF80
ENDCHAR
STARTCHAR F
ENCODING 70
SWIDTH 551 0
DWIDTH 10 0
BBX 11 13 1 0
BITMAP
3FE0
1820
1820
1800
1800
1880
1F80
3100
3000
3000
3000
3000
F800
ENDCHAR
STARTCHAR G
ENCODING 71
SWIDTH 756 0
DWIDTH 14 0
BBX 12 13 2 0
BITMAP
07F0
1C30
3020
3000
6000
4000
C000
C1F0
C0C0
C0C0
E0C0
70C0
3F00
ENDCHAR
STARTCHAR H
ENCODING 72
SWIDTH 776 0
DWIDTH 14 0
BBX 16 13 0 0
BITMAP
1F1F
0C0C
0C0C
080C
1808
1818
1FF8
1818
1018
3010
3030
3030
F8F8
ENDCHAR
STARTCHAR I
ENCODING 73
SWIDTH 325 0
DWIDTH 6 0
BBX 8 13 0 0
BITMAP
1F
0C
0C
0C
08
18
18
18
10
30
30
30
F8
ENDCHAR
STARTCHAR J
ENCODING 74
SWIDTH 422 0
DWIDTH 8 0
BBX 10 16 0 -3
BITMAP
07C0
0380
0300
0300
0300
0200
0600
0600
0600
0600
0400
0C00
0C00
CC00
9800
F000
ENDCHAR
STARTCHAR K
ENCODING 75
SWIDTH 698 0
DWIDTH 13 0
BBX 14 13 0 0
BITMAP
1F3C
0C18
0C20
0CC0
1980
1A00
1E00
1B00
1380
31C0
30C0
3060
F9F0
ENDCHAR
STARTCHAR L
ENCODING 76
SWIDTH 572 0
DWIDTH 10 0
BBX 10 13 0 0
BITMAP
3F00
0C00
0C00
0800
1800
1800
1800
1800
3000
3000
3040
30C0
FFC0
ENDCHAR
STARTCHAR M
ENCODING 77
SWIDTH 865 0
DWIDTH 16 0
BBX 17 13 1 0
BITMAP
3C0780
0C0600
0C0E00
161E00
161600
162400
126C00
134C00
238C00
238800
210800
201800
F03E00
ENDCHAR
STARTCHAR N
ENCODING 78
SWIDTH 762 0
DWIDTH 14 0
BBX 16 13 0 0
BITMAP
3C1F
0C04
0E04
1608
1308
1308
1188
10C8
20D0
2070
2070
2030
F020
ENDCHAR
STARTCHAR O
ENCODING 79
SWIDTH 783 0
DWIDTH 14 0
BBX 13 13 2 0
BITMAP
07C0
0C70
3030
2018
6018
4018
C018
C030
C030
C060
C0C0
6180
3E00
ENDCHAR
STARTCHAR P
ENCODING 80
SWIDTH 579 0
DWIDTH 10 0
BBX 12 13 0 0
BITMAP
1FE0
0C30
0C30
0C30
1830
1860
18C0
1F80
1800
3000
3000
3000
FC00
ENDCHAR
STARTCHAR Q
ENCODING 81
SWIDTH 788 0
DWIDTH 14 0
BBX 14 16 2 -3
BITMAP
07C0
0C70
3030
2018
6018
4018
C010
C030
C030
C060
C0E0
61C0
3F00
0300
0080
007C
ENDCHAR
STARTCHAR R
ENCODING 82
SWIDTH 686 0
DWIDTH 12 0
BBX 12 13 0 0
BITMAP
1FE0
0C60
0C30
0820
1860
18C0
1F00
1B00
1180
3180
30C0
30E0
F870
ENDCHAR
STARTCHAR S
ENCODING 83
SWIDTH 549 0
DWIDTH 10 0
BBX 10 13 1 0
BITMAP
0F80
18C0
3040
3040
3800
1C00
0E00
0300
0180
8180
8180
C300
7C00
ENDCHAR
STARTCHAR T
ENCODING 84
SWIDTH 663 0
DWIDTH 12 0
BBX 12 13 2 0
BITMAP
FFF0
C610
8610
0400
0C00
0C00
0C00
0C00
0800
1800
1800
1800
7E00
ENDCHAR
STARTCHAR U
ENCODING 85
SWIDTH 727 0
DWIDTH 13 0
BBX 13 13 3 0
BITMAP
F878
7020
6020
6020
6040
6040
4040
C040
C040
C080
C080
6100
3E00
ENDCHAR
STARTCHAR V
ENCODING 86
SWIDTH 656 0
DWIDTH 12 0
BBX 13 13 2 0
BITMAP
F838
6010
6020
2060
3040
3080
3180
3100
1200
1A00
1C00
1800
1800
ENDCHAR
STARTCHAR W
ENCODING 87
SWIDTH 878 0
DWIDTH 16 0
BBX 17 13 2 0
BITMAP
F88780
608300
61C200
61C400
62C400
62C800
64C800
24D000
28D000
28E000
30E000
30C000
204000
ENDCHAR
STARTCHAR X
ENCODING 88
SWIDTH 624 0
DWIDTH 11 0
BBX 14 13 0 0
BITMAP
1F1C
0C18
0630
0660
02C0
0380
0380
0380
0D80
08C0
10C0
2060
F1F0
ENDCHAR
STARTCHAR Y
ENCODING 89
SWIDTH 663 0
DWIDTH 12 0
BBX 12 13 2 0
BITMAP
F870
6060
3040
3080
1900
1A00
1C00
0800
1800
1800
1800
3800
7C00
ENDCHAR
STARTCHAR Z
ENCODING 90
SWIDTH 633 0
DWIDTH 11 0
BBX 12 13 1 0
BITMAP
1FF0
1060
30C0
01C0
0180
0300
0600
0C00
1800
3800
3040
6040
FFC0
ENDCHAR
STARTCHAR bracketleft
ENCODING 91
SWIDTH 310 0
DWIDTH 6 0
BBX 7 16 1 -3
BITMAP
1E
18
18
10
30
30
30
20
20
60
60
40
40
40
C0
F0
ENDCHAR
STARTCHAR backslash
ENCODING 92
SWIDTH 458 0
DWIDTH 8 0
BBX 5 16 3 -3
BITMAP
80
80
40
40
40
40
20
20
20
20
10
10
10
10
08
08
ENDCHAR
STARTCHAR bracketright
ENCODING 93
SWIDTH 310 0
DWIDTH 6 0
BBX 7 16 0 -3
BITMAP
1E
06
04
04
04
0C
0C
08
08
18
18
18
10
30
30
F0
ENDCHAR
STARTCHAR asciicircum
ENCODING 94
SWIDTH 608 0
DWIDTH 11 0
BBX 11 11 0 2
BITMAP
0100
0100
0300
0480
0480
0880
10C0
3040
2040
4040
C020
ENDCHAR
STARTCHAR underscore
ENCODING 95
SWIDTH 500 0
DWIDTH 9 0
BBX 7 1 1 -1
BITMAP
FE
ENDCHAR
STARTCHAR quoteleft
ENCODING 96
SWIDTH 265 0
DWIDTH 5 0
BBX 3 5 3 8
BITMAP
60
40
C0
E0
C0
ENDCHAR
STARTCHAR a
ENCODING 97
SWIDTH 608 0
DWIDTH 11 0
BBX 10 9 1 0
BITMAP
0FC0
10C0
2080
6180
4180
C380
C580
C900
73C0
ENDCHAR
STARTCHAR b
ENCODING 98
SWIDTH 596 0
DWIDTH 11 0
BBX 10 13 1 0
BITMAP
7800
1000
3000
3000
3380
24C0
28C0
70C0
6080
6180
4100
C200
FC00
ENDCHAR
STARTCHAR c
ENCODING 99
SWIDTH 487 0
DWIDTH 9 0
BBX 8 9 2 0
BITMAP
0F
31
61
40
C0
C0
C0
C2
7C
ENDCHAR
STARTCHAR d
ENCODING 100
SWIDTH 608 0
DWIDTH 11 0
BBX 11 13 1 0
BITMAP
01E0
0060
0040
00C0
0FC0
10C0
20C0
6080
4180
C380
C580
C900
73C0
ENDCHAR
STARTCHAR e
ENCODING 101
SWIDTH 518 0
DWIDTH 9 0
BBX 8 9 2 0
BITMAP
0E
33
63
42
FC
C0
C1
E6
7C
ENDCHAR
STARTCHAR f
ENCODING 102
SWIDTH 380 0
DWIDTH 7 0
BBX 9 17 1 -3
BITMAP
0780
0880
0880
1800
1000
7E00
3000
3000
3000
2000
6000
6000
6000
6000
4000
C000
C000
ENDCHAR
STARTCHAR g
ENCODING 103
SWIDTH 602 0
DWIDTH 11 0
BBX 10 12 1 -3
BITMAP
07C0
18C0
30C0
2080
6180
6380
6380
6500
7B00
0300
C200
7C00
ENDCHAR
STARTCHAR h
ENCODING 104
SWIDTH 631 0
DWIDTH 11 0
BBX 10 13 2 0
BITMAP
7800
1000
3000
3000
3380
24C0
68C0
7080
6180
6180
4180
C180
C3C0
ENDCHAR
STARTCHAR i
ENCODING 105
SWIDTH 289 0
DWIDTH 5 0
BBX 4 13 2 0
BITMAP
30
00
00
00
E0
60
60
60
40
40
40
C0
E0
ENDCHAR
STARTCHAR j
ENCODING 106
SWIDTH 343 0
DWIDTH 6 0
BBX 9 16 -1 -3
BITMAP
0180
0000
0000
0000
0700
0300
0300
0300
0200
0600
0600
0600
0400
8C00
8800
F000
ENDCHAR
STARTCHAR k
ENCODING 107
SWIDTH 560 0
DWIDTH 10 0
BBX 9 13 2 0
BITMAP
7000
3000
3000
3000
2180
2300
6600
7800
7800
4C00
4E00
C600
C380
ENDCHAR
STARTCHAR l
ENCODING 108
SWIDTH 289 0
DWIDTH 5 0
BBX 5 13 1 0
BITMAP
78
18
10
30
30
30
20
60
60
60
40
C0
F0
ENDCHAR
STARTCHAR m
ENCODING 109
SWIDTH 944 0
DWIDTH 17 0
BBX 15 9 2 0
BITMAP
F39C
2DB6
79E6
71C4
618C
410C
430C
C30C
C30E
ENDCHAR
STARTCHAR n
ENCODING 110
SWIDTH 631 0
DWIDTH 11 0
BBX 10 9 2 0
BITMAP
F380
24C0
68C0
7080
6180
6180
4180
C180
C3C0
ENDCHAR
STARTCHAR o
ENCODING 111
SWIDTH 560 0
DWIDTH 10 0
BBX 9 9 2 0
BITMAP
0F00
3380
6180
4180
C180
C300
C300
C600
7800
ENDCHAR
STARTCHAR p
ENCODING 112
SWIDTH 608 0
DWIDTH 11 0
BBX 10 12 1 -3
BITMAP
7380
34C0
38C0
30C0
3080
6180
6100
6200
7C00
4000
C000
C000
ENDCHAR
STARTCHAR q
ENCODING 113
SWIDTH 599 0
DWIDTH 11 0
BBX 10 12 1 -3
BITMAP
0FC0
10C0
2080
6180
4180
C380
C580
C900
7300
0300
0300
0200
ENDCHAR
STARTCHAR r
ENCODING 114
SWIDTH 470 0
DWIDTH 8 0
BBX 8 9 2 0
BITMAP
F3
2E
78
70
60
40
40
C0
C0
ENDCHAR
STARTCHAR s
ENCODING 115
SWIDTH 440 0
DWIDTH 8 0
BBX 8 9 1 0
BITMAP
1F
31
31
38
1C
06
82
C6
7C
ENDCHAR
STARTCHAR t
ENCODING 116
SWIDTH 355 0
DWIDTH 6 0
BBX 6 12 2 0
BITMAP
30
30
30
FC
60
60
60
40
C0
C0
C0
70
ENDCHAR
STARTCHAR u
ENCODING 117
SWIDTH 630 0
DWIDTH 11 0
BBX 10 9 2 0
BITMAP
F3C0
60C0
6080
6180
6180
4380
C580
C900
73C0
ENDCHAR
STARTCHAR v
ENCODING 118
SWIDTH 558 0
DWIDTH 10 0
BBX 10 9 1 0
BITMAP
E0C0
3040
30C0
1080
1900
1A00
1E00
1C00
1800
ENDCHAR
STARTCHAR w
ENCODING 119
SWIDTH 805 0
DWIDTH 14 0
BBX 14 9 1 0
BITMAP
E10C
6184
338C
3388
3690
14F0
18E0
18C0
1080
ENDCHAR
STARTCHAR x
ENCODING 120
SWIDTH 510 0
DWIDTH 9 0
BBX 9 9 1 0
BITMAP
7180
3180
1B00
1C00
0C00
3C00
6600
C700
C380
ENDCHAR
STARTCHAR y
ENCODING 121
SWIDTH 558 0
DWIDTH 10 0
BBX 11 12 0 -3
BITMAP
7060
1820
1860
0840
0C80
0D00
0E00
0C00
0800
1000
3000
E000
ENDCHAR
STARTCHAR z
ENCODING 122
SWIDTH 536 0
DWIDTH 10 0
BBX 9 9 1 0
BITMAP
3F80
2300
2600
0C00
1800
1800
3100
6100
FF00
ENDCHAR
STARTCHAR braceleft
ENCODING 123
SWIDTH 337 0
DWIDTH 6 0
BBX 6 16 2 -3
BITMAP
0C
18
10
30
10
30
30
20
C0
60
60
60
C0
C0
C0
60
ENDCHAR
STARTCHAR bar
ENCODING 124
SWIDTH 241 0
DWIDTH 4 0
BBX 4 16 1 -3
BITMAP
10
10
30
20
20
20
20
60
60
40
40
40
40
C0
80
80
ENDCHAR
STARTCHAR braceright
ENCODING 125
SWIDTH 337 0
DWIDTH 6 0
BBX 6 16 2 -3
BITMAP
18
04
04
0C
08
18
18
0C
10
10
30
30
30
30
20
C0
ENDCHAR
STARTCHAR asciitilde
ENCODING 126
SWIDTH 608 0
DWIDTH 11 0
BBX 11 4 1 3
BITMAP
7820
8C20
8640
83C0
ENDCHAR
STARTCHAR Aogonek
ENCODING 161
SWIDTH 747 0
DWIDTH 13 0
BBX 13 16 0 -3
BITMAP
00C0
00C0
01C0
03C0
02C0
0460
0C60
0860
1FE0
1060
2020
4030
F0F8
0030
0040
0070
ENDCHAR
STARTCHAR breve
ENCODING 162
SWIDTH 548 0
DWIDTH 10 0
BBX 6 3 2 10
BITMAP
84
D8
70
ENDCHAR
STARTCHAR Lslash
ENCODING 163
SWIDTH 572 0
DWIDTH 10 0
BBX 10 13 0 0
BITMAP
1F00
0C00
0C00
0C00
1A00
1E00
1800
7800
1000
3000
3040
30C0
FFC0
ENDCHAR
STARTCHAR currency
ENCODING 164
SWIDTH 608 0
DWIDTH 11 0
BBX 12 11 1 1
BITMAP
2010
1720
18C0
1040
2040
2040
2040
2080
3180
6EC0
8040
ENDCHAR
STARTCHAR Lcaron
ENCODING 165
SWIDTH 572 0
DWIDTH 10 0
BBX 10 13 0 0
BITMAP
3F40
0C40
0C40
0840
1880
1800
1800
1800
3000
3000
3040
30C0
FFC0
ENDCHAR
STARTCHAR Sacute
ENCODING 166
SWIDTH 549 0
DWIDTH 10 0
BBX 10 17 1 0
BITMAP
00C0
0100
0200
0000
0F80
18C0
3040
3040
3800
1C00
0E00
0300
0180
8180
8180
C300
7C00
ENDCHAR
STARTCHAR section
ENCODING 167
SWIDTH 608 0
DWIDTH 11 0
BBX 10 16 1 -3
BITMAP
0FC0
1840
3040
3000
3800
1E00
2700
6180
6180
3900
1E00
0300
0100
8300
C600
7C00
ENDCHAR
STARTCHAR dieresis
ENCODING 168
SWIDTH 560 0
DWIDTH 10 0
BBX 5 1 5 12
BITMAP
D8
ENDCHAR
STARTCHAR Scaron
ENCODING 169
SWIDTH 549 0
DWIDTH 10 0
BBX 10 17 1 0
BITMAP
0840
0580
0700
0000
0F80
18C0
3040
3040
3800
1C00
0E00
0300
0180
8180
8180
C300
7C00
ENDCHAR
STARTCHAR Scedilla
ENCODING 170
SWIDTH 549 0
DWIDTH 10 0
BBX 10 16 1 -3
BITMAP
0F80
18C0
3040
3040
3800
1C00
0E00
0300
0180
8180
8180
C300
7C00
1000
0800
3800
ENDCHAR
STARTCHAR Tcaron
ENCODING 171
SWIDTH 663 0
DWIDTH 12 0
BBX 12 17 2 0
BITMAP
0840
0580
0700
0000
FFF0
C610
8610
0400
0C00
0C00
0C00
0C00
0800
1800
1800
1800
7E00
ENDCHAR
STARTCHAR Zacute
ENCODING 172
SWIDTH 633 0
DWIDTH 11 0
BBX 12 17 1 0
BITMAP
0060
0080
0100
0000
1FF0
1060
30C0
01C0
0180
0300
0600
0C00
1800
3800
3040
6040
FFC0
ENDCHAR
STARTCHAR hyphen
ENCODING 173
SWIDTH 313 0
DWIDTH 6 0
BBX 4 1 2 5
BITMAP
F0
ENDCHAR
STARTCHAR Zcaron
ENCODING 174
SWIDTH 633 0
DWIDTH 11 0
BBX 12 17 1 0
BITMAP
0420
02C0
0380
0000
1FF0
1060
30C0
01C0
0180
0300
0600
0C00
1800
3800
3040
6040
FFC0
ENDCHAR
STARTCHAR Zdotaccent
ENCODING 175
SWIDTH 633 0
DWIDTH 11 0
BBX 12 16 1 0
BITMAP
0180
0180
0000
1FF0
1060
30C0
01C0
0180
0300
0600
0C00
1800
3800
3040
6040
FFC0
ENDCHAR
STARTCHAR degree
ENCODING 176
SWIDTH 277 0
DWIDTH 5 0
BBX 3 3 3 10
BITMAP
E0
A0
E0
ENDCHAR
STARTCHAR aogonek
ENCODING 177
SWIDTH 608 0
DWIDTH 11 0
BBX 10 12 1 -3
BITMAP
0FC0
10C0
2080
6180
4180
C380
C580
C900
73C0
0180
0200
0380
ENDCHAR
STARTCHAR ogonek
ENCODING 178
SWIDTH 493 0
DWIDTH 9 0
BBX 3 3 3 -3
BITMAP
60
80
E0
ENDCHAR
STARTCHAR lslash
ENCODING 179
SWIDTH 289 0
DWIDTH 5 0
BBX 6 13 1 0
BITMAP
38
18
18
18
10
3C
F0
30
20
60
60
60
70
ENDCHAR
STARTCHAR acute
ENCODING 180
SWIDTH 560 0
DWIDTH 10 0
BBX 4 3 6 10
BITMAP
30
40
80
ENDCHAR
STARTCHAR lcaron
ENCODING 181
SWIDTH 346 0
DWIDTH 6 0
BBX 8 13 1 0
BITMAP
79
19
11
31
32
30
20
60
60
60
40
C0
F0
ENDCHAR
STARTCHAR sacute
ENCODING 182
SWIDTH 440 0
DWIDTH 8 0
BBX 9 13 1 0
BITMAP
0180
0200
0400
0000
1F00
3100
3100
3800
1C00
0600
8200
C600
7C00
ENDCHAR
STARTCHAR caron
ENCODING 183
SWIDTH 548 0
DWIDTH 10 0
BBX 6 3 2 10
BITMAP
84
58
70
ENDCHAR
STARTCHAR cedilla
ENCODING 184
SWIDTH 493 0
DWIDTH 9 0
BBX 3 3 3 -3
BITMAP
60
20
E0
ENDCHAR
STARTCHAR scaron
ENCODING 185
SWIDTH 440 0
DWIDTH 8 0
BBX 10 13 1 0
BITMAP
0840
0580
0700
0000
1F00
3100
3100
3800
1C00
0600
8200
C600
7C00
ENDCHAR
STARTCHAR scedilla
ENCODING 186
SWIDTH 440 0
DWIDTH 8 0
BBX 8 12 1 -3
BITMAP
1F
31
31
38
1C
06
82
C6
7C
10
08
38
ENDCHAR
STARTCHAR tcaron
ENCODING 187
SWIDTH 295 0
DWIDTH 5 0
BBX 7 15 2 0
BITMAP
02
02
02
32
34
30
FC
60
60
60
40
C0
C0
C0
70
ENDCHAR
STARTCHAR zacute
ENCODING 188
SWIDTH 536 0
DWIDTH 10 0
BBX 9 13 1 0
BITMAP
0180
0200
0400
0000
3F80
2300
2600
0C00
1800
1800
3100
6100
FF00
ENDCHAR
STARTCHAR hungarumlaut
ENCODING 189
SWIDTH 548 0
DWIDTH 10 0
BBX 6 3 2 10
BITMAP
3C
50
A0
ENDCHAR
STARTCHAR zcaron
ENCODING 190
SWIDTH 536 0
DWIDTH 10 0
BBX 10 13 1 0
BITMAP
0840
0580
0700
0000
3F80
2300
2600
0C00
1800
1800
3100
6100
FF00
ENDCHAR
STARTCHAR zdotaccent
ENCODING 191
SWIDTH 536 0
DWIDTH 10 0
BBX 9 12 1 0
BITMAP
0600
0600
0000
3F80
2300
2600
0C00
1800
1800
3100
6100
FF00
ENDCHAR
STARTCHAR Racute
ENCODING 192
SWIDTH 686 0
DWIDTH 12 0
BBX 12 17 0 0
BITMAP
0060
0080
0100
0000
1FE0
0C60
0C30
0820
1860
18C0
1F00
1B00
1180
3180
30C0
30E0
F870
ENDCHAR
STARTCHAR Aacute
ENCODING 193
SWIDTH 747 0
DWIDTH 13 0
BBX 13 17 0 0
BITMAP
0030
0040
0080
0000
00C0
00C0
01C0
03C0
02C0
0460
0C60
0860
1FE0
1060
2020
4030
F0F8
ENDCHAR
STARTCHAR Acircumflex
ENCODING 194
SWIDTH 747 0
DWIDTH 13 0
BBX 13 17 0 0
BITMAP
00E0
01A0
0210
0000
00C0
00C0
01C0
03C0
02C0
0460
0C60
0860
1FE0
1060
2020
4030
F0F8
ENDCHAR
STARTCHAR Abreve
ENCODING 195
SWIDTH 747 0
DWIDTH 13 0
BBX 13 17 0 0
BITMAP
0108
01B0
00E0
0000
00C0
00C0
01C0
03C0
02C0
0460
0C60
0860
1FE0
1060
2020
4030
F0F8
ENDCHAR
STARTCHAR Adieresis
ENCODING 196
SWIDTH 747 0
DWIDTH 13 0
BBX 13 15 0 0
BITMAP
01B0
0000
00C0
00C0
01C0
03C0
02C0
0460
0C60
0860
1FE0
1060
2020
4030
F0F8
ENDCHAR
STARTCHAR Lacute
ENCODING 197
SWIDTH 572 0
DWIDTH 10 0
BBX 10 17 0 0
BITMAP
00C0
0100
0200
0000
3F00
0C00
0C00
0800
1800
1800
1800
1800
3000
3000
3040
30C0
FFC0
ENDCHAR
STARTCHAR Cacute
ENCODING 198
SWIDTH 714 0
DWIDTH 13 0
BBX 12 17 2 0
BITMAP
0030
0040
0080
0000
07F0
1C30
3030
3000
6000
6000
C000
C000
C000
C000
E000
70C0
3F00
ENDCHAR
STARTCHAR Ccedilla
ENCODING 199
SWIDTH 714 0
DWIDTH 13 0
BBX 12 16 2 -3
BITMAP
07F0
1C30
3030
3000
6000
6000
C000
C000
C000
C000
E000
70C0
3F00
1000
0800
3800
ENDCHAR
STARTCHAR Ccaron
ENCODING 200
SWIDTH 714 0
DWIDTH 13 0
BBX 12 17 2 0
BITMAP
0210
0160
01C0
0000
07F0
1C30
3030
3000
6000
6000
C000
C000
C000
C000
E000
70C0
3F00
ENDCHAR
STARTCHAR Eacute
ENCODING 201
SWIDTH 569 0
DWIDTH 10 0
BBX 11 17 1 0
BITMAP
00C0
0100
0200
0000
3FE0
1820
1820
1800
1800
1880
1F80
3100
3000
3000
3080
3080
FF80
ENDCHAR
STARTCHAR Eogonek
ENCODING 202
SWIDTH 569 0
DWIDTH 10 0
BBX 11 16 1 -3
BITMAP
3FE0
1820
1820
1800
1800
1880
1F80
3100
3000
3000
3080
3080
FF80
0300
0400
0700
ENDCHAR
STARTCHAR Edieresis
ENCODING 203
SWIDTH 569 0
DWIDTH 10 0
BBX 11 15 1 0
BITMAP
06C0
0000
3FE0
1820
1820
1800
1800
1880
1F80
3100
3000
3000
3080
3080
FF80
ENDCHAR
STARTCHAR Ecaron
ENCODING 204
SWIDTH 569 0
DWIDTH 10 0
BBX 11 17 1 0
BITMAP
0840
0580
0700
0000
3FE0
1820
1820
1800
1800
1880
1F80
3100
3000
3000
3080
3080
FF80
ENDCHAR
STARTCHAR Iacute
ENCODING 205
SWIDTH 325 0
DWIDTH 6 0
BBX 9 17 0 0
BITMAP
0180
0200
0400
0000
1F00
0C00
0C00
0C00
0800
1800
1800
1800
1000
3000
3000
3000
F800
ENDCHAR
STARTCHAR Icircumflex
ENCODING 206
SWIDTH 325 0
DWIDTH 6 0
BBX 9 17 0 0
BITMAP
0700
0D00
1080
0000
1F00
0C00
0C00
0C00
0800
1800
1800
1800
1000
3000
3000
3000
F800
ENDCHAR
STARTCHAR Dcaron
ENCODING 207
SWIDTH 770 0
DWIDTH 14 0
BBX 14 17 0 0
BITMAP
0210
0160
01C0
0000
3FF0
0C38
0C1C
080C
180C
180C
180C
180C
3018
3018
3030
30E0
FF80
ENDCHAR
STARTCHAR Eth
ENCODING 208
SWIDTH 770 0
DWIDTH 14 0
BBX 14 13 0 0
BITMAP
3FF0
0C38
0C1C
080C
180C
180C
7F0C
180C
1018
3018
3030
30E0
FF80
ENDCHAR
STARTCHAR Nacute
ENCODING 209
SWIDTH 762 0
DWIDTH 14 0
BBX 16 17 0 0
BITMAP
0030
0040
0080
0000
3C1F
0C04
0E04
1608
1308
1308
1188
10C8
20D0
2070
2070
2030
F020
ENDCHAR
STARTCHAR Ncaron
ENCODING 210
SWIDTH 762 0
DWIDTH 14 0
BBX 16 17 0 0
BITMAP
0108
00B0
00E0
0000
3C1F
0C04
0E04
1608
1308
1308
1188
10C8
20D0
2070
2070
2030
F020
ENDCHAR
STARTCHAR Oacute
ENCODING 211
SWIDTH 783 0
DWIDTH 14 0
BBX 13 17 2 0
BITMAP
0060
0080
0100
0000
07C0
0C70
3030
2018
6018
4018
C018
C030
C030
C060
C0C0
6180
3E00
ENDCHAR
STARTCHAR Ocircumflex
ENCODING 212
SWIDTH 783 0
DWIDTH 14 0
BBX 13 17 2 0
BITMAP
01C0
0340
0420
0000
07C0
0C70
3030
2018
6018
4018
C018
C030
C030
C060
C0C0
6180
3E00
ENDCHAR
STARTCHAR Ohungarumlaut
ENCODING 213
SWIDTH 783 0
DWIDTH 14 0
BBX 13 17 2 0
BITMAP
00B0
0140
0280
0000
07C0
0C70
3030
2018
6018
4018
C018
C030
C030
C060
C0C0
6180
3E00
ENDCHAR
STARTCHAR Odieresis
ENCODING 214
SWIDTH 783 0
DWIDTH 14 0
BBX 13 15 2 0
BITMAP
0360
0000
07C0
0C70
3030
2018
6018
4018
C018
C030
C030
C060
C0C0
6180
3E00
ENDCHAR
STARTCHAR multiply
ENCODING 215
SWIDTH 608 0
DWIDTH 11 0
BBX 12 11 1 0
BITMAP
2010
3020
1040
0880
0500
0600
0E00
1100
2080
40C0
8040
ENDCHAR
STARTCHAR Rcaron
ENCODING 216
SWIDTH 686 0
DWIDTH 12 0
BBX 12 17 0 0
BITMAP
0210
0160
01C0
0000
1FE0
0C60
0C30
0820
1860
18C0
1F00
1B00
1180
3180
30C0
30E0
F870
ENDCHAR
STARTCHAR Uring
ENCODING 217
SWIDTH 727 0
DWIDTH 13 0
BBX 13 17 3 0
BITMAP
0700
0500
0700
0000
F878
7020
6020
6020
6040
6040
4040
C040
C040
C080
C080
6100
3E00
ENDCHAR
STARTCHAR Uacute
ENCODING 218
SWIDTH 727 0
DWIDTH 13 0
BBX 13 17 3 0
BITMAP
00C0
0100
0200
0000
F878
7020
6020
6020
6040
6040
4040
C040
C040
C080
C080
6100
3E00
ENDCHAR
STARTCHAR Uhungarumlaut
ENCODING 219
SWIDTH 727 0
DWIDTH 13 0
BBX 13 17 3 0
BITMAP
0160
0280
0500
0000
F878
7020
6020
6020
6040
6040
4040
C040
C040
C080
C080
6100
3E00
ENDCHAR
STARTCHAR Udieresis
ENCODING 220
SWIDTH 727 0
DWIDTH 13 0
BBX 13 15 3 0
BITMAP
06C0
0000
F878
7020
6020
6020
6040
6040
4040
C040
C040
C080
C080
6100
3E00
ENDCHAR
STARTCHAR Yacute
ENCODING 221
SWIDTH 663 0
DWIDTH 12 0
BBX 12 17 2 0
BITMAP
0180
0200
0400
0000
F870
6060
3040
3080
1900
1A00
1C00
0800
1800
1800
1800
3800
7C00
ENDCHAR
STARTCHAR Tcedilla
ENCODING 222
SWIDTH 663 0
DWIDTH 12 0
BBX 12 16 2 -3
BITMAP
FFF0
C610
8610
0400
0C00
0C00
0C00
0C00
0800
1800
1800
1800
7E00
0800
0400
1C00
ENDCHAR
STARTCHAR germandbls
ENCODING 223
SWIDTH 603 0
DWIDTH 11 0
BBX 10 17 1 -3
BITMAP
0F00
0980
1880
1980
1100
3600
3400
3600
3300
2180
60C0
68C0
6880
4F00
4000
C000
C000
ENDCHAR
STARTCHAR racute
ENCODING 224
SWIDTH 470 0
DWIDTH 8 0
BBX 8 13 2 0
BITMAP
03
04
08
00
F3
2E
78
70
60
40
40
C0
C0
ENDCHAR
STARTCHAR aacute
ENCODING 225
SWIDTH 608 0
DWIDTH 11 0
BBX 10 13 1 0
BITMAP
00C0
0100
0200
0000
0FC0
10C0
2080
6180
4180
C380
C580
C900
73C0
ENDCHAR
STARTCHAR acircumflex
ENCODING 226
SWIDTH 608 0
DWIDTH 11 0
BBX 10 13 1 0
BITMAP
0380
0680
0840
0000
0FC0
10C0
2080
6180
4180
C380
C580
C900
73C0
ENDCHAR
STARTCHAR abreve
ENCODING 227
SWIDTH 608 0
DWIDTH 11 0
BBX 10 13 1 0
BITMAP
0840
0D80
0700
0000
0FC0
10C0
2080
6180
4180
C380
C580
C900
73C0
ENDCHAR
STARTCHAR adieresis
ENCODING 228
SWIDTH 608 0
DWIDTH 11 0
BBX 10 11 1 0
BITMAP
06C0
0000
0FC0
10C0
2080
6180
4180
C380
C580
C900
73C0
ENDCHAR
STARTCHAR lacute
ENCODING 229
SWIDTH 289 0
DWIDTH 5 0
BBX 8 17 1 0
BITMAP
03
04
08
00
78
18
10
30
30
30
20
60
60
60
40
C0
F0
ENDCHAR
STARTCHAR cacute
ENCODING 230
SWIDTH 487 0
DWIDTH 9 0
BBX 9 13 2 0
BITMAP
0180
0200
0400
0000
0F00
3100
6100
4000
C000
C000
C000
C200
7C00
ENDCHAR
STARTCHAR ccedilla
ENCODING 231
SWIDTH 487 0
DWIDTH 9 0
BBX 8 12 2 -3
BITMAP
0F
31
61
40
C0
C0
C0
C2
7C
20
10
70
ENDCHAR
STARTCHAR ccaron
ENCODING 232
SWIDTH 487 0
DWIDTH 9 0
BBX 9 13 2 0
BITMAP
1080
0B00
0E00
0000
0F00
3100
6100
4000
C000
C000
C000
C200
7C00
ENDCHAR
STARTCHAR eacute
ENCODING 233
SWIDTH 518 0
DWIDTH 9 0
BBX 9 13 2 0
BITMAP
0180
0200
0400
0000
0E00
3300
6300
4200
FC00
C000
C100
E600
7C00
ENDCHAR
STARTCHAR eogonek
ENCODING 234
SWIDTH 518 0
DWIDTH 9 0
BBX 8 12 2 -3
BITMAP
0E
33
63
42
FC
C0
C1
E6
7C
30
40
70
ENDCHAR
STARTCHAR edieresis
ENCODING 235
SWIDTH 518 0
DWIDTH 9 0
BBX 9 11 2 0
BITMAP
0D80
0000
0E00
3300
6300
4200
FC00
C000
C100
E600
7C00
ENDCHAR
STARTCHAR ecaron
ENCODING 236
SWIDTH 518 0
DWIDTH 9 0
BBX 9 13 2 0
BITMAP
1080
0B00
0E00
0000
0E00
3300
6300
4200
FC00
C000
C100
E600
7C00
ENDCHAR
STARTCHAR iacute
ENCODING 237
SWIDTH 289 0
DWIDTH 5 0
BBX 7 13 2 0
BITMAP
06
08
10
00
F0
30
20
60
60
60
40
C0
F0
ENDCHAR
STARTCHAR icircumflex
ENCODING 238
SWIDTH 289 0
DWIDTH 5 0
BBX 7 13 2 0
BITMAP
1C
34
42
00
F0
30
20
60
60
60
40
C0
F0
ENDCHAR
STARTCHAR dcaron
ENCODING 239
SWIDTH 608 0
DWIDTH 11 0
BBX 13 13 1 0
BITMAP
01E8
0068
0048
00C8
0FD0
10C0
20C0
6080
4180
C380
C580
C900
73C0
ENDCHAR
STARTCHAR dmacron
ENCODING 240
SWIDTH 608 0
DWIDTH 11 0
BBX 12 13 1 0
BITMAP
01E0
0060
07F0
00C0
0FC0
10C0
20C0
6080
4180
C380
C580
C900
73C0
ENDCHAR
STARTCHAR nacute
ENCODING 241
SWIDTH 631 0
DWIDTH 11 0
BBX 10 13 2 0
BITMAP
00C0
0100
0200
0000
F380
24C0
68C0
7080
6180
6180
4180
C180
C3C0
ENDCHAR
STARTCHAR ncaron
ENCODING 242
SWIDTH 631 0
DWIDTH 11 0
BBX 10 13 2 0
BITMAP
0840
0580
0700
0000
F380
24C0
68C0
7080
6180
6180
4180
C180
C3C0
ENDCHAR
STARTCHAR oacute
ENCODING 243
SWIDTH 560 0
DWIDTH 10 0
BBX 9 13 2 0
BITMAP
0180
0200
0400
0000
0F00
3380
6180
4180
C180
C300
C300
C600
7800
ENDCHAR
STARTCHAR ocircumflex
ENCODING 244
SWIDTH 560 0
DWIDTH 10 0
BBX 9 13 2 0
BITMAP
0700
0D00
1080
0000
0F00
3380
6180
4180
C180
C300
C300
C600
7800
ENDCHAR
STARTCHAR ohungarumlaut
ENCODING 245
SWIDTH 560 0
DWIDTH 10 0
BBX 10 13 2 0
BITMAP
02C0
0500
0A00
0000
0F00
3380
6180
4180
C180
C300
C300
C600
7800
ENDCHAR
STARTCHAR odieresis
ENCODING 246
SWIDTH 560 0
DWIDTH 10 0
BBX 9 11 2 0
BITMAP
0D80
0000
0F00
3380
6180
4180
C180
C300
C300
C600
7800
ENDCHAR
STARTCHAR divide
ENCODING 247
SWIDTH 608 0
DWIDTH 11 0
BBX 11 9 1 0
BITMAP
0600
0000
0000
0000
FFE0
0000
0000
0000
0C00
ENDCHAR
STARTCHAR rcaron
ENCODING 248
SWIDTH 470 0
DWIDTH 8 0
BBX 9 13 2 0
BITMAP
1080
0B00
0E00
0000
F300
2E00
7800
7000
6000
4000
4000
C000
C000
ENDCHAR
STARTCHAR uring
ENCODING 249
SWIDTH 630 0
DWIDTH 11 0
BBX 10 13 2 0
BITMAP
0E00
0A00
0E00
0000
F3C0
60C0
6080
6180
6180
4380
C580
C900
73C0
ENDCHAR
STARTCHAR uacute
ENCODING 250
SWIDTH 630 0
DWIDTH 11 0
BBX 10 13 2 0
BITMAP
00C0
0100
0200
0000
F3C0
60C0
6080
6180
6180
4380
C580
C900
73C0
ENDCHAR
STARTCHAR uhungarumlaut
ENCODING 251
SWIDTH 630 0
DWIDTH 11 0
BBX 10 13 2 0
BITMAP
02C0
0500
0A00
0000
F3C0
60C0
6080
6180
6180
4380
C580
C900
73C0
ENDCHAR
STARTCHAR udieresis
ENCODING 252
SWIDTH 630 0
DWIDTH 11 0
BBX 10 11 2 0
BITMAP
0D80
0000
F3C0
60C0
6080
6180
6180
4380
C580
C900
73C0
ENDCHAR
STARTCHAR yacute
ENCODING 253
SWIDTH 558 0
DWIDTH 10 0
BBX 11 16 0 -3
BITMAP
0060
0080
0100
0000
7060
1820
1860
0840
0C80
0D00
0E00
0C00
0800
1000
3000
E000
ENDCHAR
STARTCHAR tcedilla
ENCODING 254
SWIDTH 355 0
DWIDTH 6 0
BBX 6 15 2 -3
BITMAP
30
30
30
FC
60
60
60
40
C0
C0
C0
70
20
10
70
ENDCHAR
STARTCHAR dotaccent
ENCODING 255
SWIDTH 439 0
DWIDTH 8 0
BBX 2 1 3 12
BITMAP
C0
ENDCHAR
ENDFONT
