STARTFONT 2.1
COMMENT +
COMMENT  Copyright 1984-1989, 1994 Adobe Systems Incorporated.
COMMENT  Copyright 1988, 1994 Digital Equipment Corporation.
COMMENT  Copyright 1996 BIZNET Poland, Inc.
COMMENT
COMMENT  Permission to use, copy, modify, distribute and sell this software
COMMENT  and its documentation for any purpose and without fee is hereby
COMMENT  granted, provided that the above copyright notices appear in all
COMMENT  copies and that both those copyright notices and this permission
COMMENT  notice appear in supporting documentation, and that the names of
COMMENT  Adobe Systems and Digital Equipment Corporation not be used in
COMMENT  advertising or publicity pertaining to distribution of the software
COMMENT  without specific, written prior permission.  Adobe Systems and
COMMENT  Digital Equipment Corporation make no representations about the
COMMENT  suitability of this software for any purpose.  It is provided "as
COMMENT  is" without express or implied warranty.
COMMENT -
FONT -BIZNET-Anagnostiko-Medium-I-Normal--34-240-100-100-P-182-ISO8859-2
SIZE 24 100 100
FONTBOUNDINGBOX 34 33 -7 -7
STARTPROPERTIES 25
FOUNDRY "BIZNET"
FAMILY_NAME "BIZNET Anagnostiko"
WEIGHT_NAME "Medium"
SLANT "I"
SETWIDTH_NAME "Normal"
ADD_STYLE_NAME ""
PIXEL_SIZE 34
POINT_SIZE 240
RESOLUTION_X 100
RESOLUTION_Y 100
SPACING "P"
AVERAGE_WIDTH 182
CHARSET_REGISTRY "ISO8859"
CHARSET_ENCODING "2"
CAP_HEIGHT 25
X_HEIGHT 16
FONT_ASCENT 29
FONT_DESCENT 7
FACE_NAME "BIZNET Anagnostiko Italic"
DEFAULT_CHAR 32
RELATIVE_SETWIDTH 50
RELATIVE_WEIGHT 50
CHARSET_COLLECTIONS "ASCII ISO8859-2"
COPYRIGHT "Copyright (c) 1984, 1987 Adobe Systems Incorporated. All Rights Reserved. Copyright (c) 1988, 1991 Digital Equipment Corporation. All Rights Reserved. Copyright (c) 1996 BIZNET Poland, Inc. All Rights Reserved."
NOTICE "The name "BIZNET" is a registered trademark of BIZNET Poland, Inc."
ENDPROPERTIES
CHARS 190
STARTCHAR space
ENCODING 32
SWIDTH 278 0
DWIDTH 9 0
BBX 1 1 1 0
BITMAP
00
ENDCHAR
STARTCHAR exclam
ENCODING 33
SWIDTH 333 0
DWIDTH 11 0
BBX 9 25 1 0
BITMAP
0380
0780
0780
0780
0780
0700
0700
0600
0E00
0E00
0C00
0C00
0800
1800
1800
1800
1000
1000
0000
0000
0000
6000
F000
F000
6000
ENDCHAR
STARTCHAR quotedbl
ENCODING 34
SWIDTH 400 0
DWIDTH 13 0
BBX 11 8 3 17
BITMAP
30C0
38E0
79E0
71C0
6180
E380
C300
8200
ENDCHAR
STARTCHAR numbersign
ENCODING 35
SWIDTH 606 0
DWIDTH 19 0
BBX 16 23 2 0
BITMAP
030C
030C
030C
030C
0618
0618
0618
7FFF
7FFF
0618
0C30
0C30
0C30
FFFE
FFFE
1860
1860
1860
1860
30C0
30C0
30C0
30C0
ENDCHAR
STARTCHAR dollar
ENCODING 36
SWIDTH 556 0
DWIDTH 18 0
BBX 18 31 0 -4
BITMAP
000400
000C00
000C00
000800
00FE00
039F80
061980
0C11C0
0C33C0
1C33C0
1C2380
1E2000
1F6000
0FE000
07F000
03F800
00FE00
00BE00
008F00
718F00
F18700
F10700
E30600
C30E00
621C00
3A7800
1FE000
060000
040000
0C0000
0C0000
ENDCHAR
STARTCHAR percent
ENCODING 37
SWIDTH 833 0
DWIDTH 27 0
BBX 25 23 1 0
BITMAP
03C03000
0E70E000
1C3FE000
3C10C000
7810C000
70318000
F0310000
E0230000
E0620000
E0660000
E0CC0000
738C1F00
3F187980
0010E080
0031E080
0063C180
00638180
00C78100
00870300
01870300
03070600
03039C00
0600F800
ENDCHAR
STARTCHAR ampersand
ENCODING 38
SWIDTH 852 0
DWIDTH 28 0
BBX 25 25 1 0
BITMAP
001F8000
003DC000
0070E000
00706000
00E06000
00E0E000
00E0E000
00E1C000
00E38000
00FF0000
00FC0000
01F00000
07F0FF80
1E783F00
38781C00
78781800
703C3000
F03C3000
F03E6000
F01EC000
F01F8100
F80F8300
7C1FC600
3FFBFC00
0FE1F800
ENDCHAR
STARTCHAR quoteright
ENCODING 39
SWIDTH 204 0
DWIDTH 7 0
BBX 6 9 1 16
BITMAP
18
3C
3C
3C
08
18
30
60
C0
ENDCHAR
STARTCHAR parenleft
ENCODING 40
SWIDTH 333 0
DWIDTH 11 0
BBX 12 29 1 -4
BITMAP
0030
00F0
01C0
0300
0600
0C00
0C00
1800
3800
3000
7000
7000
6000
E000
E000
E000
C000
C000
C000
C000
C000
C000
4000
4000
6000
2000
3000
3000
1800
ENDCHAR
STARTCHAR parenright
ENCODING 41
SWIDTH 333 0
DWIDTH 11 0
BBX 12 29 -3 -4
BITMAP
0180
0080
00C0
0040
0060
0020
0020
0030
0030
0030
0030
0030
0030
0070
0070
0070
0060
00E0
00E0
00C0
01C0
0180
0380
0300
0600
0C00
1800
7000
C000
ENDCHAR
STARTCHAR asterisk
ENCODING 42
SWIDTH 500 0
DWIDTH 17 0
BBX 14 14 1 9
BITMAP
01C0
31C0
71C0
7980
1D0C
0F3C
07FC
FF80
F3C0
E2E0
0678
0E38
0E30
0400
ENDCHAR
STARTCHAR plus
ENCODING 43
SWIDTH 606 0
DWIDTH 20 0
BBX 16 16 2 0
BITMAP
0180
0180
0180
0180
0180
0180
0180
FFFF
FFFF
0180
0180
0180
0180
0180
0180
0180
ENDCHAR
STARTCHAR comma
ENCODING 44
SWIDTH 278 0
DWIDTH 9 0
BBX 6 9 -1 -5
BITMAP
18
3C
3C
3C
08
18
30
60
C0
ENDCHAR
STARTCHAR minus
ENCODING 45
SWIDTH 606 0
DWIDTH 20 0
BBX 17 2 1 7
BITMAP
FFFF80
FFFF80
ENDCHAR
STARTCHAR period
ENCODING 46
SWIDTH 278 0
DWIDTH 9 0
BBX 4 4 1 0
BITMAP
60
F0
F0
60
ENDCHAR
STARTCHAR slash
ENCODING 47
SWIDTH 606 0
DWIDTH 20 0
BBX 11 28 5 -3
BITMAP
0060
00E0
00C0
00C0
01C0
0180
0180
0180
0300
0300
0300
0600
0600
0600
0C00
0C00
0C00
1800
1800
1800
3000
3000
3000
7000
6000
6000
6000
C000
ENDCHAR
STARTCHAR zero
ENCODING 48
SWIDTH 556 0
DWIDTH 18 0
BBX 16 24 2 0
BITMAP
00F8
03DC
070E
0E06
1C07
1C07
3807
7807
7807
7007
F00F
F00F
F00F
E00E
E01E
E01E
E01C
E03C
E038
E078
6070
70E0
3F80
1F00
ENDCHAR
STARTCHAR one
ENCODING 49
SWIDTH 556 0
DWIDTH 18 0
BBX 13 24 2 0
BITMAP
0018
0078
0FF8
0FF8
0070
0070
00F0
00F0
00E0
00E0
01E0
01C0
01C0
03C0
03C0
0380
0380
0780
0700
0700
0F00
0F00
1F80
FFF0
ENDCHAR
STARTCHAR two
ENCODING 50
SWIDTH 556 0
DWIDTH 18 0
BBX 18 24 0 0
BITMAP
007C00
01FF00
070780
0C03C0
0C03C0
1E01C0
1F03C0
1F03C0
1F03C0
0E0780
000F00
001E00
003C00
007800
00E000
038000
070000
0C0180
180300
300300
700600
FFFE00
FFFC00
FFFC00
ENDCHAR
STARTCHAR three
ENCODING 51
SWIDTH 556 0
DWIDTH 18 0
BBX 17 24 0 0
BITMAP
00F800
038E00
070700
0E0780
0F0780
0F0380
0F0780
060780
000700
000E00
003C00
03E000
003800
001C00
001E00
001E00
600E00
F01E00
F01E00
F01E00
E03C00
E07800
78F000
1FC000
ENDCHAR
STARTCHAR four
ENCODING 52
SWIDTH 556 0
DWIDTH 18 0
BBX 18 25 0 0
BITMAP
0000C0
0001C0
0003C0
000780
000F80
001B80
003700
006700
00C700
018F00
030E00
060E00
0C1E00
181E00
301C00
601C00
C03C00
FFFF80
FFFF80
003800
003800
007800
007000
01F800
07FE00
ENDCHAR
STARTCHAR five
ENCODING 53
SWIDTH 556 0
DWIDTH 18 0
BBX 19 25 1 0
BITMAP
018020
03FFE0
03FFC0
03FF00
030000
060000
060000
060000
0C0000
0CF000
0DFC00
0FFE00
1C1E00
380F00
300F00
000700
000700
000F00
600F00
F00E00
F01E00
F01C00
E07800
79F000
1FC000
ENDCHAR
STARTCHAR six
ENCODING 54
SWIDTH 556 0
DWIDTH 18 0
BBX 17 24 2 0
BITMAP
003C00
01E700
038380
070380
0F0780
0E0780
1C0300
3C0000
380000
780000
79F000
77FC00
FC3C00
F81E00
F00E00
F00E00
E00E00
E00E00
E01E00
E01C00
603C00
707800
3DE000
1F8000
ENDCHAR
STARTCHAR seven
ENCODING 55
SWIDTH 556 0
DWIDTH 18 0
BBX 17 24 3 0
BITMAP
1FFF80
3FFF00
3FFF00
700600
600C00
C00C00
801800
003000
007000
006000
00C000
01C000
038000
038000
070000
0F0000
0E0000
1E0000
3C0000
3C0000
7C0000
780000
780000
700000
ENDCHAR
STARTCHAR eight
ENCODING 56
SWIDTH 556 0
DWIDTH 18 0
BBX 18 24 1 0
BITMAP
00FC00
038F00
070380
0E0380
0E01C0
1C01C0
1E0380
1E0380
0F0700
0FCE00
07F800
03F800
0EFC00
383E00
701E00
700F00
E00F00
E00700
E00700
E00E00
700E00
701C00
3C7800
0FE000
ENDCHAR
STARTCHAR nine
ENCODING 57
SWIDTH 556 0
DWIDTH 18 0
BBX 17 24 1 0
BITMAP
01FC00
038E00
0F0700
0E0300
1C0380
3C0380
3C0380
380380
380780
380780
3C0F80
1E1F80
1FF700
07CF00
000F00
000E00
001E00
601E00
F01C00
F03C00
F07800
E07000
79E000
3F8000
ENDCHAR
STARTCHAR colon
ENCODING 58
SWIDTH 278 0
DWIDTH 9 0
BBX 7 16 1 0
BITMAP
0C
1E
1E
0C
00
00
00
00
00
00
00
00
60
F0
F0
60
ENDCHAR
STARTCHAR semicolon
ENCODING 59
SWIDTH 278 0
DWIDTH 9 0
BBX 9 21 -1 -5
BITMAP
0300
0780
0780
0300
0000
0000
0000
0000
0000
0000
0000
0000
1800
3C00
3C00
3C00
0800
1800
3000
6000
C000
ENDCHAR
STARTCHAR less
ENCODING 60
SWIDTH 606 0
DWIDTH 20 0
BBX 17 17 1 0
BITMAP
000180
000780
001F00
007C00
01F000
07C000
1F0000
7C0000
E00000
F00000
7C0000
1F0000
03E000
00F800
001F00
000780
000180
ENDCHAR
STARTCHAR equal
ENCODING 61
SWIDTH 606 0
DWIDTH 20 0
BBX 17 9 1 4
BITMAP
FFFF80
FFFF80
000000
000000
000000
000000
000000
FFFF80
FFFF80
ENDCHAR
STARTCHAR greater
ENCODING 62
SWIDTH 606 0
DWIDTH 20 0
BBX 17 17 2 0
BITMAP
C00000
F00000
7C0000
1F0000
07C000
01F000
007C00
001F00
000380
000780
001F00
007C00
03E000
0F8000
7C0000
F00000
C00000
ENDCHAR
STARTCHAR question
ENCODING 63
SWIDTH 444 0
DWIDTH 14 0
BBX 11 25 3 0
BITMAP
1F80
39C0
6060
4060
C060
C0E0
81E0
03C0
0FC0
1F00
3E00
3C00
7000
6000
C300
C300
6600
3C00
0000
0000
0000
6000
F000
F000
6000
ENDCHAR
STARTCHAR at
ENCODING 64
SWIDTH 747 0
DWIDTH 25 0
BBX 23 25 1 0
BITMAP
007E00
01FFC0
07E1E0
0E0070
1C0038
38001C
30000C
607DCE
61E7C6
E3C7C6
C3C386
C78386
C78386
C7078C
C7070C
C70F1C
E71F18
639F70
71F3E2
300186
38000C
1C0038
0F81F0
03FFC0
00FF00
ENDCHAR
STARTCHAR A
ENCODING 65
SWIDTH 704 0
DWIDTH 22 0
BBX 25 25 -3 0
BITMAP
0000C000
0001C000
0001C000
0003C000
0007C000
0007E000
000DE000
000DE000
0018E000
0018E000
0030F000
0070F000
0060F000
00C0F000
00C07000
01FFF800
01FFF800
03007800
03007800
06003800
0E003C00
0C003C00
1C003C00
3E007E00
FF81FF80
ENDCHAR
STARTCHAR B
ENCODING 66
SWIDTH 722 0
DWIDTH 23 0
BBX 23 25 -1 0
BITMAP
07FFF0
01F8F8
00F03C
00F01E
00E01E
01E01E
01E01E
01E01E
01C01E
03C03C
03C0F8
03FFF0
03FF80
0781E0
0780F8
078078
07003C
0F003C
0F003C
0F003C
0E007C
1E0078
1E00F0
3E07E0
FFFF80
ENDCHAR
STARTCHAR C
ENCODING 67
SWIDTH 722 0
DWIDTH 23 0
BBX 22 25 1 0
BITMAP
003F04
01F3CC
03C0FC
07803C
0F003C
1E0038
1E0018
3C0018
7C0010
780010
780000
F80000
F80000
F00000
F00000
F00000
F00000
F00000
F00020
780060
780040
3C01C0
3F0380
0FCF00
03FC00
ENDCHAR
STARTCHAR D
ENCODING 68
SWIDTH 778 0
DWIDTH 26 0
BBX 26 25 -1 0
BITMAP
07FFF000
00FC7C00
00781F00
00780700
00F00780
00F00380
00F003C0
00F003C0
01E003C0
01E003C0
01E003C0
01E003C0
03C007C0
03C007C0
03C00780
03C00F80
07800F80
07800F00
07801F00
07801E00
0F003C00
0F007800
0F01F000
1F1FE000
FFFF0000
ENDCHAR
STARTCHAR E
ENCODING 69
SWIDTH 722 0
DWIDTH 23 0
BBX 24 25 -1 0
BITMAP
07FFFF
00F83F
00F00F
00F007
00F007
00F003
01E042
01E0C2
01E0C0
01E1C0
03C380
03FF80
03FF80
038700
078700
078300
078200
070204
0F000C
0F0018
0F0018
1E0038
1E00F8
3F07F0
FFFFF0
ENDCHAR
STARTCHAR F
ENCODING 70
SWIDTH 667 0
DWIDTH 22 0
BBX 24 25 -1 0
BITMAP
07FFFF
01F83F
00F00F
00F007
00F006
01E002
01E042
01E0C2
01E0C0
03C1C0
03C380
03FF80
03FF80
078700
078300
078300
078200
0F0200
0F0000
0F0000
0F0000
1E0000
1E0000
3F0000
FFC000
ENDCHAR
STARTCHAR G
ENCODING 71
SWIDTH 778 0
DWIDTH 25 0
BBX 24 25 1 0
BITMAP
003FC2
00F9E6
03C07E
07803E
0F001E
1F001C
1E000C
3C000C
3C0008
7C0008
780000
780000
F80000
F007FF
F007FF
F00078
F00078
F00070
F000F0
7000F0
7801E0
3801E0
3C03E0
1F9E60
07FC40
ENDCHAR
STARTCHAR H
ENCODING 72
SWIDTH 833 0
DWIDTH 27 0
BBX 31 25 -1 0
BITMAP
07FF0FFE
01FC03F8
00F001E0
00F001E0
00F001C0
01E003C0
01E003C0
01E003C0
01E003C0
03C00780
03C00780
03FFFF80
03FFFF80
07800F00
07800F00
07800F00
07800F00
0F001E00
0F001E00
0F001E00
0F001E00
1E003C00
1E003C00
3F007E00
FFC1FF80
ENDCHAR
STARTCHAR I
ENCODING 73
SWIDTH 407 0
DWIDTH 13 0
BBX 15 25 -1 0
BITMAP
07FE
01F8
00F0
00F0
00E0
01E0
01E0
01E0
01C0
03C0
03C0
03C0
0380
0780
0780
0780
0700
0F00
0F00
0F00
0E00
1E00
1E00
3F00
FFC0
ENDCHAR
STARTCHAR J
ENCODING 74
SWIDTH 611 0
DWIDTH 20 0
BBX 23 25 -1 0
BITMAP
000FFE
0001F8
0000F0
0000F0
0001E0
0001E0
0001E0
0003C0
0003C0
0003C0
0003C0
000780
000780
000780
000780
3C0F00
7E0F00
7E0F00
FE0E00
CC1E00
C01E00
C03C00
607C00
39F000
1FE000
ENDCHAR
STARTCHAR K
ENCODING 75
SWIDTH 741 0
DWIDTH 24 0
BBX 28 25 -1 0
BITMAP
07FF3FF0
00F80FC0
00F00700
00F00E00
00F01C00
00E03800
01E07000
01E0E000
01E18000
01C30000
03CE0000
03DF0000
03FF0000
03F78000
07E78000
07C3C000
0783C000
0701C000
0F01E000
0F01E000
0F00F000
1E00F000
1E007800
3F007C00
FFC3FF00
ENDCHAR
STARTCHAR L
ENCODING 76
SWIDTH 667 0
DWIDTH 21 0
BBX 22 25 -1 0
BITMAP
07FF00
01FC00
00F000
00F000
00F000
00E000
01E000
01E000
01E000
01C000
03C000
03C000
03C000
038000
078000
078000
07800C
07000C
0F001C
0F0018
0F0038
0E0078
1F00F0
3F87F0
FFFFF0
ENDCHAR
STARTCHAR M
ENCODING 77
SWIDTH 944 0
DWIDTH 31 0
BBX 34 25 -1 0
BITMAP
07F8003FC0
00F8007E00
00F8007C00
00F800FC00
00FC00FC00
01BC01BC00
01BC03B800
01BC037800
01BC067800
033C067800
033C0C7000
031C18F000
031C18F000
061C30F000
061C30E000
061E61E000
041EC1E000
0C1EC1E000
0C1F81C000
0C1F83C000
1C1F03C000
180E038000
380E078000
7C0C0FC000
FF0C3FF800
ENDCHAR
STARTCHAR N
ENCODING 78
SWIDTH 815 0
DWIDTH 27 0
BBX 30 26 -2 -1
BITMAP
07F807FC
00F801F0
007800E0
007C00E0
00FC00C0
00DE00C0
00DE00C0
009F0080
018F0180
018F0180
01878180
03078100
0303C300
0303C300
0301E300
0601E200
0601E600
0600F600
0600F600
0C007C00
0C007C00
0C003C00
1C003C00
3E003800
FF801800
00001800
ENDCHAR
STARTCHAR O
ENCODING 79
SWIDTH 778 0
DWIDTH 26 0
BBX 24 25 1 0
BITMAP
001FC0
00FCF0
03E038
07C01C
0F801E
1F000E
1E000F
3E000F
3C000F
7C000F
78000F
78001F
F8001F
F8001E
F0001E
F0003E
F0003C
F0007C
F00078
7000F8
7801F0
3803E0
3C0780
0F3F00
03F800
ENDCHAR
STARTCHAR P
ENCODING 80
SWIDTH 667 0
DWIDTH 22 0
BBX 23 25 0 0
BITMAP
07FFE0
01F1F8
00F03C
00E01C
01E01E
01E01E
01E01E
01C01E
03C03C
03C03C
03C078
0381F0
078FC0
07FF00
078000
070000
0F0000
0F0000
0F0000
0E0000
1E0000
1E0000
1E0000
3E0000
FFC000
ENDCHAR
STARTCHAR Q
ENCODING 81
SWIDTH 778 0
DWIDTH 26 0
BBX 24 31 1 -6
BITMAP
001FC0
00FCF0
03F038
07C01C
0F801E
1F000E
1E000F
3E000F
3C000F
7C000F
78000F
78001F
F8001F
F8001E
F0001E
F0003E
F0F83C
F3BC7C
F30E78
760EF8
7406F0
3C07E0
3E0FC0
0F3F00
07FF00
000F00
000F08
000F18
000FF0
0007F0
0003C0
ENDCHAR
STARTCHAR R
ENCODING 82
SWIDTH 741 0
DWIDTH 24 0
BBX 24 26 -1 -1
BITMAP
07FFF0
01F8FC
00F81E
00F00E
00F00F
00E00F
01E00F
01E00F
01E01E
01C01E
03C07C
03C7F8
03FFC0
038380
0781C0
0781C0
0781E0
0701E0
0F01E0
0F01E0
0F01E0
0E01E2
1E01E6
3F01FC
FFC0FC
000078
ENDCHAR
STARTCHAR S
ENCODING 83
SWIDTH 667 0
DWIDTH 22 0
BBX 21 25 0 0
BITMAP
007F18
01E398
0380F8
070078
060070
0E0030
0E0030
0F0020
0F8020
0FE000
07F800
07FE00
01FF80
007FC0
001FC0
2007E0
2001E0
6000E0
6000E0
7000E0
7000C0
7801C0
FE0380
CF8F00
C1FC00
ENDCHAR
STARTCHAR T
ENCODING 84
SWIDTH 685 0
DWIDTH 22 0
BBX 23 25 1 0
BITMAP
3FFFFE
3F3E7E
3C3C1C
783C1C
703C1C
603818
607818
807810
807810
007000
00F000
00F000
00F000
01E000
01E000
01E000
01E000
03C000
03C000
03C000
038000
078000
078000
0FC000
7FF800
ENDCHAR
STARTCHAR U
ENCODING 85
SWIDTH 815 0
DWIDTH 27 0
BBX 26 25 3 0
BITMAP
7FE07FC0
1F801F00
0F000E00
0F000C00
1E000C00
1E000C00
1E001800
1E001800
3C001800
3C001800
3C003000
3C003000
78003000
78002000
78006000
78006000
F0006000
F0004000
F000C000
F000C000
F0018000
78038000
78070000
3E3E0000
07F80000
ENDCHAR
STARTCHAR V
ENCODING 86
SWIDTH 704 0
DWIDTH 23 0
BBX 25 25 1 0
BITMAP
FFC0FF80
3F003E00
1E001C00
1E003800
1E003000
0F003000
0F006000
0F00E000
0F00C000
07018000
07018000
07830000
07830000
07860000
03860000
038C0000
03CC0000
03D80000
03D80000
01F00000
01E00000
01E00000
01C00000
01C00000
01800000
ENDCHAR
STARTCHAR W
ENCODING 87
SWIDTH 926 0
DWIDTH 29 0
BBX 31 25 1 0
BITMAP
FF9FF3FE
3E07C0F8
1C078070
1C0380E0
1C0380C0
1E07C0C0
1E07C180
1E07C180
0E0FC100
0E0BC300
0E1BC300
0E19C600
0E31C600
0F31E400
0F21E400
0F61EC00
07E1F800
07C1F800
07C0F000
0780F000
0780F000
0700E000
0700E000
0600C000
0600C000
ENDCHAR
STARTCHAR X
ENCODING 88
SWIDTH 704 0
DWIDTH 23 0
BBX 29 25 -3 0
BITMAP
07FF1FF8
01FC07E0
00F803C0
00780700
003C0E00
003C0C00
003E1800
001E3000
001E6000
000FC000
000F8000
00078000
00078000
000F8000
001FC000
003BC000
0071E000
00E1E000
01C1F000
0380F000
0700F800
0E007800
1E007C00
3F00FE00
FFC3FF80
ENDCHAR
STARTCHAR Y
ENCODING 89
SWIDTH 685 0
DWIDTH 23 0
BBX 25 25 1 0
BITMAP
FFE1FF80
3F807E00
1F003800
0F003000
0F006000
0780E000
0780C000
03C18000
03C30000
03C70000
01E60000
01EC0000
00FC0000
00F80000
00F00000
00F00000
00F00000
01E00000
01E00000
01E00000
01E00000
03C00000
03C00000
0FE00000
3FF80000
ENDCHAR
STARTCHAR Z
ENCODING 90
SWIDTH 667 0
DWIDTH 22 0
BBX 23 25 -1 0
BITMAP
03FFFE
03F03E
07C07C
0700F8
0601F0
0E01E0
0C03E0
0807C0
000F80
000F00
001E00
003E00
007C00
00F800
00F000
01F000
03E008
07C018
0F8038
0F0030
1F0070
3E00F0
7C01E0
F807E0
FFFFE0
ENDCHAR
STARTCHAR bracketleft
ENCODING 91
SWIDTH 333 0
DWIDTH 11 0
BBX 14 29 -1 -4
BITMAP
01FC
0380
0380
0300
0300
0700
0700
0600
0600
0E00
0E00
0C00
0C00
1C00
1C00
1800
1800
3800
3000
3000
7000
7000
6000
6000
E000
E000
C000
C000
FE00
ENDCHAR
STARTCHAR backslash
ENCODING 92
SWIDTH 606 0
DWIDTH 20 0
BBX 14 25 3 0
BITMAP
C000
6000
6000
3000
3000
1800
1800
0C00
0C00
0E00
0600
0700
0300
0380
0180
01C0
00C0
00C0
0060
0060
0030
0030
0018
0018
000C
ENDCHAR
STARTCHAR bracketright
ENCODING 93
SWIDTH 333 0
DWIDTH 11 0
BBX 14 29 -2 -4
BITMAP
03FC
001C
0018
0018
0038
0038
0030
0030
0070
0070
0060
0060
00E0
00E0
00C0
00C0
01C0
01C0
0180
0180
0380
0380
0300
0300
0700
0700
0600
0600
FE00
ENDCHAR
STARTCHAR asciicircum
ENCODING 94
SWIDTH 606 0
DWIDTH 20 0
BBX 16 13 2 12
BITMAP
01C0
03E0
0360
0770
0630
0E38
1C18
1C18
380C
300C
700E
6006
E007
ENDCHAR
STARTCHAR underscore
ENCODING 95
SWIDTH 500 0
DWIDTH 16 0
BBX 16 2 0 -5
BITMAP
FFFF
FFFF
ENDCHAR
STARTCHAR quoteleft
ENCODING 96
SWIDTH 204 0
DWIDTH 7 0
BBX 6 9 2 16
BITMAP
0C
18
30
60
40
F0
F0
F0
60
ENDCHAR
STARTCHAR a
ENCODING 97
SWIDTH 574 0
DWIDTH 18 0
BBX 17 16 0 0
BITMAP
03C300
0FE700
1E3700
3C1E00
381E00
781E00
701C00
F01C00
E01C00
E03800
E03800
E03800
E07880
F0F980
7BBF00
3E1C00
ENDCHAR
STARTCHAR b
ENCODING 98
SWIDTH 556 0
DWIDTH 18 0
BBX 15 25 1 0
BITMAP
0380
1F00
0700
0700
0E00
0E00
0E00
1E00
1C00
1CF8
1FFC
3E1C
3C1E
380E
780E
700E
700E
601E
E01C
E01C
E038
E038
E0F0
79E0
1F80
ENDCHAR
STARTCHAR c
ENCODING 99
SWIDTH 444 0
DWIDTH 14 0
BBX 13 16 0 0
BITMAP
03E0
0E30
1C18
3878
7878
7030
F000
E000
E000
E000
E000
E000
E030
7060
7DC0
1F00
ENDCHAR
STARTCHAR d
ENCODING 100
SWIDTH 611 0
DWIDTH 20 0
BBX 19 25 0 0
BITMAP
0000E0
0003E0
0000E0
0000E0
0001C0
0001C0
0001C0
0003C0
000380
01F380
0F1B80
1E0F00
3C0F00
380F00
780E00
700E00
F00E00
F00E00
E01C00
E01C00
E03C00
E03C40
7078C0
79DF80
3F8E00
ENDCHAR
STARTCHAR e
ENCODING 101
SWIDTH 444 0
DWIDTH 14 0
BBX 13 16 0 0
BITMAP
03E0
0E70
1C38
3838
3838
7070
70E0
F1C0
E700
FC00
E000
E000
E030
7060
7BC0
1F00
ENDCHAR
STARTCHAR f
ENCODING 102
SWIDTH 333 0
DWIDTH 10 0
BBX 17 31 -2 -6
BITMAP
001F00
003380
006380
00E380
00C100
01C000
01C000
018000
038000
1FF800
038000
030000
070000
070000
070000
0E0000
0E0000
0E0000
0E0000
1C0000
1C0000
1C0000
1C0000
380000
380000
380000
700000
700000
F00000
E00000
800000
ENDCHAR
STARTCHAR g
ENCODING 103
SWIDTH 537 0
DWIDTH 17 0
BBX 20 24 -3 -7
BITMAP
0000F0
007FF0
01E730
038380
0701C0
0701C0
0701C0
070380
070380
030700
018F00
0FFC00
180000
180000
1FF000
1FFE00
1FFF00
780F00
600700
E00300
E00700
E00E00
7C3C00
1FF000
ENDCHAR
STARTCHAR h
ENCODING 104
SWIDTH 611 0
DWIDTH 19 0
BBX 18 25 0 0
BITMAP
01C000
0FC000
03C000
038000
038000
038000
038000
070000
070000
071C00
0E7E00
0EC700
0F8700
1F0700
1E0700
1C0E00
3C0E00
380E00
381C00
381C00
701C40
7038C0
703980
E01F00
E01C00
ENDCHAR
STARTCHAR i
ENCODING 105
SWIDTH 333 0
DWIDTH 10 0
BBX 8 24 1 0
BITMAP
06
0F
0F
06
00
00
00
00
1C
7C
1C
38
38
38
70
70
70
F0
E1
E3
E6
CC
F8
60
ENDCHAR
STARTCHAR j
ENCODING 106
SWIDTH 315 0
DWIDTH 9 0
BBX 16 31 -7 -7
BITMAP
0006
000F
000F
0006
0000
0000
0000
0000
001C
007C
001C
001C
0038
0038
0038
0038
0070
0070
0070
0070
00E0
00E0
00E0
01C0
01C0
01C0
4180
E380
E300
E600
7C00
ENDCHAR
STARTCHAR k
ENCODING 107
SWIDTH 556 0
DWIDTH 17 0
BBX 16 25 0 0
BITMAP
01C0
0FC0
03C0
0380
0380
0380
0700
0700
0700
0F1E
0E7F
0EC7
1F87
1F07
1E0E
1C1C
3C70
3BC0
3860
7060
7061
7073
E076
E07C
E038
ENDCHAR
STARTCHAR l
ENCODING 108
SWIDTH 333 0
DWIDTH 9 0
BBX 9 25 0 0
BITMAP
0380
1F80
0780
0700
0700
0700
0700
0E00
0E00
0E00
1C00
1C00
1C00
3800
3800
3800
3000
7000
7000
7000
E100
E300
E600
FC00
7000
ENDCHAR
STARTCHAR m
ENCODING 109
SWIDTH 889 0
DWIDTH 29 0
BBX 26 16 1 0
BITMAP
0E3C1E00
7E7E7F00
1CCEE700
1D8EC700
1F0F8700
1E0F0E00
1C0E0E00
3C1E0E00
381C1C00
38381C00
70381C00
70383840
707038C0
E0703980
E0703F00
E0E01C00
ENDCHAR
STARTCHAR n
ENCODING 110
SWIDTH 611 0
DWIDTH 20 0
BBX 17 16 1 0
BITMAP
1C3800
7CFC00
1D8E00
1F0E00
1E0E00
3C1C00
381C00
381C00
783800
703800
703800
703080
E07180
E07300
E07E00
E03800
ENDCHAR
STARTCHAR o
ENCODING 111
SWIDTH 500 0
DWIDTH 16 0
BBX 15 16 0 0
BITMAP
03F0
0E38
1C1C
380C
780E
700E
700E
F00E
E01E
E01C
E01C
E038
E038
7070
38E0
1F80
ENDCHAR
STARTCHAR p
ENCODING 112
SWIDTH 574 0
DWIDTH 19 0
BBX 20 22 -3 -6
BITMAP
01C780
0FDFE0
01D8E0
01B070
01E070
01C070
038070
0380F0
0380F0
0700E0
0700E0
0701C0
0703C0
0F8780
0EDF00
0E7C00
0C0000
1C0000
1C0000
1C0000
380000
FF0000
ENDCHAR
STARTCHAR q
ENCODING 113
SWIDTH 556 0
DWIDTH 17 0
BBX 17 22 0 -6
BITMAP
03F180
0F1B00
1C0F00
3C0F00
380E00
700E00
700E00
F01E00
E01C00
E01C00
E03C00
E03800
E07800
70F800
7FF800
1E7000
007000
007000
00E000
00E000
01E000
07F800
ENDCHAR
STARTCHAR r
ENCODING 114
SWIDTH 444 0
DWIDTH 14 0
BBX 14 16 0 0
BITMAP
0E78
7EFC
0D9C
0D1C
1F08
1E00
1C00
1C00
3800
3800
3800
7000
7000
7000
F000
E000
ENDCHAR
STARTCHAR s
ENCODING 115
SWIDTH 444 0
DWIDTH 14 0
BBX 13 16 0 0
BITMAP
07E0
1C78
3838
3038
3818
3C00
1F00
1FC0
07E0
01F0
6070
E070
E070
E060
71C0
3F80
ENDCHAR
STARTCHAR t
ENCODING 116
SWIDTH 352 0
DWIDTH 11 0
BBX 10 22 1 0
BITMAP
0380
0300
0700
0700
0E00
0E00
7FC0
1C00
1C00
1C00
3800
3800
3800
7000
7000
7000
7080
E180
E300
F600
FC00
7000
ENDCHAR
STARTCHAR u
ENCODING 117
SWIDTH 611 0
DWIDTH 20 0
BBX 17 16 1 0
BITMAP
1E0700
7C0F00
1C0E00
1C0E00
381E00
381C00
381C00
703C00
703800
707800
E07800
E0F180
E1F300
E77700
FE7C00
783800
ENDCHAR
STARTCHAR v
ENCODING 118
SWIDTH 519 0
DWIDTH 17 0
BBX 14 16 1 0
BITMAP
1C38
FC7C
383C
381C
380C
700C
7008
7018
E018
E010
E030
E060
E060
71C0
7F80
1E00
ENDCHAR
STARTCHAR w
ENCODING 119
SWIDTH 778 0
DWIDTH 26 0
BBX 23 16 1 0
BITMAP
1C0E1C
7C0E1E
1C1E1E
181C0E
381C06
381C06
383C06
703804
70780C
707818
E0F818
E0B830
E1B860
E338C0
7E3F80
380F00
ENDCHAR
STARTCHAR x
ENCODING 120
SWIDTH 500 0
DWIDTH 16 0
BBX 17 16 -1 0
BITMAP
070700
0F8F80
1B9B00
339000
21F000
01E000
01E000
01C000
01C000
01E000
03E000
06E100
66E300
EC7600
F87C00
703800
ENDCHAR
STARTCHAR y
ENCODING 121
SWIDTH 500 0
DWIDTH 16 0
BBX 18 23 -3 -7
BITMAP
070180
0F83C0
0F83C0
1BC3C0
11C180
11C180
01C100
00E300
00E200
00E600
00E400
007C00
007800
007800
007000
006000
006000
00C000
60C000
E18000
E30000
E60000
7C0000
ENDCHAR
STARTCHAR z
ENCODING 122
SWIDTH 463 0
DWIDTH 15 0
BBX 16 16 -1 0
BITMAP
07C3
0FFF
19F6
300C
3018
0030
00E0
01C0
0780
0E00
1C00
3004
6C0C
7F98
DFF0
C3E0
ENDCHAR
STARTCHAR braceleft
ENCODING 123
SWIDTH 333 0
DWIDTH 11 0
BBX 10 31 2 -5
BITMAP
0080
01C0
0300
0300
0600
0600
0600
0E00
0C00
0C00
0C00
1C00
1800
1800
7000
E000
6000
3000
3000
3000
7000
6000
6000
6000
E000
C000
C000
C000
C000
E000
2000
ENDCHAR
STARTCHAR bar
ENCODING 124
SWIDTH 606 0
DWIDTH 20 0
BBX 2 25 9 0
BITMAP
C0
C0
C0
C0
C0
C0
C0
C0
C0
C0
C0
C0
C0
C0
C0
C0
C0
C0
C0
C0
C0
C0
C0
C0
C0
ENDCHAR
STARTCHAR braceright
ENCODING 125
SWIDTH 333 0
DWIDTH 11 0
BBX 10 31 -1 -5
BITMAP
0100
01C0
00C0
00C0
00C0
00C0
00C0
01C0
0180
0180
0180
0180
0380
0380
0180
01C0
0380
0700
0600
0600
0E00
0C00
0C00
0C00
1C00
1800
1800
3800
3000
F000
4000
ENDCHAR
STARTCHAR asciitilde
ENCODING 126
SWIDTH 606 0
DWIDTH 20 0
BBX 17 5 1 6
BITMAP
1E0100
3FC380
7FFF00
E1FE00
403C00
ENDCHAR
STARTCHAR Aogonek
ENCODING 161
SWIDTH 704 0
DWIDTH 22 0
BBX 25 30 -3 -5
BITMAP
0000C000
0001C000
0001C000
0003C000
0007C000
0007E000
000DE000
000DE000
0018E000
0018E000
0030F000
0070F000
0060F000
00C0F000
00C07000
01FFF800
01FFF800
03007800
03007800
06003800
0E003C00
0C003C00
1C003C00
3E007E00
FF81FF80
00000C00
00001800
00003000
00003B00
00001E00
ENDCHAR
STARTCHAR breve
ENCODING 162
SWIDTH 447 0
DWIDTH 14 0
BBX 10 4 2 17
BITMAP
C0C0
C180
7F00
1C00
ENDCHAR
STARTCHAR Lslash
ENCODING 163
SWIDTH 667 0
DWIDTH 21 0
BBX 22 25 -1 0
BITMAP
07FF00
00FC00
00F000
00F000
00F000
00E000
01E000
01E1C0
01E700
01DC00
03F000
03C000
07C000
1F8000
778000
478000
07800C
07000C
0F001C
0F0018
0F0038
0E0078
1E00F0
3F07F0
FFFFF0
ENDCHAR
STARTCHAR currency
ENCODING 164
SWIDTH 606 0
DWIDTH 19 0
BBX 16 16 1 4
BITMAP
C7E3
FFFF
7C3E
700E
6006
E007
C003
C003
C003
C003
E007
6006
700E
7C3E
FFFF
C7E3
ENDCHAR
STARTCHAR Lcaron
ENCODING 165
SWIDTH 667 0
DWIDTH 21 0
BBX 22 25 -1 0
BITMAP
07FF08
01FC1C
00F01C
00F01C
00F008
00E008
01E010
01E020
01E000
01C000
03C000
03C000
03C000
038000
078000
078000
07800C
07000C
0F001C
0F0018
0F0038
0E0078
1F00F0
3F87F0
FFFFF0
ENDCHAR
STARTCHAR Sacute
ENCODING 166
SWIDTH 667 0
DWIDTH 22 0
BBX 21 32 0 0
BITMAP
000030
000070
0000F0
0001C0
000300
000600
000000
007F18
01E398
0380F8
070078
060070
0E0030
0E0030
0F0020
0F8020
0FE000
07F800
07FE00
01FF80
007FC0
001FC0
2007E0
2001E0
6000E0
6000E0
7000E0
7000C0
7801C0
FE0380
CF8F00
C1FC00
ENDCHAR
STARTCHAR section
ENCODING 167
SWIDTH 500 0
DWIDTH 17 0
BBX 17 30 -1 -5
BITMAP
007E00
01C700
018380
038780
038780
038300
01C000
01E000
00E000
0FF000
1CF800
383C00
303C00
381E00
380E00
380E00
3C0600
1E0600
0F0E00
0F9C00
07F800
03C000
03C000
01E000
60E000
70E000
F0E000
60C000
71C000
3F0000
ENDCHAR
STARTCHAR dieresis
ENCODING 168
SWIDTH 333 0
DWIDTH 11 0
BBX 9 3 3 19
BITMAP
6300
F780
6300
ENDCHAR
STARTCHAR Scaron
ENCODING 169
SWIDTH 667 0
DWIDTH 22 0
BBX 21 32 0 0
BITMAP
001030
001860
0008C0
000F80
000700
000600
000000
007F18
01E398
0380F8
070078
060070
0E0030
0E0030
0F0020
0F8020
0FE000
07F800
07FE00
01FF80
007FC0
001FC0
2007E0
2001E0
6000E0
6000E0
7000E0
7000C0
7801C0
FE0380
CF8F00
C1FC00
ENDCHAR
STARTCHAR Scedilla
ENCODING 170
SWIDTH 667 0
DWIDTH 22 0
BBX 21 32 0 -7
BITMAP
007F18
01E398
0380F8
070078
060070
0E0030
0E0030
0F0020
0F8020
0FE000
07F800
07FE00
01FF80
007FC0
001FC0
2007E0
2001E0
6000E0
6000E0
7000E0
7000C0
7801C0
FE0380
CF8F00
C1FC00
010000
020000
078000
00C000
00C000
19C000
0F8000
ENDCHAR
STARTCHAR Tcaron
ENCODING 171
SWIDTH 685 0
DWIDTH 22 0
BBX 23 32 1 0
BITMAP
002060
0030C0
001180
001F00
000E00
000C00
000000
3FFFFE
3F3E7E
3C3C1C
783C1C
703C1C
603818
607818
807810
807810
007000
00F000
00F000
00F000
01E000
01E000
01E000
01E000
03C000
03C000
03C000
038000
078000
078000
0FC000
7FF800
ENDCHAR
STARTCHAR Zacute
ENCODING 172
SWIDTH 667 0
DWIDTH 22 0
BBX 23 32 -1 0
BITMAP
000018
000038
000078
0000E0
000180
000300
000000
03FFFE
03F03E
07C07C
0700F8
0601F0
0E01E0
0C03E0
0807C0
000F80
000F00
001E00
003E00
007C00
00F800
00F000
01F000
03E008
07C018
0F8038
0F0030
1F0070
3E00F0
7C01E0
F807E0
FFFFE0
ENDCHAR
STARTCHAR hyphen
ENCODING 173
SWIDTH 333 0
DWIDTH 11 0
BBX 8 3 1 7
BITMAP
FF
FF
FF
ENDCHAR
STARTCHAR Zcaron
ENCODING 174
SWIDTH 667 0
DWIDTH 22 0
BBX 23 32 -1 0
BITMAP
000818
000C30
000460
0007C0
000380
000300
000000
03FFFE
03F03E
07C07C
0700F8
0601F0
0E01E0
0C03E0
0807C0
000F80
000F00
001E00
003E00
007C00
00F800
00F000
01F000
03E008
07C018
0F8038
0F0030
1F0070
3E00F0
7C01E0
F807E0
FFFFE0
ENDCHAR
STARTCHAR Zdotaccent
ENCODING 175
SWIDTH 667 0
DWIDTH 22 0
BBX 23 30 -1 0
BITMAP
000300
000780
000300
000000
000000
03FFFE
03F03E
07C07C
0700F8
0601F0
0E01E0
0C03E0
0807C0
000F80
000F00
001E00
003E00
007C00
00F800
00F000
01F000
03E008
07C018
0F8038
0F0030
1F0070
3E00F0
7C01E0
F807E0
FFFFE0
ENDCHAR
STARTCHAR degree
ENCODING 176
SWIDTH 400 0
DWIDTH 13 0
BBX 10 9 4 15
BITMAP
3F00
7380
C0C0
C0C0
8040
C0C0
C0C0
7380
3F00
ENDCHAR
STARTCHAR aogonek
ENCODING 177
SWIDTH 574 0
DWIDTH 18 0
BBX 17 21 0 -5
BITMAP
03C300
0FE700
1E3700
3C1E00
381E00
781E00
701C00
F01C00
E01C00
E03800
E03800
E03800
E07880
F0F980
7BBF00
3E1C00
000C00
001800
003000
003B00
001E00
ENDCHAR
STARTCHAR ogonek
ENCODING 178
SWIDTH 383 0
DWIDTH 12 0
BBX 6 5 4 -5
BITMAP
30
60
C0
EC
78
ENDCHAR
STARTCHAR lslash
ENCODING 179
SWIDTH 333 0
DWIDTH 10 0
BBX 10 25 0 0
BITMAP
0380
0F80
0380
0700
0700
0700
0700
0E00
0EC0
0FC0
3F00
FC00
DC00
3800
3800
3800
3000
7000
7000
7100
E100
E300
E600
FC00
7000
ENDCHAR
STARTCHAR acute
ENCODING 180
SWIDTH 333 0
DWIDTH 11 0
BBX 7 6 4 17
BITMAP
06
0E
1E
38
60
C0
ENDCHAR
STARTCHAR lcaron
ENCODING 181
SWIDTH 444 0
DWIDTH 12 0
BBX 17 25 0 0
BITMAP
038100
1F8380
078380
070380
070100
070100
070200
0E0400
0E0000
0E0000
1C0000
1C0000
1C0000
380000
380000
380000
300000
700000
700000
700000
E10000
E30000
E60000
FC0000
700000
ENDCHAR
STARTCHAR sacute
ENCODING 182
SWIDTH 444 0
DWIDTH 14 0
BBX 14 23 0 0
BITMAP
000C
001C
003C
0070
00C0
0180
0000
07E0
1C78
3838
3038
3818
3C00
1F00
1FC0
07E0
01F0
6070
E070
E070
E060
71C0
3F80
ENDCHAR
STARTCHAR caron
ENCODING 183
SWIDTH 415 0
DWIDTH 13 0
BBX 9 6 1 17
BITMAP
8180
C300
4600
7C00
3800
3000
ENDCHAR
STARTCHAR cedilla
ENCODING 184
SWIDTH 383 0
DWIDTH 12 0
BBX 6 7 4 -7
BITMAP
10
20
78
0C
0C
9C
78
ENDCHAR
STARTCHAR scaron
ENCODING 185
SWIDTH 444 0
DWIDTH 14 0
BBX 14 23 0 0
BITMAP
040C
0618
0230
03E0
01C0
0180
0000
07E0
1C78
3838
3038
3818
3C00
1F00
1FC0
07E0
01F0
6070
E070
E070
E060
71C0
3F80
ENDCHAR
STARTCHAR scedilla
ENCODING 186
SWIDTH 444 0
DWIDTH 14 0
BBX 13 23 0 -7
BITMAP
07E0
1C78
3838
3038
3818
3C00
1F00
1FC0
07E0
01F0
6070
E070
E070
E060
71C0
3F80
0400
0800
1E00
0300
0300
6700
3E00
ENDCHAR
STARTCHAR tcaron
ENCODING 187
SWIDTH 320 0
DWIDTH 10 0
BBX 15 26 1 0
BITMAP
0004
000E
000E
000E
0384
0304
0708
0710
0E00
0E00
7FC0
1C00
1C00
1C00
3800
3800
3800
7000
7000
7000
7080
E180
E300
F600
FC00
7000
ENDCHAR
STARTCHAR zacute
ENCODING 188
SWIDTH 463 0
DWIDTH 15 0
BBX 17 23 -1 0
BITMAP
000180
000380
000780
000E00
001800
003000
000000
07C300
0FFF00
19F600
300C00
301800
003000
00E000
01C000
078000
0E0000
1C0000
300400
6C0C00
7F9800
DFF000
C3E000
ENDCHAR
STARTCHAR hungarumlaut
ENCODING 189
SWIDTH 542 0
DWIDTH 17 0
BBX 13 6 1 17
BITMAP
0618
0E38
1C70
38E0
6180
C300
ENDCHAR
STARTCHAR zcaron
ENCODING 190
SWIDTH 463 0
DWIDTH 15 0
BBX 17 23 -1 0
BITMAP
008180
00C300
004600
007C00
003800
003000
000000
07C300
0FFF00
19F600
300C00
301800
003000
00E000
01C000
078000
0E0000
1C0000
300400
6C0C00
7F9800
DFF000
C3E000
ENDCHAR
STARTCHAR zdotaccent
ENCODING 191
SWIDTH 463 0
DWIDTH 15 0
BBX 16 21 -1 0
BITMAP
0030
0078
0030
0000
0000
07C3
0FFF
19F6
300C
3018
0030
00E0
01C0
0780
0E00
1C00
3004
6C0C
7F98
DFF0
C3E0
ENDCHAR
STARTCHAR Racute
ENCODING 192
SWIDTH 741 0
DWIDTH 24 0
BBX 24 33 -1 -1
BITMAP
000060
0000E0
0001E0
000380
000600
000C00
000000
07FFF0
01F8FC
00F81E
00F00E
00F00F
00E00F
01E00F
01E00F
01E01E
01C01E
03C07C
03C7F8
03FFC0
038380
0781C0
0781C0
0781E0
0701E0
0F01E0
0F01E0
0F01E0
0E01E2
1E01E6
3F01FC
FFC0FC
000078
ENDCHAR
STARTCHAR Aacute
ENCODING 193
SWIDTH 704 0
DWIDTH 22 0
BBX 25 32 -3 0
BITMAP
00000C00
00001C00
00003C00
00007000
0000C000
00018000
00000000
0000C000
0001C000
0001C000
0003C000
0007C000
0007E000
000DE000
000DE000
0018E000
0018E000
0030F000
0070F000
0060F000
00C0F000
00C07000
01FFF800
01FFF800
03007800
03007800
06003800
0E003C00
0C003C00
1C003C00
3E007E00
FF81FF80
ENDCHAR
STARTCHAR Acircumflex
ENCODING 194
SWIDTH 704 0
DWIDTH 22 0
BBX 25 32 -3 0
BITMAP
00004000
0000E000
0001F000
00031000
00061800
000C0800
00000000
0000C000
0001C000
0001C000
0003C000
0007C000
0007E000
000DE000
000DE000
0018E000
0018E000
0030F000
0070F000
0060F000
00C0F000
00C07000
01FFF800
01FFF800
03007800
03007800
06003800
0E003C00
0C003C00
1C003C00
3E007E00
FF81FF80
ENDCHAR
STARTCHAR Abreve
ENCODING 195
SWIDTH 704 0
DWIDTH 22 0
BBX 25 32 -3 0
BITMAP
00060600
00060C00
0003F800
0000E000
00000000
00000000
00000000
0000C000
0001C000
0001C000
0003C000
0007C000
0007E000
000DE000
000DE000
0018E000
0018E000
0030F000
0070F000
0060F000
00C0F000
00C07000
01FFF800
01FFF800
03007800
03007800
06003800
0E003C00
0C003C00
1C003C00
3E007E00
FF81FF80
ENDCHAR
STARTCHAR Adieresis
ENCODING 196
SWIDTH 704 0
DWIDTH 22 0
BBX 25 30 -3 0
BITMAP
00031800
0007BC00
00031800
00000000
00000000
0000C000
0001C000
0001C000
0003C000
0007C000
0007E000
000DE000
000DE000
0018E000
0018E000
0030F000
0070F000
0060F000
00C0F000
00C07000
01FFF800
01FFF800
03007800
03007800
06003800
0E003C00
0C003C00
1C003C00
3E007E00
FF81FF80
ENDCHAR
STARTCHAR Lacute
ENCODING 197
SWIDTH 667 0
DWIDTH 21 0
BBX 22 32 -1 0
BITMAP
000180
000380
000780
000E00
001800
003000
000000
07FF00
01FC00
00F000
00F000
00F000
00E000
01E000
01E000
01E000
01C000
03C000
03C000
03C000
038000
078000
078000
07800C
07000C
0F001C
0F0018
0F0038
0E0078
1F00F0
3F87F0
FFFFF0
ENDCHAR
STARTCHAR Cacute
ENCODING 198
SWIDTH 722 0
DWIDTH 23 0
BBX 22 32 1 0
BITMAP
000030
000070
0000F0
0001C0
000300
000600
000000
003F04
01F3CC
03C0FC
07803C
0F003C
1E0038
1E0018
3C0018
7C0010
780010
780000
F80000
F80000
F00000
F00000
F00000
F00000
F00000
F00020
780060
780040
3C01C0
3F0380
0FCF00
03FC00
ENDCHAR
STARTCHAR Ccedilla
ENCODING 199
SWIDTH 722 0
DWIDTH 23 0
BBX 22 32 1 -7
BITMAP
007F80
01F1CC
03C07C
07803C
0F003C
1E0038
1E0018
3C0018
7C0010
780010
780000
F80000
F80000
F00000
F00000
F00000
F00000
F00000
F00020
780060
780040
3C00C0
3E0380
0F9F00
07F800
004000
008000
01E000
003000
003000
067000
03E000
ENDCHAR
STARTCHAR Ccaron
ENCODING 200
SWIDTH 722 0
DWIDTH 23 0
BBX 22 32 1 0
BITMAP
002060
0030C0
001180
001F00
000E00
000C00
000000
003F04
01F3CC
03C0FC
07803C
0F003C
1E0038
1E0018
3C0018
7C0010
780010
780000
F80000
F80000
F00000
F00000
F00000
F00000
F00000
F00020
780060
780040
3C01C0
3F0380
0FCF00
03FC00
ENDCHAR
STARTCHAR Eacute
ENCODING 201
SWIDTH 722 0
DWIDTH 23 0
BBX 24 32 -1 0
BITMAP
000018
000038
000078
0000E0
000180
000300
000000
07FFFF
00F83F
00F00F
00F007
00F007
00F003
01E002
01E0C2
01E0C2
01E1C0
03C180
03C780
03FF80
03CF80
078700
078300
078300
078304
0F020C
0F001C
0F0018
1E0038
1E00F8
3F03F0
FFFFF0
ENDCHAR
STARTCHAR Eogonek
ENCODING 202
SWIDTH 722 0
DWIDTH 23 0
BBX 24 30 -1 -5
BITMAP
07FFFF
00F83F
00F00F
00F007
00F007
00F003
01E042
01E0C2
01E0C0
01E1C0
03C380
03FF80
03FF80
038700
078700
078300
078200
070204
0F000C
0F0018
0F0018
1E0038
1E00F8
3F07F0
FFFFF0
0000C0
000180
000300
0003B0
0001E0
ENDCHAR
STARTCHAR Edieresis
ENCODING 203
SWIDTH 722 0
DWIDTH 23 0
BBX 24 30 -1 0
BITMAP
000630
000F78
000630
000000
000000
07FFFF
00F83F
00F00F
00F007
00F007
00F003
01E002
01E0C2
01E0C2
01E1C0
03C180
03C780
03FF80
03CF80
078700
078300
078300
078304
0F020C
0F001C
0F0018
1E0038
1E00F8
3F03F0
FFFFF0
ENDCHAR
STARTCHAR Ecaron
ENCODING 204
SWIDTH 722 0
DWIDTH 23 0
BBX 24 32 -1 0
BITMAP
000818
000C30
000460
0007C0
000380
000300
000000
07FFFF
00F83F
00F00F
00F007
00F007
00F003
01E042
01E0C2
01E0C0
01E1C0
03C380
03FF80
03FF80
038700
078700
078300
078200
070204
0F000C
0F0018
0F0018
1E0038
1E00F8
3F07F0
FFFFF0
ENDCHAR
STARTCHAR Iacute
ENCODING 205
SWIDTH 407 0
DWIDTH 13 0
BBX 15 32 -1 0
BITMAP
0006
000E
001E
0038
0060
00C0
0000
07FE
01F8
00F0
00F0
00E0
01E0
01E0
01E0
01C0
03C0
03C0
03C0
0380
0780
0780
0780
0700
0F00
0F00
0F00
0E00
1E00
1E00
3F00
FFC0
ENDCHAR
STARTCHAR Icircumflex
ENCODING 206
SWIDTH 407 0
DWIDTH 13 0
BBX 15 32 -1 0
BITMAP
0018
0038
007C
00C4
0186
0302
0000
07FE
01F8
00F0
00F0
00E0
01E0
01E0
01E0
01C0
03C0
03C0
03C0
0380
0780
0780
0780
0700
0F00
0F00
0F00
0E00
1E00
1E00
3F00
FFC0
ENDCHAR
STARTCHAR Dcaron
ENCODING 207
SWIDTH 778 0
DWIDTH 26 0
BBX 26 32 -1 0
BITMAP
00081800
000C3000
00046000
0007C000
00038000
00030000
00000000
07FFF000
00FC7C00
00781F00
00780700
00F00780
00F00380
00F003C0
00F003C0
01E003C0
01E003C0
01E003C0
01E003C0
03C007C0
03C007C0
03C00780
03C00F80
07800F80
07800F00
07801F00
07801E00
0F003C00
0F007800
0F01F000
1F1FE000
FFFF0000
ENDCHAR
STARTCHAR Eth
ENCODING 208
SWIDTH 778 0
DWIDTH 26 0
BBX 26 25 -1 0
BITMAP
07FFF000
00FC3C00
00780E00
00F00700
00F00780
00F00380
00F00380
00E003C0
01E003C0
01E003C0
01E003C0
3FFF03C0
3FFF07C0
03C007C0
03C007C0
03800780
07800F80
07800F00
07801F00
0F001E00
0F003C00
0F007C00
0F00F000
1F07E000
FFFF0000
ENDCHAR
STARTCHAR Nacute
ENCODING 209
SWIDTH 815 0
DWIDTH 27 0
BBX 30 33 -2 -1
BITMAP
00000600
00000E00
00001E00
00003800
00006000
0000C000
00000000
07F807FC
00F801F0
007800E0
007C00E0
00FC00C0
00DE00C0
00DE00C0
009F0080
018F0180
018F0180
01878180
03078100
0303C300
0303C300
0301E300
0601E200
0601E600
0600F600
0600F600
0C007C00
0C007C00
0C003C00
1C003C00
3E003800
FF801800
00001800
ENDCHAR
STARTCHAR Ncaron
ENCODING 210
SWIDTH 815 0
DWIDTH 27 0
BBX 30 33 -2 -1
BITMAP
00020600
00030C00
00011800
0001F000
0000E000
0000C000
00000000
07F807FC
00F801F0
007800E0
007C00E0
00FC00C0
00DE00C0
00DE00C0
009F0080
018F0180
018F0180
01878180
03078100
0303C300
0303C300
0301E300
0601E200
0601E600
0600F600
0600F600
0C007C00
0C007C00
0C003C00
1C003C00
3E003800
FF801800
00001800
ENDCHAR
STARTCHAR Oacute
ENCODING 211
SWIDTH 778 0
DWIDTH 26 0
BBX 24 32 1 0
BITMAP
000018
000038
000078
0000E0
000180
000300
000000
003FC0
00F8F0
03E038
07C01C
0F801E
1F000E
1E000F
3E000F
3C000F
7C000F
78000F
78001F
F8001F
F8001E
F0001E
F0003E
F0003C
F0007C
F00078
7000F8
7801F0
3803E0
3C0780
0F1F00
07FC00
ENDCHAR
STARTCHAR Ocircumflex
ENCODING 212
SWIDTH 778 0
DWIDTH 26 0
BBX 24 32 1 0
BITMAP
000180
000380
0007C0
000C40
001860
003020
000000
003FC0
00F8F0
03E038
07C01C
0F801E
1F000E
1E000F
3E000F
3C000F
7C000F
78000F
78001F
F8001F
F8001E
F0001E
F0003E
F0003C
F0007C
F00078
7000F8
7801F0
3803E0
3C0780
0F1F00
07FC00
ENDCHAR
STARTCHAR Ohungarumlaut
ENCODING 213
SWIDTH 778 0
DWIDTH 26 0
BBX 24 32 1 0
BITMAP
00030C
00071C
000C30
001860
000000
000000
000000
001FC0
00FCF0
03E038
07C01C
0F801E
1F000E
1E000F
3E000F
3C000F
7C000F
78000F
78001F
F8001F
F8001E
F0001E
F0003E
F0003C
F0007C
F00078
7000F8
7801F0
3803E0
3C0780
0F3F00
03F800
ENDCHAR
STARTCHAR Odieresis
ENCODING 214
SWIDTH 778 0
DWIDTH 26 0
BBX 24 30 1 0
BITMAP
001860
003CF0
001860
000000
000000
003FC0
00F8F0
03E038
07C01C
0F801E
1F000E
1E000F
3E000F
3C000F
7C000F
78000F
78001F
F8001F
F8001E
F0001E
F0003E
F0003C
F0007C
F00078
7000F8
7801F0
3803E0
3C0780
0F1F00
07FC00
ENDCHAR
STARTCHAR multiply
ENCODING 215
SWIDTH 606 0
DWIDTH 20 0
BBX 17 17 1 0
BITMAP
400100
E00380
700700
380E00
1C1C00
0E3800
077000
03E000
01C000
03E000
077000
0E3800
1C1C00
380E00
700700
E00380
400100
ENDCHAR
STARTCHAR Rcaron
ENCODING 216
SWIDTH 741 0
DWIDTH 24 0
BBX 24 33 -1 -1
BITMAP
000818
000C30
000460
0007C0
000380
000300
000000
07FFF0
01F8FC
00F81E
00F00E
00F00F
00E00F
01E00F
01E00F
01E01E
01C01E
03C07C
03C7F8
03FFC0
038380
0781C0
0781C0
0781E0
0701E0
0F01E0
0F01E0
0F01E0
0E01E2
1E01E6
3F01FC
FFC0FC
000078
ENDCHAR
STARTCHAR Uring
ENCODING 217
SWIDTH 815 0
DWIDTH 27 0
BBX 26 32 3 0
BITMAP
000F0000
00198000
00108000
00108000
00198000
000F0000
00000000
7FE07FC0
1F801F00
0F000E00
0F000C00
1E000C00
1E000C00
1E001800
1E001800
3C001800
3C001800
3C003000
3C003000
78003000
78002000
78006000
78006000
F0006000
F0004000
F000C000
F000C000
F0018000
78038000
78070000
3E3E0000
07F80000
ENDCHAR
STARTCHAR Uacute
ENCODING 218
SWIDTH 815 0
DWIDTH 27 0
BBX 26 32 3 0
BITMAP
00003000
00007000
0000F000
0001C000
00030000
00060000
00000000
7FE07FC0
1F801F00
0F000E00
0F000C00
1E000C00
1E000C00
1E001800
1E001800
3C001800
3C001800
3C003000
3C003000
78003000
78002000
78006000
78006000
F0006000
F0004000
F000C000
F000C000
F0018000
78038000
78070000
3E1E0000
0FF80000
ENDCHAR
STARTCHAR Uhungarumlaut
ENCODING 219
SWIDTH 815 0
DWIDTH 27 0
BBX 26 32 3 0
BITMAP
00061800
000E3800
00186000
0030C000
00000000
00000000
00000000
7FE07FC0
1F801F00
0F000E00
0F000C00
1E000C00
1E000C00
1E001800
1E001800
3C001800
3C001800
3C003000
3C003000
78003000
78002000
78006000
78006000
F0006000
F0004000
F000C000
F000C000
F0018000
78038000
78070000
3E3E0000
07F80000
ENDCHAR
STARTCHAR Udieresis
ENCODING 220
SWIDTH 815 0
DWIDTH 27 0
BBX 26 30 3 0
BITMAP
00186000
003CF000
00186000
00000000
00000000
7FE07FC0
1F801F00
0F000E00
0F000C00
1E000C00
1E000C00
1E001800
1E001800
3C001800
3C001800
3C003000
3C003000
78003000
78002000
78006000
78006000
F0006000
F0004000
F000C000
F000C000
F0018000
78038000
78070000
3E1E0000
0FF80000
ENDCHAR
STARTCHAR Yacute
ENCODING 221
SWIDTH 685 0
DWIDTH 23 0
BBX 25 32 1 0
BITMAP
00006000
0000E000
0001E000
00038000
00060000
000C0000
00000000
FFE1FF80
3F807E00
1F003800
0F003000
0F006000
0780E000
0780C000
03C18000
03C30000
03C70000
01E60000
01EC0000
00FC0000
00F80000
00F00000
00F00000
00F00000
01E00000
01E00000
01E00000
01E00000
03C00000
03C00000
0FE00000
3FFC0000
ENDCHAR
STARTCHAR Tcedilla
ENCODING 222
SWIDTH 685 0
DWIDTH 22 0
BBX 23 32 1 -7
BITMAP
3FFFFE
3F3E7E
3C3C1C
783C1C
703C1C
603818
607818
807810
807810
007000
00F000
00F000
00F000
01E000
01E000
01E000
01E000
03C000
03C000
03C000
038000
078000
078000
0FC000
7FF800
010000
020000
078000
00C000
00C000
19C000
0F8000
ENDCHAR
STARTCHAR germandbls
ENCODING 223
SWIDTH 556 0
DWIDTH 19 0
BBX 20 31 -2 -6
BITMAP
000F80
0038E0
007060
00E070
00C070
01C070
018070
0380E0
0380E0
0383C0
031F00
070600
070380
070180
0E01C0
0E01C0
0E01C0
0E03C0
1C03C0
1C03C0
1CC380
1DE780
39E700
39CE00
38F800
700000
700000
700000
E00000
E00000
E00000
ENDCHAR
STARTCHAR racute
ENCODING 224
SWIDTH 444 0
DWIDTH 14 0
BBX 15 23 0 0
BITMAP
0006
000E
001E
0038
0060
00C0
0000
0E78
7EFC
0D9C
0D1C
1F08
1E00
1C00
1C00
3800
3800
3800
7000
7000
7000
F000
E000
ENDCHAR
STARTCHAR aacute
ENCODING 225
SWIDTH 574 0
DWIDTH 18 0
BBX 17 23 0 0
BITMAP
000300
000700
000F00
001C00
003000
006000
000000
03C300
0FE700
1E3700
3C1E00
381E00
781E00
701C00
F01C00
E01C00
E03800
E03800
E03880
E07980
F0FB00
7BBF00
3E1C00
ENDCHAR
STARTCHAR acircumflex
ENCODING 226
SWIDTH 574 0
DWIDTH 18 0
BBX 17 23 0 0
BITMAP
003000
007000
00F800
018800
030C00
060400
000000
03C300
0FE700
1E3700
3C1E00
381E00
781E00
701C00
F01C00
E01C00
E03800
E03800
E03880
E07980
F0FB00
7BBF00
3E1C00
ENDCHAR
STARTCHAR abreve
ENCODING 227
SWIDTH 574 0
DWIDTH 18 0
BBX 17 23 0 0
BITMAP
018180
018300
00FE00
003800
000000
000000
000000
03C300
0FE700
1E3700
3C1E00
381E00
781E00
701C00
F01C00
E01C00
E03800
E03800
E03800
E07880
F0F980
7BBF00
3E1C00
ENDCHAR
STARTCHAR adieresis
ENCODING 228
SWIDTH 574 0
DWIDTH 18 0
BBX 17 21 0 0
BITMAP
018C00
03DE00
018C00
000000
000000
03C300
0FE700
1E3700
3C1E00
381E00
781E00
701C00
F01C00
E01C00
E03800
E03800
E03880
E07980
F0FB00
7BBF00
3E1C00
ENDCHAR
STARTCHAR lacute
ENCODING 229
SWIDTH 333 0
DWIDTH 9 0
BBX 14 32 0 0
BITMAP
000C
001C
003C
0070
00C0
0180
0000
0380
1F80
0780
0700
0700
0700
0700
0E00
0E00
0E00
1C00
1C00
1C00
3800
3800
3800
3000
7000
7000
7000
E100
E300
E600
FC00
7000
ENDCHAR
STARTCHAR cacute
ENCODING 230
SWIDTH 444 0
DWIDTH 14 0
BBX 15 23 0 0
BITMAP
0006
000E
001E
0038
0060
00C0
0000
03E0
0E30
1C18
3878
7878
7030
F000
E000
E000
E000
E000
E000
E030
7060
7DC0
1F00
ENDCHAR
STARTCHAR ccedilla
ENCODING 231
SWIDTH 444 0
DWIDTH 14 0
BBX 13 23 0 -7
BITMAP
03E0
0E30
1C18
3878
7878
7030
F000
F000
E000
E000
E000
E000
E030
7060
7DC0
1F00
0200
0400
0F00
0180
0180
1380
0F00
ENDCHAR
STARTCHAR ccaron
ENCODING 232
SWIDTH 444 0
DWIDTH 14 0
BBX 15 23 0 0
BITMAP
0206
030C
0118
01F0
00E0
00C0
0000
03E0
0E30
1C18
3878
7878
7030
F000
E000
E000
E000
E000
E000
E030
7060
7DC0
1F00
ENDCHAR
STARTCHAR eacute
ENCODING 233
SWIDTH 444 0
DWIDTH 14 0
BBX 13 23 0 0
BITMAP
0018
0038
0078
00E0
0180
0300
0000
03E0
0E70
1C38
3838
3838
7070
70E0
F1C0
E700
FC00
E000
E000
E030
7060
7BC0
1F00
ENDCHAR
STARTCHAR eogonek
ENCODING 234
SWIDTH 444 0
DWIDTH 14 0
BBX 13 21 0 -5
BITMAP
03E0
0E70
1C38
3838
3838
7070
70E0
F1C0
E700
FC00
E000
E000
E030
7060
7BC0
1F00
0C00
1800
3000
3B00
1E00
ENDCHAR
STARTCHAR edieresis
ENCODING 235
SWIDTH 444 0
DWIDTH 14 0
BBX 13 21 0 0
BITMAP
0630
0F78
0630
0000
0000
03E0
0E70
1C38
3838
3838
7070
70E0
F1C0
E700
FC00
E000
E000
E030
7060
7BC0
1F00
ENDCHAR
STARTCHAR ecaron
ENCODING 236
SWIDTH 444 0
DWIDTH 14 0
BBX 15 23 0 0
BITMAP
0206
030C
0118
01F0
00E0
00C0
0000
03E0
0E70
1C38
3838
3838
7070
70E0
F1C0
E700
FC00
E000
E000
E030
7060
7BC0
1F00
ENDCHAR
STARTCHAR iacute
ENCODING 237
SWIDTH 333 0
DWIDTH 11 0
BBX 11 23 1 0
BITMAP
0060
00E0
01E0
0380
0600
0C00
0000
0E00
7E00
1C00
1C00
1C00
3800
3800
3800
7000
7000
7100
E300
E200
E600
FC00
7000
ENDCHAR
STARTCHAR icircumflex
ENCODING 238
SWIDTH 333 0
DWIDTH 11 0
BBX 10 23 1 0
BITMAP
0300
0700
0F80
1880
30C0
6040
0000
0E00
7E00
1C00
1C00
1C00
3800
3800
3800
7000
7000
7100
E300
E200
E600
FC00
7000
ENDCHAR
STARTCHAR dcaron
ENCODING 239
SWIDTH 549 0
DWIDTH 18 0
BBX 23 25 0 0
BITMAP
0000E4
0003EE
0000EE
0000EE
0001C4
0001C4
0001C8
0003D0
000380
01F380
0F1B80
1E0F00
3C0F00
380F00
780E00
700E00
F00E00
F00E00
E01C00
E01C00
E03C00
E03C40
7078C0
79DF80
3F8E00
ENDCHAR
STARTCHAR dmacron
ENCODING 240
SWIDTH 611 0
DWIDTH 20 0
BBX 21 25 0 0
BITMAP
0000E0
0003E0
0000E0
0000E0
01FFF8
01FFF8
0001C0
0003C0
000380
01F380
0F1B80
1E0F00
3C0F00
380F00
780E00
700E00
F00E00
F00E00
E01C00
E01C00
E03C00
E03C40
7078C0
79DF80
3F8E00
ENDCHAR
STARTCHAR nacute
ENCODING 241
SWIDTH 611 0
DWIDTH 20 0
BBX 17 23 1 0
BITMAP
000300
000700
000F00
001C00
003000
006000
000000
1C3800
7CFC00
1D8E00
1F0E00
1E0E00
3C1C00
381C00
381C00
783800
703800
703800
703080
E07180
E07300
E07E00
E03800
ENDCHAR
STARTCHAR ncaron
ENCODING 242
SWIDTH 611 0
DWIDTH 20 0
BBX 17 23 1 0
BITMAP
008180
00C300
004600
007C00
003800
003000
000000
1C3800
7CFC00
1D8E00
1F0E00
1E0E00
3C1C00
381C00
381C00
783800
703800
703800
703080
E07180
E07300
E07E00
E03800
ENDCHAR
STARTCHAR oacute
ENCODING 243
SWIDTH 500 0
DWIDTH 16 0
BBX 15 23 0 0
BITMAP
000C
001C
003C
0070
00C0
0180
0000
03F0
0E38
1C1C
380C
780E
700E
700E
F00E
E01E
E01C
E01C
E038
E038
7070
38E0
1F80
ENDCHAR
STARTCHAR ocircumflex
ENCODING 244
SWIDTH 500 0
DWIDTH 16 0
BBX 15 23 0 0
BITMAP
0020
0070
00F8
0188
030C
0604
0000
03F0
0E38
1C1C
380C
780E
700E
700E
F00E
E01E
E01C
E01C
E038
E038
7070
38E0
1F80
ENDCHAR
STARTCHAR ohungarumlaut
ENCODING 245
SWIDTH 500 0
DWIDTH 16 0
BBX 18 23 0 0
BITMAP
0030C0
0071C0
00E380
01C700
030C00
061800
000000
03F000
0E3800
1C1C00
380C00
780E00
700E00
700E00
F00E00
E01E00
E01C00
E01C00
E03800
E03800
707000
38E000
1F8000
ENDCHAR
STARTCHAR odieresis
ENCODING 246
SWIDTH 500 0
DWIDTH 16 0
BBX 15 21 0 0
BITMAP
0318
07BC
0318
0000
0000
03F0
0E38
1C1C
380C
780E
700E
700E
F00E
E01E
E01C
E01C
E038
E038
7070
38E0
1F80
ENDCHAR
STARTCHAR divide
ENCODING 247
SWIDTH 606 0
DWIDTH 20 0
BBX 18 14 1 1
BITMAP
00C000
01E000
01E000
00C000
000000
000000
FFFFC0
FFFFC0
000000
000000
00C000
01E000
01E000
00C000
ENDCHAR
STARTCHAR rcaron
ENCODING 248
SWIDTH 444 0
DWIDTH 14 0
BBX 16 23 0 0
BITMAP
0103
0186
008C
00F8
0070
0060
0000
0E78
7EFC
0D9C
0D1C
1F08
1E00
1C00
1C00
3800
3800
3800
7000
7000
7000
F000
E000
ENDCHAR
STARTCHAR uring
ENCODING 249
SWIDTH 611 0
DWIDTH 20 0
BBX 17 23 1 0
BITMAP
00F000
019800
010800
010800
019800
00F000
000000
1E0700
7C0F00
1C0E00
1C0E00
381E00
381C00
381C00
703C00
703800
707800
E07800
E0F180
E1F300
E77700
FE7C00
783800
ENDCHAR
STARTCHAR uacute
ENCODING 250
SWIDTH 611 0
DWIDTH 20 0
BBX 17 23 1 0
BITMAP
000C00
001C00
003C00
007000
00C000
018000
000000
1C0700
7C0F00
1C0E00
1C0E00
381E00
381C00
381C00
703C00
703800
707800
E07800
E0F180
E1F300
E37700
FE7C00
783800
ENDCHAR
STARTCHAR uhungarumlaut
ENCODING 251
SWIDTH 611 0
DWIDTH 20 0
BBX 19 23 1 0
BITMAP
001860
0038E0
0071C0
00E380
018600
030C00
000000
1E0700
7C0F00
1C0E00
1C0E00
381E00
381C00
381C00
703C00
703800
707800
E07800
E0F180
E1F300
E77700
FE7C00
783800
ENDCHAR
STARTCHAR udieresis
ENCODING 252
SWIDTH 611 0
DWIDTH 20 0
BBX 17 21 1 0
BITMAP
031800
07BC00
031800
000000
000000
1C0700
7C0F00
1C0E00
1C0E00
381E00
381C00
381C00
703C00
703800
707800
E07800
E0F180
E1F300
E37700
FE7C00
783800
ENDCHAR
STARTCHAR yacute
ENCODING 253
SWIDTH 500 0
DWIDTH 16 0
BBX 18 30 -3 -7
BITMAP
000300
000700
000F00
001C00
003000
006000
000000
0701C0
0F81C0
0F81C0
1BC1C0
11C180
11C180
01C100
00E300
00E200
00E600
00E400
007C00
007800
007800
007000
006000
006000
00C000
00C000
E18000
E30000
E60000
7C0000
ENDCHAR
STARTCHAR tcedilla
ENCODING 254
SWIDTH 352 0
DWIDTH 11 0
BBX 11 29 0 -7
BITMAP
01C0
0180
0380
0380
0700
0700
3FE0
0E00
0E00
0E00
1C00
1C00
1C00
3800
3800
3800
3840
70C0
7180
7B00
7E00
3800
0800
1000
3C00
0600
0600
CE00
7C00
ENDCHAR
STARTCHAR dotaccent
ENCODING 255
SWIDTH 319 0
DWIDTH 10 0
BBX 4 3 3 17
BITMAP
60
F0
60
ENDCHAR
ENDFONT
