<root>

<!-- no entry break, no subindent -->

  <item1><para>
    This is a paragraph.
  </para></item1>

<!-- no entry break, subindent = 2 -->

  <item2><para>
      This is a paragraph.
    </para></item2>

</root>
