#define icon_width 32
#define icon_height 32
static char icon_bits[] = {
  0x00, 0x00, 0x00, 0x00, 0x00, 0x00, 0x00, 0x00, 0x00, 0x00, 0x00, 0x00,
  0x00, 0x00, 0x00, 0x00, 0x00, 0x00, 0x00, 0x00, 0x00, 0x00, 0x00, 0x00,
  0x00, 0x00, 0x00, 0x00, 0x00, 0x00, 0x00, 0x10, 0xc0, 0x0f, 0x40, 0x10,
  0x30, 0x70, 0x41, 0x10, 0x08, 0x80, 0x41, 0x10, 0x04, 0x00, 0x43, 0x10,
  0x04, 0x00, 0x45, 0x13, 0x02, 0x00, 0xc9, 0x14, 0x02, 0x00, 0x71, 0x12,
  0x02, 0x00, 0x41, 0x11, 0x02, 0x00, 0x41, 0x11, 0x02, 0x00, 0x71, 0x12,
  0x02, 0x00, 0xc9, 0x14, 0x04, 0x00, 0x45, 0x13, 0x04, 0x00, 0x43, 0x10,
  0x08, 0x80, 0x41, 0x10, 0x30, 0x70, 0x41, 0x10, 0xc0, 0x0f, 0x40, 0x10,
  0x00, 0x00, 0x00, 0x10, 0x00, 0x00, 0x00, 0x00, 0x00, 0x00, 0x00, 0x00,
  0x00, 0x00, 0x00, 0x00, 0x00, 0x00, 0x00, 0x00, 0x00, 0x00, 0x00, 0x00,
  0x00, 0x00, 0x00, 0x00, 0x00, 0x00, 0x00, 0x00, };
