  0
SECTION
  2
HEADER
  9
$ACADVER
  1
AC1009
  9
$INSBASE
 10
0.0
 20
0.0
 30
0.0
  9
$EXTMIN
 10
0
 20
0
 30
0
  9
$EXTMAX
 10
12000
 20
2000
 30
2000
  9
$LIMMIN
 10
-6000
 20
-1000
  9
$LIMMAX
 10
18000
 20
3000
  9
$CLAYER
  8
Z88NET
  9
$PDMODE
 70
     3
  9
$PDSIZE
 40
-3.0
  0
ENDSEC
  0
SECTION
  2
TABLES
  0
TABLE
  2
LTYPE
 70
     1
  0
LTYPE
  2
CONTINUOUS
 70
    64
  3
Solid line
 72
    65
 73
     0
 40
0.0
  0
ENDTAB
  0
TABLE
  2
LAYER
 70
     6
  0
LAYER
  2
0
 70
    64
 62
    -7
  6
CONTINUOUS
  0
LAYER
  2
Z88NET
 70
    64
 62
     5
  6
CONTINUOUS
  0
LAYER
  2
Z88EIO
 70
    64
 62
     5
  6
CONTINUOUS
  0
LAYER
  2
Z88KNR
 70
    64
 62
     1
  6
CONTINUOUS
  0
LAYER
  2
Z88RBD
 70
    64
 62
     6
  6
CONTINUOUS
  0
LAYER
  2
Z88GEN
 70
    64
 62
     6
  6
CONTINUOUS
  0
LAYER
  2
Z88PKT
 70
    64
 62
     1
  6
CONTINUOUS
  0
ENDTAB
  0
ENDSEC
  0
SECTION
  2
ENTITIES
  0
TEXT
  8
Z88GEN
 10
-6000
 20
2920.08
 30
0.0
 40
53.28
  1
Z88I1.TXT 3 20 54 60 1 0 0 0 0
  0
TEXT
  8
Z88GEN
 10
-6000
 20
2840.16
 30
0.0
 40
53.28
  1
MAT 1 1 54 200000 0.3 1 500
  0
TEXT
  8
Z88RBD
 10
-6000
 20
2760.24
 30
0.0
 40
53.28
  1
Z88I2.TXT 10
  0
TEXT
  8
Z88RBD
 10
-6000
 20
2680.32
 30
0.0
 40
53.28
  1
RBD 1 1 2 2 0
  0
TEXT
  8
Z88RBD
 10
-6000
 20
2600.4
 30
0.0
 40
53.28
  1
RBD 2 1 3 2 0
  0
TEXT
  8
Z88RBD
 10
-6000
 20
2520.48
 30
0.0
 40
53.28
  1
RBD 3 2 1 2 0
  0
TEXT
  8
Z88RBD
 10
-6000
 20
2440.56
 30
0.0
 40
53.28
  1
RBD 4 2 3 2 0
  0
TEXT
  8
Z88RBD
 10
-6000
 20
2360.64
 30
0.0
 40
53.28
  1
RBD 5 7 3 1 -30000
  0
TEXT
  8
Z88RBD
 10
-6000
 20
2280.72
 30
0.0
 40
53.28
  1
RBD 6 8 3 1 -30000
  0
TEXT
  8
Z88RBD
 10
-6000
 20
2200.8
 30
0.0
 40
53.28
  1
RBD 7 19 1 2 0
  0
TEXT
  8
Z88RBD
 10
-6000
 20
2120.88
 30
0.0
 40
53.28
  1
RBD 8 19 3 2 0
  0
TEXT
  8
Z88RBD
 10
-6000
 20
2040.96
 30
0.0
 40
53.28
  1
RBD 9 20 2 2 0
  0
TEXT
  8
Z88RBD
 10
-6000
 20
1961.04
 30
0.0
 40
53.28
  1
RBD 10 20 3 2 0
  0
TEXT
  8
Z88GEN
 10
-6000
 20
1881.12
 30
0.0
 40
53.28
  1
Z88I3.TXT 0 0 0
  0
POINT
  8
Z88PKT
 10
0
 20
2000
 30
0
  0
TEXT
  8
Z88KNR
 10
0
 20
2000
 30
0
 40
53.28
  1
P 1
  0
POINT
  8
Z88PKT
 10
0
 20
0
 30
0
  0
TEXT
  8
Z88KNR
 10
0
 20
0
 30
0
 40
53.28
  1
P 2
  0
POINT
  8
Z88PKT
 10
1000
 20
1000
 30
2000
  0
TEXT
  8
Z88KNR
 10
1000
 20
1000
 30
2000
 40
53.28
  1
P 3
  0
POINT
  8
Z88PKT
 10
2000
 20
2000
 30
0
  0
TEXT
  8
Z88KNR
 10
2000
 20
2000
 30
0
 40
53.28
  1
P 4
  0
POINT
  8
Z88PKT
 10
2000
 20
0
 30
0
  0
TEXT
  8
Z88KNR
 10
2000
 20
0
 30
0
 40
53.28
  1
P 5
  0
POINT
  8
Z88PKT
 10
3000
 20
1000
 30
2000
  0
TEXT
  8
Z88KNR
 10
3000
 20
1000
 30
2000
 40
53.28
  1
P 6
  0
POINT
  8
Z88PKT
 10
4000
 20
2000
 30
0
  0
TEXT
  8
Z88KNR
 10
4000
 20
2000
 30
0
 40
53.28
  1
P 7
  0
POINT
  8
Z88PKT
 10
4000
 20
0
 30
0
  0
TEXT
  8
Z88KNR
 10
4000
 20
0
 30
0
 40
53.28
  1
P 8
  0
POINT
  8
Z88PKT
 10
5000
 20
1000
 30
2000
  0
TEXT
  8
Z88KNR
 10
5000
 20
1000
 30
2000
 40
53.28
  1
P 9
  0
POINT
  8
Z88PKT
 10
6000
 20
2000
 30
0
  0
TEXT
  8
Z88KNR
 10
6000
 20
2000
 30
0
 40
53.28
  1
P 10
  0
POINT
  8
Z88PKT
 10
6000
 20
0
 30
0
  0
TEXT
  8
Z88KNR
 10
6000
 20
0
 30
0
 40
53.28
  1
P 11
  0
POINT
  8
Z88PKT
 10
7000
 20
1000
 30
2000
  0
TEXT
  8
Z88KNR
 10
7000
 20
1000
 30
2000
 40
53.28
  1
P 12
  0
POINT
  8
Z88PKT
 10
8000
 20
2000
 30
0
  0
TEXT
  8
Z88KNR
 10
8000
 20
2000
 30
0
 40
53.28
  1
P 13
  0
POINT
  8
Z88PKT
 10
8000
 20
0
 30
0
  0
TEXT
  8
Z88KNR
 10
8000
 20
0
 30
0
 40
53.28
  1
P 14
  0
POINT
  8
Z88PKT
 10
9000
 20
1000
 30
2000
  0
TEXT
  8
Z88KNR
 10
9000
 20
1000
 30
2000
 40
53.28
  1
P 15
  0
POINT
  8
Z88PKT
 10
10000
 20
2000
 30
0
  0
TEXT
  8
Z88KNR
 10
10000
 20
2000
 30
0
 40
53.28
  1
P 16
  0
POINT
  8
Z88PKT
 10
10000
 20
0
 30
0
  0
TEXT
  8
Z88KNR
 10
10000
 20
0
 30
0
 40
53.28
  1
P 17
  0
POINT
  8
Z88PKT
 10
11000
 20
1000
 30
2000
  0
TEXT
  8
Z88KNR
 10
11000
 20
1000
 30
2000
 40
53.28
  1
P 18
  0
POINT
  8
Z88PKT
 10
12000
 20
2000
 30
0
  0
TEXT
  8
Z88KNR
 10
12000
 20
2000
 30
0
 40
53.28
  1
P 19
  0
POINT
  8
Z88PKT
 10
12000
 20
0
 30
0
  0
TEXT
  8
Z88KNR
 10
12000
 20
0
 30
0
 40
53.28
  1
P 20
  0
TEXT
  8
Z88EIO
 10
0
 20
1000
 30
0
 40
53.28
  1
FE 1 4
  0
TEXT
  8
Z88EIO
 10
2000
 20
1000
 30
0
 40
53.28
  1
FE 2 4
  0
TEXT
  8
Z88EIO
 10
4000
 20
1000
 30
0
 40
53.28
  1
FE 3 4
  0
TEXT
  8
Z88EIO
 10
6000
 20
1000
 30
0
 40
53.28
  1
FE 4 4
  0
TEXT
  8
Z88EIO
 10
8000
 20
1000
 30
0
 40
53.28
  1
FE 5 4
  0
TEXT
  8
Z88EIO
 10
10000
 20
1000
 30
0
 40
53.28
  1
FE 6 4
  0
TEXT
  8
Z88EIO
 10
12000
 20
1000
 30
0
 40
53.28
  1
FE 7 4
  0
TEXT
  8
Z88EIO
 10
1000
 20
2000
 30
0
 40
53.28
  1
FE 8 4
  0
TEXT
  8
Z88EIO
 10
1000
 20
0
 30
0
 40
53.28
  1
FE 9 4
  0
TEXT
  8
Z88EIO
 10
3000
 20
2000
 30
0
 40
53.28
  1
FE 10 4
  0
TEXT
  8
Z88EIO
 10
3000
 20
0
 30
0
 40
53.28
  1
FE 11 4
  0
TEXT
  8
Z88EIO
 10
5000
 20
2000
 30
0
 40
53.28
  1
FE 12 4
  0
TEXT
  8
Z88EIO
 10
5000
 20
0
 30
0
 40
53.28
  1
FE 13 4
  0
TEXT
  8
Z88EIO
 10
7000
 20
2000
 30
0
 40
53.28
  1
FE 14 4
  0
TEXT
  8
Z88EIO
 10
7000
 20
0
 30
0
 40
53.28
  1
FE 15 4
  0
TEXT
  8
Z88EIO
 10
9000
 20
2000
 30
0
 40
53.28
  1
FE 16 4
  0
TEXT
  8
Z88EIO
 10
9000
 20
0
 30
0
 40
53.28
  1
FE 17 4
  0
TEXT
  8
Z88EIO
 10
11000
 20
2000
 30
0
 40
53.28
  1
FE 18 4
  0
TEXT
  8
Z88EIO
 10
11000
 20
0
 30
0
 40
53.28
  1
FE 19 4
  0
TEXT
  8
Z88EIO
 10
500
 20
1500
 30
1000
 40
53.28
  1
FE 20 4
  0
TEXT
  8
Z88EIO
 10
2500
 20
1500
 30
1000
 40
53.28
  1
FE 21 4
  0
TEXT
  8
Z88EIO
 10
4500
 20
1500
 30
1000
 40
53.28
  1
FE 22 4
  0
TEXT
  8
Z88EIO
 10
6500
 20
1500
 30
1000
 40
53.28
  1
FE 23 4
  0
TEXT
  8
Z88EIO
 10
8500
 20
1500
 30
1000
 40
53.28
  1
FE 24 4
  0
TEXT
  8
Z88EIO
 10
10500
 20
1500
 30
1000
 40
53.28
  1
FE 25 4
  0
TEXT
  8
Z88EIO
 10
500
 20
500
 30
1000
 40
53.28
  1
FE 26 4
  0
TEXT
  8
Z88EIO
 10
2500
 20
500
 30
1000
 40
53.28
  1
FE 27 4
  0
TEXT
  8
Z88EIO
 10
4500
 20
500
 30
1000
 40
53.28
  1
FE 28 4
  0
TEXT
  8
Z88EIO
 10
6500
 20
500
 30
1000
 40
53.28
  1
FE 29 4
  0
TEXT
  8
Z88EIO
 10
8500
 20
500
 30
1000
 40
53.28
  1
FE 30 4
  0
TEXT
  8
Z88EIO
 10
10500
 20
500
 30
1000
 40
53.28
  1
FE 31 4
  0
TEXT
  8
Z88EIO
 10
1500
 20
1500
 30
1000
 40
53.28
  1
FE 32 4
  0
TEXT
  8
Z88EIO
 10
3500
 20
1500
 30
1000
 40
53.28
  1
FE 33 4
  0
TEXT
  8
Z88EIO
 10
5500
 20
1500
 30
1000
 40
53.28
  1
FE 34 4
  0
TEXT
  8
Z88EIO
 10
7500
 20
1500
 30
1000
 40
53.28
  1
FE 35 4
  0
TEXT
  8
Z88EIO
 10
9500
 20
1500
 30
1000
 40
53.28
  1
FE 36 4
  0
TEXT
  8
Z88EIO
 10
11500
 20
1500
 30
1000
 40
53.28
  1
FE 37 4
  0
TEXT
  8
Z88EIO
 10
1500
 20
500
 30
1000
 40
53.28
  1
FE 38 4
  0
TEXT
  8
Z88EIO
 10
3500
 20
500
 30
1000
 40
53.28
  1
FE 39 4
  0
TEXT
  8
Z88EIO
 10
5500
 20
500
 30
1000
 40
53.28
  1
FE 40 4
  0
TEXT
  8
Z88EIO
 10
7500
 20
500
 30
1000
 40
53.28
  1
FE 41 4
  0
TEXT
  8
Z88EIO
 10
9500
 20
500
 30
1000
 40
53.28
  1
FE 42 4
  0
TEXT
  8
Z88EIO
 10
11500
 20
500
 30
1000
 40
53.28
  1
FE 43 4
  0
TEXT
  8
Z88EIO
 10
2000
 20
1000
 30
2000
 40
53.28
  1
FE 44 4
  0
TEXT
  8
Z88EIO
 10
4000
 20
1000
 30
2000
 40
53.28
  1
FE 45 4
  0
TEXT
  8
Z88EIO
 10
6000
 20
1000
 30
2000
 40
53.28
  1
FE 46 4
  0
TEXT
  8
Z88EIO
 10
8000
 20
1000
 30
2000
 40
53.28
  1
FE 47 4
  0
TEXT
  8
Z88EIO
 10
10000
 20
1000
 30
2000
 40
53.28
  1
FE 48 4
  0
TEXT
  8
Z88EIO
 10
1000
 20
1000
 30
0
 40
53.28
  1
FE 49 4
  0
TEXT
  8
Z88EIO
 10
3000
 20
1000
 30
0
 40
53.28
  1
FE 50 4
  0
TEXT
  8
Z88EIO
 10
5000
 20
1000
 30
0
 40
53.28
  1
FE 51 4
  0
TEXT
  8
Z88EIO
 10
7000
 20
1000
 30
0
 40
53.28
  1
FE 52 4
  0
TEXT
  8
Z88EIO
 10
9000
 20
1000
 30
0
 40
53.28
  1
FE 53 4
  0
TEXT
  8
Z88EIO
 10
11000
 20
1000
 30
0
 40
53.28
  1
FE 54 4
  0
LINE
  8
Z88NET
 10
0
 20
2000
 30
0
 11
0
 21
0
 31
0
  0
LINE
  8
Z88NET
 10
2000
 20
2000
 30
0
 11
2000
 21
0
 31
0
  0
LINE
  8
Z88NET
 10
4000
 20
2000
 30
0
 11
4000
 21
0
 31
0
  0
LINE
  8
Z88NET
 10
6000
 20
2000
 30
0
 11
6000
 21
0
 31
0
  0
LINE
  8
Z88NET
 10
8000
 20
2000
 30
0
 11
8000
 21
0
 31
0
  0
LINE
  8
Z88NET
 10
10000
 20
2000
 30
0
 11
10000
 21
0
 31
0
  0
LINE
  8
Z88NET
 10
12000
 20
2000
 30
0
 11
12000
 21
0
 31
0
  0
LINE
  8
Z88NET
 10
0
 20
2000
 30
0
 11
2000
 21
2000
 31
0
  0
LINE
  8
Z88NET
 10
0
 20
0
 30
0
 11
2000
 21
0
 31
0
  0
LINE
  8
Z88NET
 10
2000
 20
2000
 30
0
 11
4000
 21
2000
 31
0
  0
LINE
  8
Z88NET
 10
2000
 20
0
 30
0
 11
4000
 21
0
 31
0
  0
LINE
  8
Z88NET
 10
4000
 20
2000
 30
0
 11
6000
 21
2000
 31
0
  0
LINE
  8
Z88NET
 10
4000
 20
0
 30
0
 11
6000
 21
0
 31
0
  0
LINE
  8
Z88NET
 10
6000
 20
2000
 30
0
 11
8000
 21
2000
 31
0
  0
LINE
  8
Z88NET
 10
6000
 20
0
 30
0
 11
8000
 21
0
 31
0
  0
LINE
  8
Z88NET
 10
8000
 20
2000
 30
0
 11
10000
 21
2000
 31
0
  0
LINE
  8
Z88NET
 10
8000
 20
0
 30
0
 11
10000
 21
0
 31
0
  0
LINE
  8
Z88NET
 10
10000
 20
2000
 30
0
 11
12000
 21
2000
 31
0
  0
LINE
  8
Z88NET
 10
10000
 20
0
 30
0
 11
12000
 21
0
 31
0
  0
LINE
  8
Z88NET
 10
0
 20
2000
 30
0
 11
1000
 21
1000
 31
2000
  0
LINE
  8
Z88NET
 10
2000
 20
2000
 30
0
 11
3000
 21
1000
 31
2000
  0
LINE
  8
Z88NET
 10
4000
 20
2000
 30
0
 11
5000
 21
1000
 31
2000
  0
LINE
  8
Z88NET
 10
6000
 20
2000
 30
0
 11
7000
 21
1000
 31
2000
  0
LINE
  8
Z88NET
 10
8000
 20
2000
 30
0
 11
9000
 21
1000
 31
2000
  0
LINE
  8
Z88NET
 10
10000
 20
2000
 30
0
 11
11000
 21
1000
 31
2000
  0
LINE
  8
Z88NET
 10
0
 20
0
 30
0
 11
1000
 21
1000
 31
2000
  0
LINE
  8
Z88NET
 10
2000
 20
0
 30
0
 11
3000
 21
1000
 31
2000
  0
LINE
  8
Z88NET
 10
4000
 20
0
 30
0
 11
5000
 21
1000
 31
2000
  0
LINE
  8
Z88NET
 10
6000
 20
0
 30
0
 11
7000
 21
1000
 31
2000
  0
LINE
  8
Z88NET
 10
8000
 20
0
 30
0
 11
9000
 21
1000
 31
2000
  0
LINE
  8
Z88NET
 10
10000
 20
0
 30
0
 11
11000
 21
1000
 31
2000
  0
LINE
  8
Z88NET
 10
1000
 20
1000
 30
2000
 11
2000
 21
2000
 31
0
  0
LINE
  8
Z88NET
 10
3000
 20
1000
 30
2000
 11
4000
 21
2000
 31
0
  0
LINE
  8
Z88NET
 10
5000
 20
1000
 30
2000
 11
6000
 21
2000
 31
0
  0
LINE
  8
Z88NET
 10
7000
 20
1000
 30
2000
 11
8000
 21
2000
 31
0
  0
LINE
  8
Z88NET
 10
9000
 20
1000
 30
2000
 11
10000
 21
2000
 31
0
  0
LINE
  8
Z88NET
 10
11000
 20
1000
 30
2000
 11
12000
 21
2000
 31
0
  0
LINE
  8
Z88NET
 10
1000
 20
1000
 30
2000
 11
2000
 21
0
 31
0
  0
LINE
  8
Z88NET
 10
3000
 20
1000
 30
2000
 11
4000
 21
0
 31
0
  0
LINE
  8
Z88NET
 10
5000
 20
1000
 30
2000
 11
6000
 21
0
 31
0
  0
LINE
  8
Z88NET
 10
7000
 20
1000
 30
2000
 11
8000
 21
0
 31
0
  0
LINE
  8
Z88NET
 10
9000
 20
1000
 30
2000
 11
10000
 21
0
 31
0
  0
LINE
  8
Z88NET
 10
11000
 20
1000
 30
2000
 11
12000
 21
0
 31
0
  0
LINE
  8
Z88NET
 10
1000
 20
1000
 30
2000
 11
3000
 21
1000
 31
2000
  0
LINE
  8
Z88NET
 10
3000
 20
1000
 30
2000
 11
5000
 21
1000
 31
2000
  0
LINE
  8
Z88NET
 10
5000
 20
1000
 30
2000
 11
7000
 21
1000
 31
2000
  0
LINE
  8
Z88NET
 10
7000
 20
1000
 30
2000
 11
9000
 21
1000
 31
2000
  0
LINE
  8
Z88NET
 10
9000
 20
1000
 30
2000
 11
11000
 21
1000
 31
2000
  0
LINE
  8
Z88NET
 10
0
 20
0
 30
0
 11
2000
 21
2000
 31
0
  0
LINE
  8
Z88NET
 10
2000
 20
0
 30
0
 11
4000
 21
2000
 31
0
  0
LINE
  8
Z88NET
 10
4000
 20
0
 30
0
 11
6000
 21
2000
 31
0
  0
LINE
  8
Z88NET
 10
6000
 20
0
 30
0
 11
8000
 21
2000
 31
0
  0
LINE
  8
Z88NET
 10
8000
 20
0
 30
0
 11
10000
 21
2000
 31
0
  0
LINE
  8
Z88NET
 10
10000
 20
0
 30
0
 11
12000
 21
2000
 31
0
  0
ENDSEC
  0
EOF
