     2    44     5    88     1     0     0     0    0    0    Z88NI.TXT,erzeugt von Z88X
     1  2  +0.00000E+000  +0.00000E+000  +0.00000E+000   Knoten #1
     2  2  +0.00000E+000  +6.66667E+000  +0.00000E+000   Knoten #2
     3  2  +0.00000E+000  +1.33333E+001  +0.00000E+000   Knoten #3
     4  2  +0.00000E+000  +2.00000E+001  +0.00000E+000   Knoten #4
     5  2  +5.11128E+001  +3.27908E+000  +0.00000E+000   Knoten #5
     6  2  +4.85571E+001  +2.31151E+001  +0.00000E+000   Knoten #6
     7  2  +1.01388E+002  +1.30626E+001  +0.00000E+000   Knoten #7
     8  2  +9.63182E+001  +3.24094E+001  +0.00000E+000   Knoten #8
     9  2  +1.50000E+002  +2.91901E+001  +0.00000E+000   Knoten #9
    10  2  +1.47500E+002  +3.53702E+001  +0.00000E+000   Knoten #10
    11  2  +1.45000E+002  +4.15504E+001  +0.00000E+000   Knoten #11
    12  2  +1.42500E+002  +4.77306E+001  +0.00000E+000   Knoten #12
    13  2  +1.76255E+002  +4.64713E+001  +0.00000E+000   Knoten #13
    14  2  +1.62191E+002  +6.06915E+001  +0.00000E+000   Knoten #14
    15  2  +1.93825E+002  +7.25330E+001  +0.00000E+000   Knoten #15
    16  2  +1.75369E+002  +8.02377E+001  +0.00000E+000   Knoten #16
    17  2  +2.00000E+002  +1.03352E+002  +0.00000E+000   Knoten #17
    18  2  +1.93333E+002  +1.03352E+002  +0.00000E+000   Knoten #18
    19  2  +1.86667E+002  +1.03352E+002  +0.00000E+000   Knoten #19
    20  2  +1.80000E+002  +1.03352E+002  +0.00000E+000   Knoten #20
    21  2  +2.00000E+002  +4.34451E+002  +0.00000E+000   Knoten #21
    22  2  +1.80000E+002  +4.34451E+002  +0.00000E+000   Knoten #22
    23  2  +2.00000E+002  +7.65549E+002  +0.00000E+000   Knoten #23
    24  2  +1.80000E+002  +7.65549E+002  +0.00000E+000   Knoten #24
    25  2  +2.00000E+002  +1.09665E+003  +0.00000E+000   Knoten #25
    26  2  +1.93333E+002  +1.09665E+003  +0.00000E+000   Knoten #26
    27  2  +1.86667E+002  +1.09665E+003  +0.00000E+000   Knoten #27
    28  2  +1.80000E+002  +1.09665E+003  +0.00000E+000   Knoten #28
    29  2  +1.93825E+002  +1.12747E+003  +0.00000E+000   Knoten #29
    30  2  +1.75369E+002  +1.11976E+003  +0.00000E+000   Knoten #30
    31  2  +1.76255E+002  +1.15353E+003  +0.00000E+000   Knoten #31
    32  2  +1.62191E+002  +1.13931E+003  +0.00000E+000   Knoten #32
    33  2  +1.50000E+002  +1.17081E+003  +0.00000E+000   Knoten #33
    34  2  +1.47500E+002  +1.16463E+003  +0.00000E+000   Knoten #34
    35  2  +1.45000E+002  +1.15845E+003  +0.00000E+000   Knoten #35
    36  2  +1.42500E+002  +1.15227E+003  +0.00000E+000   Knoten #36
    37  2  +1.01388E+002  +1.18694E+003  +0.00000E+000   Knoten #37
    38  2  +9.63182E+001  +1.16759E+003  +0.00000E+000   Knoten #38
    39  2  +5.11128E+001  +1.19672E+003  +0.00000E+000   Knoten #39
    40  2  +4.85571E+001  +1.17688E+003  +0.00000E+000   Knoten #40
    41  2  +0.00000E+000  +1.20000E+003  +0.00000E+000   Knoten #41
    42  2  +0.00000E+000  +1.19333E+003  +0.00000E+000   Knoten #42
    43  2  +0.00000E+000  +1.18667E+003  +0.00000E+000   Knoten #43
    44  2  +0.00000E+000  +1.18000E+003  +0.00000E+000   Knoten #44
     1    12   element #1
     1     9    12     4     5     7    10    11     8     6     3     2
     2    12   element #2
     9    17    20    12    13    15    18    19    16    14    11    10
     3    12   element #3
    17    25    28    20    21    23    26    27    24    22    19    18
     4    12   element #4
    36    28    25    33    32    30    27    26    29    31    34    35
     5    12   element #5
    44    36    33    41    40    38    35    34    37    39    42    43
     1     5 +2.06000E+005 +3.00000E-001     3 +0.00000E+000
    1     8   Superele. Nr.1,Typ 12, --> Finites Ele. Typ 8
   20 E     3 l
    2     8   Superele. Nr.2,Typ 12, --> Finites Ele. Typ 8
   12 E     3 l
    3     8   Superele. Nr.3,Typ 12, --> Finites Ele. Typ 8
  100 E     3 l
    4     8   Superele. Nr.4,Typ 12, --> Finites Ele. Typ 8
   12 E     3 L
    5     8   Superele. Nr.5,Typ 12, --> Finites Ele. Typ 8
   20 E     3 L
