  2 1212  480 2424  1  0  0  0  0
    1    2 19.973   11.525
    2    2 17.391   10.031
    3    2 33.356   19.237
    4    2 32.053   18.481
    5    2 18.682   10.778
    6    2 34.659   19.992
    7    2 19.381   5.132
    8    2 20.761   7.135
    9    2 18.386   7.582
   10    2 23.217   6.126
   11    2 22.679   7.632
   12    2 21.299   5.629
   13    2 23.627   3.117
   14    2 23.422   4.622
   15    2 21.504   4.125
   16    2 36.838   9.835
   17    2 21.823   1.559
   18    2 19.7     2.566
   19    2 39.17    7.261
   20    2 23.301   1.559
   21    2 38.085   8.344
   22    2 24.612   8.078
   23    2 23.381   8.608
   24    2 23.919   7.102
   25    2 26.218   6.956
   26    2 25.42    7.517
   27    2 24.718   6.541 
   28    2 25.405   5.333  
   29    2 25.812   6.145
   30    2 24.311   5.73  
   31    2 24.516   4.225
   32    2 27.346   8.112
   33    2 25.984   8.095
   34    2 26.782   7.534
   35    2 27.622   6.647 
   36    2 26.512   5.99  
   37    2 26.92    6.802 
   38    2 27.484   7.38 
   39    2 28.159   7.557 
   40    2 27.753   7.835 
   41    2 27.891   7.102
   42    2 28.729   8.537 
   43    2 28.038   8.325
   44    2 28.444   8.047
   45    2 29.098   7.056 
   46    2 28.629   7.307 
   47    2 28.36    6.852 
   48    2 29.94    8.02  
   49    2 29.335   8.279 
   50    2 28.914   7.797
   51    2 29.519   7.538
   52    2 30.745   9.852
   53    2 29.737   9.195
   54    2 30.343   8.936
   55    2 31.495   6.847 
   56    2 30.718   7.434
   57    2 30.297   6.952
   58    2 32.421   8.621
   59    2 31.583   9.237
   60    2 31.181   8.321
   61    2 31.958   7.734
   62    2 32.421   12.356
   63    2 31.583   11.104
   64    2 32.421   10.489
   65    2 34.119   5.629
   66    2 32.807   6.238
   67    2 33.27    7.125
   68    2 35.054   9.359
   69    2 33.738   10.858
   70    2 33.738   8.99
   71    2 34.587   7.494
   72    2 35.93    12.723
   73    2 34.176   12.54
   74    2 35.492   11.041
   75    2 37.548   6.376
   76    2 36.301   7.868
   77    2 35.834   6.003
   78    2 33.017   15.026
   79    2 34.474   13.875 
   80    2 32.719   13.691
   81    2 35.939   3.622
   82    2 36.744   4.999
   83    2 35.029   4.626
   84    2 36.437   16.374
   85    2 34.727   15.7
   86    2 36.184   14.549
   87    2 39.719   4.21
   88    2 38.634   5.293
   89    2 37.829   3.916
   90    2 21.057   10.332
   91    2 34.245   17.428
   92    2 32.535   16.754
   93    2 39.857   2.105
   94    2 38.34    2.105
   95    2 36.45    1.811
   96    2 19.766   9.585
   97    2 22.14    9.138
   98    2 35.458   18.183
   99    2 37.529   13.343
  100    2 38.621   10.311
  101    2 37.276   11.517
  102    2  11.53460  19.96745
  103    2  10.04553  17.38261
  104    2  19.26860  33.33775
  105    2  18.51817  32.03154
  106    2  10.79006  18.67503
  107    2  20.01953  34.64310
  108    2  14.21842  14.13496
  109    2  14.41203  16.55961
  110    2  12.13172  15.75922
  111    2  17.04349  16.91379
  112    2  15.82457  17.94903
  113    2  15.63095  15.52438
  114    2  18.90306  14.51292
  115    2  17.97303  15.71379
  116    2  16.56049  14.32437
  117    2  26.98511  26.93639
  118    2  18.11976  12.26166
  119    2  15.77769  12.07224
  120    2  30.29168  25.87325
  121    2  19.39974  13.00066
  122    2  28.81054  26.26865
  123    2  17.27559  19.30177
  124    2  15.94452  19.14527
  125    2  17.16344  18.11003
  126    2  19.22743  19.13309
  127    2  18.25584  19.21993
  128    2  18.13589  18.02369
  129    2  19.33486  17.32104
  130    2  19.28133  18.22775
  131    2  18.18892  17.11785
  132    2  19.11896  15.91698
  133    2  19.62630  20.69823
  134    2  18.45528  20.00250
  135    2  19.42687  19.91566
  136    2  20.59783  19.56750
  137    2  19.96504  18.44352
  138    2  19.91238  19.35073
  139    2  20.11182  20.13329
  140    2  20.60789  20.62408
  141    2  20.11728  20.66183
  142    2  20.60329  20.09604
  143    2  20.61152  21.75778
  144    2  20.11909  21.22869
  145    2  20.60970  21.19093
  146    2  21.67158  20.65970
  147    2  21.13992  20.64257
  148    2  21.13445  20.11403
  149    2  21.91877  21.91555
  150    2  21.26533  21.83735
  151    2  21.14173  21.20942
  152    2  21.79518  21.28763
  153    2  21.69992  23.90461
  154    2  21.15547  22.83163
  155    2  21.80978  22.91033
  156    2  23.85195  21.67721
  157    2  22.88554  21.79706
  158    2  22.76195  21.16914
  159    2  23.76688  23.67654
  160    2  22.73315  23.79100
  161    2  22.84301  22.79672
  162    2  23.80941  22.67687
  163    2  21.89938  26.91114
  164    2  21.79965  25.40787
  165    2  22.83288  25.29427
  166    2  26.73339  21.93439
  167    2  25.29267  21.80580
  168    2  25.25014  22.80546
  169    2  25.67812  25.63216
  170    2  23.78893  26.27233
  171    2  24.72294  24.65460
  172    2  26.20619  23.78353
  173    2  24.75476  28.98347
  174    2  23.32725  27.94799
  175    2  25.21644  27.30782
  176    2  29.32949  24.29581
  177    2  27.50355  24.96442
  178    2  28.03163  23.11578
  179    2  21.08052  29.52142
  180    2  22.91782  29.25313
  181    2  21.48995  28.21628
  182    2  29.31306  21.10628
  183    2  29.32171  22.70130
  184    2  28.02298  21.52077
  185    2  23.36833  32.39883
  186    2  22.22443  30.96013
  187    2  24.06173  30.69183
  188    2  32.29264  23.50551
  189    2  30.81149  23.90091
  190    2  30.80285  22.30589
  191    2  13.06987  19.47629
  192    2  20.94300  32.21561
  193    2  19.79910  30.77691
  194    2  33.46465  21.75152
  195    2  32.15089  20.99302
  196    2  30.66110  19.79341
  197    2  12.32534  18.18387
  198    2  14.60478  18.98376
  199    2  21.61599  33.47597
  200    2  25.82953  30.31991
  201    2  28.29123  28.24012
  202    2  26.52343  28.61205
  203    2    .00550  23.05963
  204    2    .00835  20.07655
  205    2    .01818  38.50564
  206    2    .02139  36.99921
  207    2    .00693  21.56808
  208    2    .01582  40.01157
  209    2   5.24601  19.35045
  210    2   4.20135  21.54706
  211    2   2.62675  19.71375
  212    2   6.30317  23.16953
  213    2   4.72994  23.45660
  214    2   5.77459  21.25999
  215    2   9.11405  22.02011
  216    2   7.70818  22.59507
  217    2   7.17960  20.68553
  218    2   9.90155  36.82017
  219    2   9.56132  19.67879
  220    2   7.62773  18.34372
  221    2  13.29669  37.55274
  222    2  10.30032  20.95878
  223    2  11.81629  37.15460
  224    2   5.31018  25.35363
  225    2   4.23569  24.55255
  226    2   5.80893  24.26548
  227    2   7.08487  26.18347
  228    2   6.20003  25.77288
  229    2   6.69427  24.67693
  230    2   8.08393  24.66790
  231    2   7.58421  25.42637
  232    2   7.19312  23.91896
  233    2   8.59899  23.34400
  234    2   6.64773  27.73835
  235    2   5.98146  26.55032
  236    2   6.86630  26.96091
  237    2   8.05446  27.24487
  238    2   8.06845  25.95508
  239    2   7.56923  26.71442
  240    2   7.35067  27.49186
  241    2   7.53488  28.16493
  242    2   7.09112  27.95232
  243    2   7.79492  27.70533
  244    2   6.97117  29.14856
  245    2   6.80927  28.44414
  246    2   7.25302  28.65674
  247    2   8.43826  28.72763
  248    2   7.98638  28.44696
  249    2   8.24592  27.98650
  250    2   8.02440  29.93882
  251    2   7.49760  29.54437
  252    2   7.70453  28.93878
  253    2   8.23133  29.33322
  254    2   6.84034  31.55197
  255    2   6.90532  30.35051
  256    2   7.43262  30.74583
  257    2   9.81775  30.69900
  258    2   8.92089  30.31959
  259    2   9.12782  29.71399
  260    2   8.74442  32.38793
  261    2   7.79195  31.97020
  262    2   8.38423  31.16406
  263    2   9.28109  31.54346
  264    2   5.50981  34.25543
  265    2   6.17508  32.90369
  266    2   7.12668  33.32193
  267    2  12.18456  32.36245
  268    2  11.00116  31.53072
  269    2  10.46449  32.37519
  270    2   9.42179  35.03717
  271    2   7.46561  34.64698
  272    2   9.08335  33.71299
  273    2  10.80343  33.70025
  274    2   6.94647  37.47781
  275    2   6.22796  35.86730
  276    2   8.18413  36.25749
  277    2  13.25214  35.70555
  278    2  11.33653  35.37161
  279    2  12.71817  34.03468
  280    2   3.49551  36.10657
  281    2   5.22081  36.79287
  282    2   4.50266  35.18100
  283    2  14.83268  32.93512
  284    2  14.04266  34.32077
  285    2  13.50819  32.64904
  286    2   4.03811  39.74238
  287    2   3.76681  37.92447
  288    2   5.49210  38.61077
  289    2  16.21344  36.50270
  290    2  14.73304  36.10456
  291    2  15.52306  34.71891
  292    2   1.58067  23.40190
  293    2   2.02932  38.37104
  294    2   1.75802  36.55314
  295    2  18.10543  35.56972
  296    2  17.34693  34.25595
  297    2  16.65655  32.47216
  298    2   1.58209  21.91036
  299    2   3.15620  23.74281
  300    2   1.98196  39.79903
  301    2   7.20903  39.17258
  302    2  10.38082  38.60229
  303    2   8.66389  38.04049
  304    2 -11.52507  19.97296
  305    2 -10.03106  17.39096
  306    2 -19.23712  33.35593
  307    2 -18.48112  32.05293
  308    2 -10.77807  18.68196
  309    2 -19.99212  34.65893
  310    2  -5.13207  19.38098
  311    2  -7.13507  20.76097
  312    2  -7.58207  18.38597
  313    2  -6.12608  23.21698
  314    2  -7.63208  22.67898
  315    2  -5.62908  21.29898
  316    2  -3.11709  23.62699
  317    2  -4.62209  23.42199
  318    2  -4.12508  21.50399
  319    2  -9.83513  36.83797
  320    2  -1.55908  21.82299
  321    2  -2.56607  19.69999
  322    2  -7.26114  39.16997
  323    2  -1.55908  23.30099
  324    2  -8.34414  38.08496
  325    2  -8.07809  24.61197
  326    2  -8.60809  23.38097
  327    2  -7.10209  23.91897
  328    2  -6.95609  26.21797
  329    2  -7.51709  25.41997
  330    2  -6.54109  24.71798
  331    2  -5.33309  25.40498
  332    2  -6.14509  25.81198
  333    2  -5.73009  24.31098
  334    2  -4.22509  24.51599
  335    2  -8.11210  27.34597
  336    2  -8.09509  25.98397
  337    2  -7.53410  26.78197
  338    2  -6.64710  27.62197
  339    2  -5.99009  26.51198
  340    2  -6.80210  26.91998
  341    2  -7.38010  27.48397
  342    2  -7.55710  28.15897
  343    2  -7.83510  27.75297
  344    2  -7.10210  27.89097
  345    2  -8.53710  28.72897
  346    2  -8.32510  28.03797
  347    2  -8.04710  28.44397
  348    2  -7.05611  29.09797
  349    2  -7.30710  28.62897
  350    2  -6.85210  28.35997
  351    2  -8.02011  29.93997
  352    2  -8.27911  29.33497
  353    2  -7.79711  28.91397
  354    2  -7.53811  29.51897
  355    2  -9.85211  30.74496
  356    2  -9.19511  29.73697
  357    2  -8.93611  30.34297
  358    2  -6.84711  31.49498
  359    2  -7.43411  30.71797
  360    2  -6.95211  30.29698
  361    2  -8.62112  32.42097
  362    2  -9.23711  31.58297
  363    2  -8.32111  31.18097
  364    2  -7.73411  31.95797
  365    2 -12.35612  32.42096
  366    2 -11.10411  31.58296
  367    2 -10.48912  32.42096
  368    2  -5.62913  34.11898
  369    2  -6.23812  32.80698
  370    2  -7.12512  33.26997
  371    2  -9.35913  35.05396
  372    2 -10.85812  33.73796
  373    2  -8.99012  33.73797
  374    2  -7.49413  34.58698
  375    2 -12.72313  35.92996
  376    2 -12.54013  34.17595
  377    2 -11.04113  35.49196
  378    2  -6.37613  37.54797
  379    2  -7.86813  36.30097
  380    2  -6.00313  35.83398
  381    2 -15.02612  33.01694
  382    2 -13.87512  34.47395
  383    2 -13.69112  32.71895
  384    2  -3.62213  35.93899
  385    2  -4.99913  36.74398
  386    2  -4.62613  35.02898
  387    2 -16.37413  36.43694
  388    2 -15.70012  34.72695
  389    2 -14.54913  36.18394
  390    2  -4.21015  39.71899
  391    2  -5.29314  38.63398
  392    2  -3.91614  37.82898
  393    2 -10.33207  21.05696
  394    2 -17.42813  34.24493
  395    2 -16.75412  32.53494
  396    2  -2.10514  39.85699
  397    2  -2.10514  38.33999
  398    2  -1.81113  36.44999
  399    2  -9.58507  19.76596
  400    2  -9.13808  22.13997
  401    2 -18.18313  35.45794
  402    2 -13.34314  37.52895
  403    2 -10.31114  38.62096
  404    2 -11.51714  37.27596
  405    2 -19.96750  11.53453
  406    2 -17.38265  10.04546
  407    2 -33.33782  19.26848
  408    2 -32.03160  18.51806
  409    2 -18.67507  10.78999
  410    2 -34.64318  20.01940
  411    2 -14.13501  14.21837
  412    2 -16.55966  14.41197
  413    2 -15.75926  12.13167
  414    2 -16.91385  17.04343
  415    2 -17.94909  15.82450
  416    2 -15.52443  15.63090
  417    2 -14.51299  18.90301
  418    2 -15.71386  17.97297
  419    2 -14.32443  16.56044
  420    2 -26.93649  26.98501
  421    2 -12.26172  18.11971
  422    2 -12.07230  15.77764
  423    2 -25.87336  30.29159
  424    2 -13.00073  19.39969
  425    2 -26.26875  28.81045
  426    2 -19.30184  17.27552
  427    2 -19.14532  15.94445
  428    2 -18.11010  17.16337
  429    2 -19.13317  19.22736
  430    2 -19.22000  18.25577
  431    2 -18.02376  18.13583
  432    2 -17.32111  19.33479
  433    2 -18.22782  19.28126
  434    2 -17.11791  18.18886
  435    2 -15.91705  19.11890
  436    2 -20.69829  19.62623
  437    2 -20.00257  18.45521
  438    2 -19.91573  19.42680
  439    2 -19.56757  20.59776
  440    2 -18.44359  19.96498
  441    2 -19.35080  19.91231
  442    2 -20.13336  20.11175
  443    2 -20.62415  20.60781
  444    2 -20.66191  20.11720
  445    2 -20.09611  20.60322
  446    2 -21.75786  20.61144
  447    2 -21.22876  20.11901
  448    2 -21.19100  20.60962
  449    2 -20.65978  21.67151
  450    2 -20.64265  21.13984
  451    2 -20.11411  21.13438
  452    2 -21.91563  21.91869
  453    2 -21.83743  21.26525
  454    2 -21.20950  21.14166
  455    2 -21.28771  21.79510
  456    2 -23.90469  21.69984
  457    2 -22.83171  21.15538
  458    2 -22.91041  21.80970
  459    2 -21.67730  23.85187
  460    2 -21.79714  22.88546
  461    2 -21.16922  22.76187
  462    2 -23.67662  23.76680
  463    2 -23.79109  22.73306
  464    2 -22.79681  22.84292
  465    2 -22.67696  23.80933
  466    2 -26.91122  21.89928
  467    2 -25.40795  21.79956
  468    2 -25.29436  22.83279
  469    2 -21.93448  26.73332
  470    2 -21.80589  25.29259
  471    2 -22.80556  25.25006
  472    2 -25.63225  25.67803
  473    2 -26.27242  23.78884
  474    2 -24.65468  24.72285
  475    2 -23.78362  26.20611
  476    2 -28.98356  24.75466
  477    2 -27.94807  23.32715
  478    2 -27.30791  25.21634
  479    2 -24.29592  29.32940
  480    2 -24.96452  27.50347
  481    2 -23.11589  28.03154
  482    2 -29.52150  21.08042
  483    2 -29.25321  22.91772
  484    2 -28.21636  21.48985
  485    2 -21.10638  29.31299
  486    2 -22.70141  29.32163
  487    2 -21.52087  28.02290
  488    2 -32.39891  23.36821
  489    2 -30.96021  22.22432
  490    2 -30.69192  24.06161
  491    2 -23.50562  32.29255
  492    2 -23.90102  30.81141
  493    2 -22.30600  30.80276
  494    2 -19.47634  13.06980
  495    2 -32.21569  20.94288
  496    2 -30.77699  19.79899
  497    2 -21.75165  33.46457
  498    2 -20.99314  32.15081
  499    2 -19.79352  30.66103
  500    2 -18.18391  12.32527
  501    2 -18.98381  14.60471
  502    2 -33.47604  21.61587
  503    2 -30.32000  25.82942
  504    2 -28.24022  28.29113
  505    2 -28.61214  26.52332
  506    2 -23.05963    .00541
  507    2 -20.07655    .00827
  508    2 -38.50564    .01804
  509    2 -36.99921    .02126
  510    2 -21.56808    .00684
  511    2 -40.01157    .01567
  512    2 -19.35047   5.24594
  513    2 -21.54708   4.20127
  514    2 -19.71376   2.62667
  515    2 -23.16955   6.30309
  516    2 -23.45662   4.72985
  517    2 -21.26001   5.77451
  518    2 -22.02014   9.11396
  519    2 -22.59510   7.70809
  520    2 -20.68555   7.17952
  521    2 -36.82021   9.90141
  522    2 -19.67883   9.56125
  523    2 -18.34375   7.62766
  524    2 -37.55280  13.29656
  525    2 -20.95882  10.30024
  526    2 -37.15465  11.81615
  527    2 -25.35365   5.31009
  528    2 -24.55257   4.23560
  529    2 -24.26550   5.80884
  530    2 -26.18350   7.08476
  531    2 -25.77291   6.19993
  532    2 -24.67696   6.69417
  533    2 -24.66793   8.08384
  534    2 -25.42640   7.58412
  535    2 -23.91899   7.19303
  536    2 -23.34403   8.59890
  537    2 -27.73837   6.64763
  538    2 -26.55034   5.98136
  539    2 -26.96093   6.86620
  540    2 -27.24490   8.05436
  541    2 -25.95512   8.06835
  542    2 -26.71445   7.56913
  543    2 -27.49189   7.35056
  544    2 -28.16496   7.53478
  545    2 -27.95235   7.09102
  546    2 -27.70536   7.79482
  547    2 -29.14859   6.97106
  548    2 -28.44416   6.80916
  549    2 -28.65677   7.25292
  550    2 -28.72766   8.43815
  551    2 -28.44699   7.98628
  552    2 -27.98653   8.24582
  553    2 -29.93885   8.02429
  554    2 -29.54440   7.49749
  555    2 -28.93880   7.70442
  556    2 -29.33325   8.23122
  557    2 -31.55200   6.84022
  558    2 -30.35054   6.90521
  559    2 -30.74586   7.43251
  560    2 -30.69904   9.81763
  561    2 -30.31962   8.92078
  562    2 -29.71403   9.12771
  563    2 -32.38797   8.74430
  564    2 -31.97023   7.79182
  565    2 -31.16409   8.38411
  566    2 -31.54350   9.28096
  567    2 -34.25545   5.50968
  568    2 -32.90372   6.17495
  569    2 -33.32196   7.12655
  570    2 -32.36250  12.18445
  571    2 -31.53076  11.00104
  572    2 -32.37523  10.46437
  573    2 -35.03721   9.42165
  574    2 -34.64701   7.46549
  575    2 -33.71302   9.08323
  576    2 -33.70029  10.80330
  577    2 -37.47784   6.94633
  578    2 -35.86732   6.22782
  579    2 -36.25753   8.18399
  580    2 -35.70560  13.25200
  581    2 -35.37165  11.33639
  582    2 -34.03473  12.71804
  583    2 -36.10658   3.49538
  584    2 -36.79289   5.22067
  585    2 -35.18101   4.50253
  586    2 -32.93518  14.83256
  587    2 -34.32083  14.04252
  588    2 -32.64908  13.50807
  589    2 -39.74239   4.03796
  590    2 -37.92449   3.76667
  591    2 -38.61079   5.49195
  592    2 -36.50277  16.21331
  593    2 -36.10461  14.73290
  594    2 -34.71897  15.52293
  595    2 -23.40191   1.58058
  596    2 -38.37105   2.02917
  597    2 -36.55315   1.75788
  598    2 -35.56979  18.10529
  599    2 -34.25602  17.34681
  600    2 -32.47223  16.65643
  601    2 -21.91037   1.58201
  602    2 -23.74282   3.15611
  603    2 -39.79904   1.98182
  604    2 -39.17261   7.20889
  605    2 -38.60233  10.38068
  606    2 -38.04052   8.66375
  607    2 -19.97291 -11.52515
  608    2 -17.39092 -10.03113
  609    2 -33.35586 -19.23725
  610    2 -32.05286 -18.48124
  611    2 -18.68192 -10.77814
  612    2 -34.65885 -19.99226
  613    2 -19.38096  -5.13215
  614    2 -20.76094  -7.13516
  615    2 -18.38594  -7.58214
  616    2 -23.21695  -6.12617
  617    2 -22.67894  -7.63217
  618    2 -21.29896  -5.62916
  619    2 -23.62698  -3.11718
  620    2 -23.42197  -4.62218
  621    2 -21.50397  -4.12516
  622    2 -36.83792  -9.83528
  623    2 -21.82299  -1.55916
  624    2 -19.69998  -2.56615
  625    2 -39.16994  -7.26129
  626    2 -23.30099  -1.55918
  627    2 -38.08493  -8.34428
  628    2 -24.61194  -8.07819
  629    2 -23.38094  -8.60818
  630    2 -23.91895  -7.10218
  631    2 -26.21795  -6.95620
  632    2 -25.41994  -7.51719
  633    2 -24.71795  -6.54119
  634    2 -25.40496  -5.33319
  635    2 -25.81195  -6.14519
  636    2 -24.31096  -5.73018
  637    2 -24.51597  -4.22518
  638    2 -27.34594  -8.11221
  639    2 -25.98394  -8.09520
  640    2 -26.78194  -7.53420
  641    2 -27.62195  -6.64721
  642    2 -26.51195  -5.99020
  643    2 -26.91995  -6.80220
  644    2 -27.48395  -7.38020
  645    2 -28.15895  -7.55721
  646    2 -27.75294  -7.83521
  647    2 -27.89095  -7.10221
  648    2 -28.72894  -8.53722
  649    2 -28.03794  -8.32521
  650    2 -28.44394  -8.04721
  651    2 -29.09795  -7.05622
  652    2 -28.62894  -7.30721
  653    2 -28.35995  -6.85221
  654    2 -29.93994  -8.02023
  655    2 -29.33494  -8.27922
  656    2 -28.91394  -7.79721
  657    2 -29.51894  -7.53822
  658    2 -30.74493  -9.85223
  659    2 -29.73693  -9.19522
  660    2 -30.34293  -8.93623
  661    2 -31.49495  -6.84724
  662    2 -30.71795  -7.43423
  663    2 -30.29695  -6.95223
  664    2 -32.42094  -8.62124
  665    2 -31.58293  -9.23724
  666    2 -31.18094  -8.32124
  667    2 -31.95794  -7.73424
  668    2 -32.42091 -12.35624
  669    2 -31.58292 -11.10423
  670    2 -32.42092 -10.48925
  671    2 -34.11896  -5.62925
  672    2 -32.80695  -6.23825
  673    2 -33.26995  -7.12525
  674    2 -35.05393  -9.35926
  675    2 -33.73792 -10.85825
  676    2 -33.73793  -8.99025
  677    2 -34.58694  -7.49426
  678    2 -35.92991 -12.72327
  679    2 -34.17591 -12.54025
  680    2 -35.49192 -11.04126
  681    2 -37.54795  -6.37628
  682    2 -36.30094  -7.86827
  683    2 -35.83395  -6.00327
  684    2 -33.01688 -15.02625
  685    2 -34.47390 -13.87526
  686    2 -32.71890 -13.69124
  687    2 -35.93897  -3.62227
  688    2 -36.74396  -4.99928
  689    2 -35.02896  -4.62626
  690    2 -36.43688 -16.37427
  691    2 -34.72689 -15.70026
  692    2 -36.18389 -14.54927
  693    2 -39.71897  -4.21030
  694    2 -38.63396  -5.29329
  695    2 -37.82897  -3.91628
  696    2 -21.05692 -10.33216
  697    2 -34.24487 -17.42826
  698    2 -32.53487 -16.75425
  699    2 -39.85698  -2.10530
  700    2 -38.33998  -2.10529
  701    2 -36.44999  -1.81128
  702    2 -19.76593  -9.58515
  703    2 -22.13993  -9.13817
  704    2 -35.45787 -18.18326
  705    2 -37.52890 -13.34328
  706    2 -38.62092 -10.31129
  707    2 -37.27591 -11.51728
  708    2 -11.53445 -19.96754
  709    2 -10.04539 -17.38269
  710    2 -19.26835 -33.33790
  711    2 -18.51794 -32.03167
  712    2 -10.78992 -18.67512
  713    2 -20.01927 -34.64326
  714    2 -14.21831 -14.13507
  715    2 -14.41191 -16.55972
  716    2 -12.13160 -15.75931
  717    2 -17.04336 -16.91392
  718    2 -15.82443 -17.94915
  719    2 -15.63084 -15.52450
  720    2 -18.90296 -14.51307
  721    2 -17.97291 -15.71393
  722    2 -16.56038 -14.32450
  723    2 -26.98491 -26.93660
  724    2 -18.11967 -12.26179
  725    2 -15.77759 -12.07236
  726    2 -30.29148 -25.87348
  727    2 -19.39964 -13.00081
  728    2 -28.81034 -26.26887
  729    2 -17.27545 -19.30191
  730    2 -15.94438 -19.14538
  731    2 -17.16330 -18.11016
  732    2 -19.22728 -19.13324
  733    2 -18.25570 -19.22007
  734    2 -18.13576 -18.02383
  735    2 -19.33472 -17.32118
  736    2 -19.28119 -18.22790
  737    2 -18.18879 -17.11799
  738    2 -19.11884 -15.91712
  739    2 -19.62615 -20.69837
  740    2 -18.45513 -20.00264
  741    2 -19.42672 -19.91580
  742    2 -20.59768 -19.56765
  743    2 -19.96490 -18.44367
  744    2 -19.91224 -19.35088
  745    2 -20.11167 -20.13344
  746    2 -20.60773 -20.62423
  747    2 -20.11712 -20.66199
  748    2 -20.60314 -20.09619
  749    2 -20.61135 -21.75794
  750    2 -20.11893 -21.22884
  751    2 -20.60954 -21.19109
  752    2 -21.67143 -20.65986
  753    2 -21.13976 -20.64273
  754    2 -21.13430 -20.11419
  755    2 -21.91861 -21.91572
  756    2 -21.26516 -21.83751
  757    2 -21.14157 -21.20958
  758    2 -21.79502 -21.28779
  759    2 -21.69974 -23.90478
  760    2 -21.15529 -22.83179
  761    2 -21.80961 -22.91050
  762    2 -23.85178 -21.67739
  763    2 -22.88538 -21.79724
  764    2 -22.76179 -21.16931
  765    2 -23.76670 -23.67672
  766    2 -22.73297 -23.79118
  767    2 -22.84283 -22.79690
  768    2 -23.80924 -22.67705
  769    2 -21.89917 -26.91131
  770    2 -21.79945 -25.40804
  771    2 -22.83269 -25.29445
  772    2 -26.73323 -21.93459
  773    2 -25.29250 -21.80599
  774    2 -25.24997 -22.80565
  775    2 -25.67793 -25.63236
  776    2 -23.78873 -26.27251
  777    2 -24.72275 -24.65479
  778    2 -26.20601 -23.78372
  779    2 -24.75454 -28.98366
  780    2 -23.32704 -27.94816
  781    2 -25.21623 -27.30801
  782    2 -29.32931 -24.29603
  783    2 -27.50336 -24.96463
  784    2 -28.03145 -23.11600
  785    2 -21.08031 -29.52158
  786    2 -22.91761 -29.25330
  787    2 -21.48974 -28.21644
  788    2 -29.31290 -21.10650
  789    2 -29.32154 -22.70152
  790    2 -28.02281 -21.52098
  791    2 -23.36808 -32.39901
  792    2 -22.22420 -30.96029
  793    2 -24.06149 -30.69201
  794    2 -32.29246 -23.50575
  795    2 -30.81131 -23.90114
  796    2 -30.80268 -22.30613
  797    2 -13.06973 -19.47639
  798    2 -20.94275 -32.21577
  799    2 -19.79887 -30.77706
  800    2 -33.46448 -21.75178
  801    2 -32.15073 -20.99327
  802    2 -30.66095 -19.79364
  803    2 -12.32520 -18.18396
  804    2 -14.60464 -18.98386
  805    2 -21.61573 -33.47614
  806    2 -25.82930 -30.32011
  807    2 -28.29102 -28.24034
  808    2 -26.52321 -28.61225
  809    2   -.00532 -23.05963
  810    2   -.00819 -20.07655
  811    2   -.01788 -38.50564
  812    2   -.02110 -36.99921
  813    2   -.00676 -21.56808
  814    2   -.01551 -40.01157
  815    2  -5.24587 -19.35049
  816    2  -4.20119 -21.54709
  817    2  -2.62659 -19.71377
  818    2  -6.30299 -23.16958
  819    2  -4.72976 -23.45664
  820    2  -5.77443 -21.26003
  821    2  -9.11388 -22.02018
  822    2  -7.70801 -22.59513
  823    2  -7.17943 -20.68559
  824    2  -9.90126 -36.82025
  825    2  -9.56117 -19.67887
  826    2  -7.62759 -18.34378
  827    2 -13.29641 -37.55285
  828    2 -10.30016 -20.95886
  829    2 -11.81601 -37.15469
  830    2  -5.30999 -25.35367
  831    2  -4.23551 -24.55258
  832    2  -5.80874 -24.26552
  833    2  -7.08467 -26.18352
  834    2  -6.19983 -25.77293
  835    2  -6.69408 -24.67698
  836    2  -8.08374 -24.66796
  837    2  -7.58402 -25.42642
  838    2  -7.19294 -23.91902
  839    2  -8.59881 -23.34406
  840    2  -6.64753 -27.73840
  841    2  -5.98125 -26.55036
  842    2  -6.86609 -26.96096
  843    2  -8.05425 -27.24494
  844    2  -8.06824 -25.95515
  845    2  -7.56903 -26.71448
  846    2  -7.35045 -27.49192
  847    2  -7.53466 -28.16499
  848    2  -7.09091 -27.95238
  849    2  -7.79471 -27.70539
  850    2  -6.97095 -29.14861
  851    2  -6.80905 -28.44419
  852    2  -7.25281 -28.65680
  853    2  -8.43804 -28.72769
  854    2  -7.98616 -28.44702
  855    2  -8.24571 -27.98656
  856    2  -8.02418 -29.93888
  857    2  -7.49737 -29.54443
  858    2  -7.70430 -28.93884
  859    2  -8.23111 -29.33329
  860    2  -6.84011 -31.55202
  861    2  -6.90509 -30.35056
  862    2  -7.43239 -30.74588
  863    2  -9.81752 -30.69907
  864    2  -8.92067 -30.31966
  865    2  -9.12760 -29.71406
  866    2  -8.74417 -32.38800
  867    2  -7.79170 -31.97026
  868    2  -8.38398 -31.16412
  869    2  -9.28084 -31.54354
  870    2  -5.50954 -34.25547
  871    2  -6.17481 -32.90374
  872    2  -7.12642 -33.32198
  873    2 -12.18432 -32.36255
  874    2 -11.00092 -31.53080
  875    2 -10.46425 -32.37527
  876    2  -9.42151 -35.03725
  877    2  -7.46535 -34.64704
  878    2  -9.08309 -33.71306
  879    2 -10.80317 -33.70033
  880    2  -6.94618 -37.47786
  881    2  -6.22768 -35.86735
  882    2  -8.18386 -36.25756
  883    2 -13.25186 -35.70565
  884    2 -11.33625 -35.37170
  885    2 -12.71790 -34.03478
  886    2  -3.49524 -36.10659
  887    2  -5.22053 -36.79291
  888    2  -4.50239 -35.18103
  889    2 -14.83242 -32.93524
  890    2 -14.04240 -34.32088
  891    2 -13.50793 -32.64914
  892    2  -4.03779 -39.74241
  893    2  -3.76651 -37.92451
  894    2  -5.49181 -38.61082
  895    2 -16.21316 -36.50283
  896    2 -14.73276 -36.10467
  897    2 -15.52280 -34.71903
  898    2  -1.58049 -23.40191
  899    2  -2.02902 -38.37106
  900    2  -1.75775 -36.55316
  901    2 -18.10515 -35.56986
  902    2 -17.34668 -34.25608
  903    2 -16.65630 -32.47229
  904    2  -1.58193 -21.91037
  905    2  -3.15602 -23.74283
  906    2  -1.98165 -39.79905
  907    2  -7.20872 -39.17264
  908    2 -10.38051 -38.60238
  909    2  -8.66360 -38.04055
  910    2  11.52523 -19.97287
  911    2  10.03120 -17.39088
  912    2  19.23738 -33.35578
  913    2  18.48136 -32.05279
  914    2  10.77822 -18.68187
  915    2  19.99240 -34.65877
  916    2   5.13222 -19.38094
  917    2   7.13524 -20.76092
  918    2   7.58221 -18.38591
  919    2   6.12627 -23.21693
  920    2   7.63226 -22.67892
  921    2   5.62924 -21.29894
  922    2   3.11727 -23.62697
  923    2   4.62227 -23.42195
  924    2   4.12525 -21.50395
  925    2   9.83543 -36.83789
  926    2   1.55925 -21.82298
  927    2   2.56623 -19.69997
  928    2   7.26145 -39.16991
  929    2   1.55926 -23.30098
  930    2   8.34444 -38.08490
  931    2   8.07828 -24.61191
  932    2   8.60826 -23.38091
  933    2   7.10228 -23.91892
  934    2   6.95630 -26.21792
  935    2   7.51730 -25.41991
  936    2   6.54128 -24.71793
  937    2   5.33329 -25.40494
  938    2   6.14530 -25.81193
  939    2   5.73027 -24.31094
  940    2   4.22528 -24.51595
  941    2   8.11231 -27.34591
  942    2   8.09530 -25.98391
  943    2   7.53430 -26.78191
  944    2   6.64732 -27.62192
  945    2   5.99031 -26.51193
  946    2   6.80231 -26.91992
  947    2   7.38032 -27.48392
  948    2   7.55732 -28.15891
  949    2   7.83532 -27.75291
  950    2   7.10232 -27.89092
  951    2   8.53732 -28.72890
  952    2   8.32532 -28.03791
  953    2   8.04732 -28.44391
  954    2   7.05633 -29.09792
  955    2   7.30733 -28.62892
  956    2   6.85233 -28.35992
  957    2   8.02034 -29.93991
  958    2   8.27933 -29.33491
  959    2   7.79734 -28.91391
  960    2   7.53835 -29.51891
  961    2   9.85236 -30.74489
  962    2   9.19533 -29.73690
  963    2   8.93634 -30.34290
  964    2   6.84736 -31.49493
  965    2   7.43435 -30.71792
  966    2   6.95234 -30.29692
  967    2   8.62137 -32.42090
  968    2   9.23736 -31.58289
  969    2   8.32136 -31.18090
  970    2   7.73437 -31.95791
  971    2  12.35638 -32.42086
  972    2  11.10437 -31.58287
  973    2  10.48938 -32.42088
  974    2   5.62939 -34.11893
  975    2   6.23837 -32.80693
  976    2   7.12537 -33.26992
  977    2   9.35940 -35.05389
  978    2  10.85838 -33.73788
  979    2   8.99038 -33.73790
  980    2   7.49439 -34.58691
  981    2  12.72341 -35.92986
  982    2  12.54039 -34.17586
  983    2  11.04142 -35.49187
  984    2   6.37643 -37.54792
  985    2   7.86841 -36.30091
  986    2   6.00341 -35.83393
  987    2  15.02637 -33.01683
  988    2  13.87539 -34.47384
  989    2  13.69137 -32.71885
  990    2   3.62242 -35.93896
  991    2   4.99942 -36.74395
  992    2   4.62641 -35.02895
  993    2  16.37443 -36.43681
  994    2  15.70039 -34.72683
  995    2  14.54941 -36.18383
  996    2   4.21046 -39.71896
  997    2   5.29345 -38.63394
  998    2   3.91643 -37.82895
  999    2  10.33224 -21.05688
 1000    2  17.42839 -34.24480
 1001    2  16.75437 -32.53481
 1002    2   2.10546 -39.85698
 1003    2   2.10543 -38.33998
 1004    2   1.81141 -36.44998
 1005    2   9.58522 -19.76589
 1006    2   9.13825 -22.13989
 1007    2  18.18341 -35.45779
 1008    2  13.34344 -37.52885
 1009    2  10.31143 -38.62088
 1010    2  11.51743 -37.27587
 1011    2  19.96759 -11.53437
 1012    2  17.38273 -10.04532
 1013    2  33.33797 -19.26822
 1014    2  32.03176 -18.51779
 1015    2  18.67516 -10.78985
 1016    2  34.64334 -20.01913
 1017    2  14.13512 -14.21826
 1018    2  16.55978 -14.41184
 1019    2  15.75936 -12.13154
 1020    2  16.91399 -17.04329
 1021    2  17.94921 -15.82436
 1022    2  15.52455 -15.63078
 1023    2  14.51314 -18.90290
 1024    2  15.71400 -17.97285
 1025    2  14.32457 -16.56033
 1026    2  26.93671 -26.98480
 1027    2  12.26186 -18.11962
 1028    2  12.07242 -15.77754
 1029    2  25.87360 -30.29138
 1030    2  13.00088 -19.39960
 1031    2  26.26898 -28.81024
 1032    2  19.30197 -17.27537
 1033    2  19.14545 -15.94430
 1034    2  18.11023 -17.16323
 1035    2  19.13331 -19.22721
 1036    2  19.22014 -18.25562
 1037    2  18.02390 -18.13569
 1038    2  17.32126 -19.33466
 1039    2  18.22797 -19.28111
 1040    2  17.11806 -18.18873
 1041    2  15.91720 -19.11878
 1042    2  20.69844 -19.62607
 1043    2  20.00271 -18.45505
 1044    2  19.91588 -19.42664
 1045    2  19.56774 -20.59760
 1046    2  18.44375 -19.96483
 1047    2  19.35096 -19.91216
 1048    2  20.13353 -20.11158
 1049    2  20.62432 -20.60765
 1050    2  20.66207 -20.11704
 1051    2  20.09627 -20.60306
 1052    2  21.75802 -20.61127
 1053    2  21.22892 -20.11885
 1054    2  21.19117 -20.60946
 1055    2  20.65995 -21.67134
 1056    2  20.64282 -21.13968
 1057    2  20.11428 -21.13422
 1058    2  21.91580 -21.91852
 1059    2  21.83760 -21.26507
 1060    2  21.20967 -21.14148
 1061    2  21.28787 -21.79494
 1062    2  23.90486 -21.69965
 1063    2  22.83187 -21.15521
 1064    2  22.91058 -21.80952
 1065    2  21.67748 -23.85170
 1066    2  21.79732 -22.88529
 1067    2  21.16940 -22.76171
 1068    2  23.67681 -23.76661
 1069    2  23.79127 -22.73287
 1070    2  22.79699 -22.84274
 1071    2  22.67715 -23.80915
 1072    2  26.91140 -21.89906
 1073    2  25.40813 -21.79935
 1074    2  25.29454 -22.83259
 1075    2  21.93470 -26.73314
 1076    2  21.80608 -25.29242
 1077    2  22.80575 -25.24988
 1078    2  25.63246 -25.67783
 1079    2  26.27261 -23.78863
 1080    2  24.65488 -24.72265
 1081    2  23.78383 -26.20592
 1082    2  28.98376 -24.75442
 1083    2  27.94826 -23.32693
 1084    2  27.30810 -25.21613
 1085    2  24.29615 -29.32921
 1086    2  24.96474 -27.50327
 1087    2  23.11611 -28.03136
 1088    2  29.52166 -21.08019
 1089    2  29.25339 -22.91749
 1090    2  28.21653 -21.48963
 1091    2  21.10662 -29.31281
 1092    2  22.70163 -29.32145
 1093    2  21.52110 -28.02272
 1094    2  32.39911 -23.36795
 1095    2  30.96039 -22.22406
 1096    2  30.69210 -24.06137
 1097    2  23.50588 -32.29236
 1098    2  23.90127 -30.81122
 1099    2  22.30624 -30.80259
 1100    2  19.47644 -13.06965
 1101    2  32.21586 -20.94263
 1102    2  30.77714 -19.79875
 1103    2  21.75191 -33.46439
 1104    2  20.99339 -32.15065
 1105    2  19.79376 -30.66088
 1106    2  18.18401 -12.32513
 1107    2  18.98392 -14.60456
 1108    2  33.47622 -21.61559
 1109    2  30.32021 -25.82917
 1110    2  28.24046 -28.29090
 1111    2  28.61235 -26.52310
 1112    2  23.05963   -.00023
 1113    2  20.00655   -.00011
 1114    2  38.50564   -.00073
 1115    2  36.99921   -.00097
 1116    2  21.56808   -.00067
 1117    2  40.00057   -.00035
 1118    2  19.35051  -5.24579
 1119    2  21.54711  -4.20110
 1120    2  19.71378  -2.62651
 1121    2  23.16960  -6.30290
 1122    2  23.45666  -4.72966
 1123    2  21.26006  -5.77435
 1124    2  22.02021  -9.11379
 1125    2  22.59516  -7.70791
 1126    2  20.68561  -7.17935
 1127    2  36.82029  -9.90112
 1128    2  19.67891  -9.56109
 1129    2  18.34381  -7.62752
 1130    2  37.55290 -13.29626
 1131    2  20.95890 -10.30007
 1132    2  37.15474 -11.81586
 1133    2  25.35369  -5.30989
 1134    2  24.55260  -4.23541
 1135    2  24.26554  -5.80864
 1136    2  26.18355  -7.08456
 1137    2  25.77295  -6.19972
 1138    2  24.67701  -6.69398
 1139    2  24.66799  -8.08364
 1140    2  25.42645  -7.58392
 1141    2  23.91904  -7.19284
 1142    2  23.34410  -8.59871
 1143    2  27.73843  -6.64742
 1144    2  26.55039  -5.98115
 1145    2  26.96099  -6.86599
 1146    2  27.24497  -8.05414
 1147    2  25.95518  -8.06814
 1148    2  26.71451  -7.56892
 1149    2  27.49195  -7.35034
 1150    2  28.16502  -7.53455
 1151    2  27.95240  -7.09079
 1152    2  27.70543  -7.79460
 1153    2  29.14864  -6.97084
 1154    2  28.44422  -6.80894
 1155    2  28.65683  -7.25269
 1156    2  28.72773  -8.43792
 1157    2  28.44705  -7.98605
 1158    2  27.98660  -8.24560
 1159    2  29.93891  -8.02406
 1160    2  29.54446  -7.49727
 1161    2  28.93887  -7.70419
 1162    2  29.33332  -8.23098
 1163    2  31.55205  -6.83997
 1164    2  30.35059  -6.90497
 1165    2  30.74591  -7.43227
 1166    2  30.69911  -9.81740
 1167    2  30.31969  -8.92054
 1168    2  29.71410  -9.12748
 1169    2  32.38803  -8.74404
 1170    2  31.97029  -7.79157
 1171    2  31.16416  -8.38386
 1172    2  31.54357  -9.28071
 1173    2  34.25549  -5.50940
 1174    2  32.90377  -6.17468
 1175    2  33.32201  -7.12629
 1176    2  32.36259 -12.18419
 1177    2  31.53085 -11.00080
 1178    2  32.37531 -10.46412
 1179    2  35.03728  -9.42138
 1180    2  34.64707  -7.46521
 1181    2  33.71309  -9.08296
 1182    2  33.70037 -10.80303
 1183    2  37.47789  -6.94603
 1184    2  35.86737  -6.22754
 1185    2  36.25759  -8.18369
 1186    2  35.70571 -13.25172
 1187    2  35.37175 -11.33611
 1188    2  34.03484 -12.71777
 1189    2  36.10661  -3.49510
 1190    2  36.79293  -5.22039
 1191    2  35.18105  -4.50225
 1192    2  32.93530 -14.83229
 1193    2  34.32093 -14.04226
 1194    2  32.64920 -13.50780
 1195    2  39.74243  -4.03763
 1196    2  37.92452  -3.76638
 1197    2  38.61084  -5.49166
 1198    2  36.50290 -16.21302
 1199    2  36.10473 -14.73261
 1200    2  34.71909 -15.52266
 1201    2  23.40192  -1.58039
 1202    2  38.37107  -2.02887
 1203    2  36.55316  -1.75760
 1204    2  35.56993 -18.10501
 1205    2  34.25615 -17.34654
 1206    2  32.47236 -16.65617
 1207    2  21.91038  -1.58184
 1208    2  23.74285  -3.15593
 1209    2  39.79906  -1.98149
 1210    2  39.17267  -7.20856
 1211    2  38.60241 -10.38038
 1212    2  38.04059  -8.66345
 1   14
    1    2   97    5   96   90
 2   14
   97    2    7   96    9    8
 3   14
   97    7   10    8   12   11
 4   14
   13   10    7   14   12   15
 5   14
   13    7 1113   15   18   17
 6   14
 1112   13 1113   20   17 1116
 7   14
   22   97   10   23   11   24
 8   14
   22   10   25   24   27   26
 9   14
   25   10   28   27   30   29
 10   14
   10   13   28   14   31   30
 11   14
   32   22   25   33   26   34
 12   14
   28   35   25   36   37   29
 13   14
   35   32   25   38   34   37
 14   14
   32   35   39   38   41   40
 15   14
   42   32   39   43   40   44
 16   14
   35   45   39   47   46   41
 17   14
   42   39   45   44   46   50
 18   14
   48   42   45   49   50   51
 19   14
   52   42   48   53   49   54
 20   14
   45   55   48   57   56   51
 21   14
   52   48   58   54   60   59
 22   14
   48   55   58   56   61   60
 23   14
   62   52   58   63   59   64
 24   14
   55   65   58   66   67   61
 25   14
   62   58   68   64   70   69
 26   14
   58   65   68   67   71   70
 27   14
   62   68   72   69   74   73
 28   14
   68   65   75   71   77   76
 29   14
   78   62   72   80   73   79
 30   14
   65   81   75   83   82   77
 31   14
   84   78   72   85   79   86
 32   14
   81   87   75   89   88   82
 33   14
    4   78   84   92   85   91
 34   14
   81 1115   87   95   94   89
 35   14
   84    6    4   98    3   91
 36   14
  100   84   72   99   86  101
 37   14
  100   72   68  101   74   16
 38   14
  100   68   75   16   76   21
 39   14
   87  100   75   19   21   88
 40   14
 1117   87 1115   93   94 1114
 41   14
  102  103  198  106  197  191
 42   14
  198  103  108  197  110  109
 43   14
  198  108  111  109  113  112
 44   14
  114  111  108  115  113  116
 45   14
  114  108    2  116  119  118
 46   14
    1  114    2  121  118    5
 47   14
  123  198  111  124  112  125
 48   14
  123  111  126  125  128  127
 49   14
  126  111  129  128  131  130
 50   14
  111  114  129  115  132  131
 51   14
  133  123  126  134  127  135
 52   14
  129  136  126  137  138  130
 53   14
  136  133  126  139  135  138
 54   14
  133  136  140  139  142  141
 55   14
  143  133  140  144  141  145
 56   14
  136  146  140  148  147  142
 57   14
  143  140  146  145  147  151
 58   14
  149  143  146  150  151  152
 59   14
  153  143  149  154  150  155
 60   14
  146  156  149  158  157  152
 61   14
  153  149  159  155  161  160
 62   14
  149  156  159  157  162  161
 63   14
  163  153  159  164  160  165
 64   14
  156  166  159  167  168  162
 65   14
  163  159  169  165  171  170
 66   14
  159  166  169  168  172  171
 67   14
  163  169  173  170  175  174
 68   14
  169  166  176  172  178  177
 69   14
  179  163  173  181  174  180
 70   14
  166  182  176  184  183  178
 71   14
  185  179  173  186  180  187
 72   14
  182  188  176  190  189  183
 73   14
  105  179  185  193  186  192
 74   14
  182    4  188  196  195  190
 75   14
  185  107  105  199  104  192
 76   14
  201  185  173  200  187  202
 77   14
  201  173  169  202  175  117
 78   14
  201  169  176  117  177  122
 79   14
  188  201  176  120  122  189
 80   14
    6  188    4  194  195    3
 81   14
  203  204  299  207  298  292
 82   14
  299  204  209  298  211  210
 83   14
  299  209  212  210  214  213
 84   14
  215  212  209  216  214  217
 85   14
  215  209  103  217  220  219
 86   14
  102  215  103  222  219  106
 87   14
  224  299  212  225  213  226
 88   14
  224  212  227  226  229  228
 89   14
  227  212  230  229  232  231
 90   14
  212  215  230  216  233  232
 91   14
  234  224  227  235  228  236
 92   14
  230  237  227  238  239  231
 93   14
  237  234  227  240  236  239
 94   14
  234  237  241  240  243  242
 95   14
  244  234  241  245  242  246
 96   14
  237  247  241  249  248  243
 97   14
  244  241  247  246  248  252
 98   14
  250  244  247  251  252  253
 99   14
  254  244  250  255  251  256
 100   14
  247  257  250  259  258  253
 101   14
  254  250  260  256  262  261
 102   14
  250  257  260  258  263  262
 103   14
  264  254  260  265  261  266
 104   14
  257  267  260  268  269  263
 105   14
  264  260  270  266  272  271
 106   14
  260  267  270  269  273  272
 107   14
  264  270  274  271  276  275
 108   14
  270  267  277  273  279  278
 109   14
  280  264  274  282  275  281
 110   14
  267  283  277  285  284  279
 111   14
  286  280  274  287  281  288
 112   14
  283  289  277  291  290  284
 113   14
  206  280  286  294  287  293
 114   14
  283  105  289  297  296  291
 115   14
  286  208  206  300  205  293
 116   14
  302  286  274  301  288  303
 117   14
  302  274  270  303  276  218
 118   14
  302  270  277  218  278  223
 119   14
  289  302  277  221  223  290
 120   14
  107  289  105  295  296  104
 121   14
  304  305  400  308  399  393
 122   14
  400  305  310  399  312  311
 123   14
  400  310  313  311  315  314
 124   14
  316  313  310  317  315  318
 125   14
  316  310  204  318  321  320
 126   14
  203  316  204  323  320  207
 127   14
  325  400  313  326  314  327
 128   14
  325  313  328  327  330  329
 129   14
  328  313  331  330  333  332
 130   14
  313  316  331  317  334  333
 131   14
  335  325  328  336  329  337
 132   14
  331  338  328  339  340  332
 133   14
  338  335  328  341  337  340
 134   14
  335  338  342  341  344  343
 135   14
  345  335  342  346  343  347
 136   14
  338  348  342  350  349  344
 137   14
  345  342  348  347  349  353
 138   14
  351  345  348  352  353  354
 139   14
  355  345  351  356  352  357
 140   14
  348  358  351  360  359  354
 141   14
  355  351  361  357  363  362
 142   14
  351  358  361  359  364  363
 143   14
  365  355  361  366  362  367
 144   14
  358  368  361  369  370  364
 145   14
  365  361  371  367  373  372
 146   14
  361  368  371  370  374  373
 147   14
  365  371  375  372  377  376
 148   14
  371  368  378  374  380  379
 149   14
  381  365  375  383  376  382
 150   14
  368  384  378  386  385  380
 151   14
  387  381  375  388  382  389
 152   14
  384  390  378  392  391  385
 153   14
  307  381  387  395  388  394
 154   14
  384  206  390  398  397  392
 155   14
  387  309  307  401  306  394
 156   14
  403  387  375  402  389  404
 157   14
  403  375  371  404  377  319
 158   14
  403  371  378  319  379  324
 159   14
  390  403  378  322  324  391
 160   14
  208  390  206  396  397  205
 161   14
  405  406  501  409  500  494
 162   14
  501  406  411  500  413  412
 163   14
  501  411  414  412  416  415
 164   14
  417  414  411  418  416  419
 165   14
  417  411  305  419  422  421
 166   14
  304  417  305  424  421  308
 167   14
  426  501  414  427  415  428
 168   14
  426  414  429  428  431  430
 169   14
  429  414  432  431  434  433
 170   14
  414  417  432  418  435  434
 171   14
  436  426  429  437  430  438
 172   14
  432  439  429  440  441  433
 173   14
  439  436  429  442  438  441
 174   14
  436  439  443  442  445  444
 175   14
  446  436  443  447  444  448
 176   14
  439  449  443  451  450  445
 177   14
  446  443  449  448  450  454
 178   14
  452  446  449  453  454  455
 179   14
  456  446  452  457  453  458
 180   14
  449  459  452  461  460  455
 181   14
  456  452  462  458  464  463
 182   14
  452  459  462  460  465  464
 183   14
  466  456  462  467  463  468
 184   14
  459  469  462  470  471  465
 185   14
  466  462  472  468  474  473
 186   14
  462  469  472  471  475  474
 187   14
  466  472  476  473  478  477
 188   14
  472  469  479  475  481  480
 189   14
  482  466  476  484  477  483
 190   14
  469  485  479  487  486  481
 191   14
  488  482  476  489  483  490
 192   14
  485  491  479  493  492  486
 193   14
  408  482  488  496  489  495
 194   14
  485  307  491  499  498  493
 195   14
  488  410  408  502  407  495
 196   14
  504  488  476  503  490  505
 197   14
  504  476  472  505  478  420
 198   14
  504  472  479  420  480  425
 199   14
  491  504  479  423  425  492
 200   14
  309  491  307  497  498  306
 201   14
  506  507  602  510  601  595
 202   14
  602  507  512  601  514  513
 203   14
  602  512  515  513  517  516
 204   14
  518  515  512  519  517  520
 205   14
  518  512  406  520  523  522
 206   14
  405  518  406  525  522  409
 207   14
  527  602  515  528  516  529
 208   14
  527  515  530  529  532  531
 209   14
  530  515  533  532  535  534
 210   14
  515  518  533  519  536  535
 211   14
  537  527  530  538  531  539
 212   14
  533  540  530  541  542  534
 213   14
  540  537  530  543  539  542
 214   14
  537  540  544  543  546  545
 215   14
  547  537  544  548  545  549
 216   14
  540  550  544  552  551  546
 217   14
  547  544  550  549  551  555
 218   14
  553  547  550  554  555  556
 219   14
  557  547  553  558  554  559
 220   14
  550  560  553  562  561  556
 221   14
  557  553  563  559  565  564
 222   14
  553  560  563  561  566  565
 223   14
  567  557  563  568  564  569
 224   14
  560  570  563  571  572  566
 225   14
  567  563  573  569  575  574
 226   14
  563  570  573  572  576  575
 227   14
  567  573  577  574  579  578
 228   14
  573  570  580  576  582  581
 229   14
  583  567  577  585  578  584
 230   14
  570  586  580  588  587  582
 231   14
  589  583  577  590  584  591
 232   14
  586  592  580  594  593  587
 233   14
  509  583  589  597  590  596
 234   14
  586  408  592  600  599  594
 235   14
  589  511  509  603  508  596
 236   14
  605  589  577  604  591  606
 237   14
  605  577  573  606  579  521
 238   14
  605  573  580  521  581  526
 239   14
  592  605  580  524  526  593
 240   14
  410  592  408  598  599  407
 241   14
  607  608  703  611  702  696
 242   14
  703  608  613  702  615  614
 243   14
  703  613  616  614  618  617
 244   14
  619  616  613  620  618  621
 245   14
  619  613  507  621  624  623
 246   14
  506  619  507  626  623  510
 247   14
  628  703  616  629  617  630
 248   14
  628  616  631  630  633  632
 249   14
  631  616  634  633  636  635
 250   14
  616  619  634  620  637  636
 251   14
  638  628  631  639  632  640
 252   14
  634  641  631  642  643  635
 253   14
  641  638  631  644  640  643
 254   14
  638  641  645  644  647  646
 255   14
  648  638  645  649  646  650
 256   14
  641  651  645  653  652  647
 257   14
  648  645  651  650  652  656
 258   14
  654  648  651  655  656  657
 259   14
  658  648  654  659  655  660
 260   14
  651  661  654  663  662  657
 261   14
  658  654  664  660  666  665
 262   14
  654  661  664  662  667  666
 263   14
  668  658  664  669  665  670
 264   14
  661  671  664  672  673  667
 265   14
  668  664  674  670  676  675
 266   14
  664  671  674  673  677  676
 267   14
  668  674  678  675  680  679
 268   14
  674  671  681  677  683  682
 269   14
  684  668  678  686  679  685
 270   14
  671  687  681  689  688  683
 271   14
  690  684  678  691  685  692
 272   14
  687  693  681  695  694  688
 273   14
  610  684  690  698  691  697
 274   14
  687  509  693  701  700  695
 275   14
  690  612  610  704  609  697
 276   14
  706  690  678  705  692  707
 277   14
  706  678  674  707  680  622
 278   14
  706  674  681  622  682  627
 279   14
  693  706  681  625  627  694
 280   14
  511  693  509  699  700  508
 281   14
  708  709  804  712  803  797
 282   14
  804  709  714  803  716  715
 283   14
  804  714  717  715  719  718
 284   14
  720  717  714  721  719  722
 285   14
  720  714  608  722  725  724
 286   14
  607  720  608  727  724  611
 287   14
  729  804  717  730  718  731
 288   14
  729  717  732  731  734  733
 289   14
  732  717  735  734  737  736
 290   14
  717  720  735  721  738  737
 291   14
  739  729  732  740  733  741
 292   14
  735  742  732  743  744  736
 293   14
  742  739  732  745  741  744
 294   14
  739  742  746  745  748  747
 295   14
  749  739  746  750  747  751
 296   14
  742  752  746  754  753  748
 297   14
  749  746  752  751  753  757
 298   14
  755  749  752  756  757  758
 299   14
  759  749  755  760  756  761
 300   14
  752  762  755  764  763  758
 301   14
  759  755  765  761  767  766
 302   14
  755  762  765  763  768  767
 303   14
  769  759  765  770  766  771
 304   14
  762  772  765  773  774  768
 305   14
  769  765  775  771  777  776
 306   14
  765  772  775  774  778  777
 307   14
  769  775  779  776  781  780
 308   14
  775  772  782  778  784  783
 309   14
  785  769  779  787  780  786
 310   14
  772  788  782  790  789  784
 311   14
  791  785  779  792  786  793
 312   14
  788  794  782  796  795  789
 313   14
  711  785  791  799  792  798
 314   14
  788  610  794  802  801  796
 315   14
  791  713  711  805  710  798
 316   14
  807  791  779  806  793  808
 317   14
  807  779  775  808  781  723
 318   14
  807  775  782  723  783  728
 319   14
  794  807  782  726  728  795
 320   14
  612  794  610  800  801  609
 321   14
  809  810  905  813  904  898
 322   14
  905  810  815  904  817  816
 323   14
  905  815  818  816  820  819
 324   14
  821  818  815  822  820  823
 325   14
  821  815  709  823  826  825
 326   14
  708  821  709  828  825  712
 327   14
  830  905  818  831  819  832
 328   14
  830  818  833  832  835  834
 329   14
  833  818  836  835  838  837
 330   14
  818  821  836  822  839  838
 331   14
  840  830  833  841  834  842
 332   14
  836  843  833  844  845  837
 333   14
  843  840  833  846  842  845
 334   14
  840  843  847  846  849  848
 335   14
  850  840  847  851  848  852
 336   14
  843  853  847  855  854  849
 337   14
  850  847  853  852  854  858
 338   14
  856  850  853  857  858  859
 339   14
  860  850  856  861  857  862
 340   14
  853  863  856  865  864  859
 341   14
  860  856  866  862  868  867
 342   14
  856  863  866  864  869  868
 343   14
  870  860  866  871  867  872
 344   14
  863  873  866  874  875  869
 345   14
  870  866  876  872  878  877
 346   14
  866  873  876  875  879  878
 347   14
  870  876  880  877  882  881
 348   14
  876  873  883  879  885  884
 349   14
  886  870  880  888  881  887
 350   14
  873  889  883  891  890  885
 351   14
  892  886  880  893  887  894
 352   14
  889  895  883  897  896  890
 353   14
  812  886  892  900  893  899
 354   14
  889  711  895  903  902  897
 355   14
  892  814  812  906  811  899
 356   14
  908  892  880  907  894  909
 357   14
  908  880  876  909  882  824
 358   14
  908  876  883  824  884  829
 359   14
  895  908  883  827  829  896
 360   14
  713  895  711  901  902  710
 361   14
  910  911 1006  914 1005  999
 362   14
 1006  911  916 1005  918  917
 363   14
 1006  916  919  917  921  920
 364   14
  922  919  916  923  921  924
 365   14
  922  916  810  924  927  926
 366   14
  809  922  810  929  926  813
 367   14
  931 1006  919  932  920  933
 368   14
  931  919  934  933  936  935
 369   14
  934  919  937  936  939  938
 370   14
  919  922  937  923  940  939
 371   14
  941  931  934  942  935  943
 372   14
  937  944  934  945  946  938
 373   14
  944  941  934  947  943  946
 374   14
  941  944  948  947  950  949
 375   14
  951  941  948  952  949  953
 376   14
  944  954  948  956  955  950
 377   14
  951  948  954  953  955  959
 378   14
  957  951  954  958  959  960
 379   14
  961  951  957  962  958  963
 380   14
  954  964  957  966  965  960
 381   14
  961  957  967  963  969  968
 382   14
  957  964  967  965  970  969
 383   14
  971  961  967  972  968  973
 384   14
  964  974  967  975  976  970
 385   14
  971  967  977  973  979  978
 386   14
  967  974  977  976  980  979
 387   14
  971  977  981  978  983  982
 388   14
  977  974  984  980  986  985
 389   14
  987  971  981  989  982  988
 390   14
  974  990  984  992  991  986
 391   14
  993  987  981  994  988  995
 392   14
  990  996  984  998  997  991
 393   14
  913  987  993 1001  994 1000
 394   14
  990  812  996 1004 1003  998
 395   14
  993  915  913 1007  912 1000
 396   14
 1009  993  981 1008  995 1010
 397   14
 1009  981  977 1010  983  925
 398   14
 1009  977  984  925  985  930
 399   14
  996 1009  984  928  930  997
 400   14
  814  996  812 1002 1003  811
 401   14
 1011 1012 1107 1015 1106 1100
 402   14
 1107 1012 1017 1106 1019 1018
 403   14
 1107 1017 1020 1018 1022 1021
 404   14
 1023 1020 1017 1024 1022 1025
 405   14
 1023 1017  911 1025 1028 1027
 406   14
  910 1023  911 1030 1027  914
 407   14
 1032 1107 1020 1033 1021 1034
 408   14
 1032 1020 1035 1034 1037 1036
 409   14
 1035 1020 1038 1037 1040 1039
 410   14
 1020 1023 1038 1024 1041 1040
 411   14
 1042 1032 1035 1043 1036 1044
 412   14
 1038 1045 1035 1046 1047 1039
 413   14
 1045 1042 1035 1048 1044 1047
 414   14
 1042 1045 1049 1048 1051 1050
 415   14
 1052 1042 1049 1053 1050 1054
 416   14
 1045 1055 1049 1057 1056 1051
 417   14
 1052 1049 1055 1054 1056 1060
 418   14
 1058 1052 1055 1059 1060 1061
 419   14
 1062 1052 1058 1063 1059 1064
 420   14
 1055 1065 1058 1067 1066 1061
 421   14
 1062 1058 1068 1064 1070 1069
 422   14
 1058 1065 1068 1066 1071 1070
 423   14
 1072 1062 1068 1073 1069 1074
 424   14
 1065 1075 1068 1076 1077 1071
 425   14
 1072 1068 1078 1074 1080 1079
 426   14
 1068 1075 1078 1077 1081 1080
 427   14
 1072 1078 1082 1079 1084 1083
 428   14
 1078 1075 1085 1081 1087 1086
 429   14
 1088 1072 1082 1090 1083 1089
 430   14
 1075 1091 1085 1093 1092 1087
 431   14
 1094 1088 1082 1095 1089 1096
 432   14
 1091 1097 1085 1099 1098 1092
 433   14
 1014 1088 1094 1102 1095 1101
 434   14
 1091  913 1097 1105 1104 1099
 435   14
 1094 1016 1014 1108 1013 1101
 436   14
 1110 1094 1082 1109 1096 1111
 437   14
 1110 1082 1078 1111 1084 1026
 438   14
 1110 1078 1085 1026 1086 1031
 439   14
 1097 1110 1085 1029 1031 1098
 440   14
  915 1097  913 1103 1104  912
 441   14
 1112 1113 1208 1116 1207 1201
 442   14
 1208 1113 1118 1207 1120 1119
 443   14
 1208 1118 1121 1119 1123 1122
 444   14
 1124 1121 1118 1125 1123 1126
 445   14
 1124 1118 1012 1126 1129 1128
 446   14
 1011 1124 1012 1131 1128 1015
 447   14
 1133 1208 1121 1134 1122 1135
 448   14
 1133 1121 1136 1135 1138 1137
 449   14
 1136 1121 1139 1138 1141 1140
 450   14
 1121 1124 1139 1125 1142 1141
 451   14
 1143 1133 1136 1144 1137 1145
 452   14
 1139 1146 1136 1147 1148 1140
 453   14
 1146 1143 1136 1149 1145 1148
 454   14
 1143 1146 1150 1149 1152 1151
 455   14
 1153 1143 1150 1154 1151 1155
 456   14
 1146 1156 1150 1158 1157 1152
 457   14
 1153 1150 1156 1155 1157 1161
 458   14
 1159 1153 1156 1160 1161 1162
 459   14
 1163 1153 1159 1164 1160 1165
 460   14
 1156 1166 1159 1168 1167 1162
 461   14
 1163 1159 1169 1165 1171 1170
 462   14
 1159 1166 1169 1167 1172 1171
 463   14
 1173 1163 1169 1174 1170 1175
 464   14
 1166 1176 1169 1177 1178 1172
 465   14
 1173 1169 1179 1175 1181 1180
 466   14
 1169 1176 1179 1178 1182 1181
 467   14
 1173 1179 1183 1180 1185 1184
 468   14
 1179 1176 1186 1182 1188 1187
 469   14
 1189 1173 1183 1191 1184 1190
 470   14
 1176 1192 1186 1194 1193 1188
 471   14
 1195 1189 1183 1196 1190 1197
 472   14
 1192 1198 1186 1200 1199 1193
 473   14
 1115 1189 1195 1203 1196 1202
 474   14
 1192 1014 1198 1206 1205 1200
 475   14
 1195 1117 1115 1209 1114 1202
 476   14
 1211 1195 1183 1210 1197 1212
 477   14
 1211 1183 1179 1212 1185 1127
 478   14
 1211 1179 1186 1127 1187 1132
 479   14
 1198 1211 1186 1130 1132 1199
 480   14
 1016 1198 1014 1204 1205 1013
 1  480  206000.  0.3  7  1.

