Fix debci

2 jobs for debian/0.19.4-3 in 2 minutes and 7 seconds (queued for 1 second)
latest
Status Job ID Name Coverage
  Test
failed #103498
test:0.12

00:02:03

passed #103499
test:latest

00:02:06

 
Name Stage Failure
failed
test:0.12 Test
npm ERR! Or if that isn't available, you can get their info via:
npm ERR!
npm ERR! npm owner ls buble
npm ERR! There is likely additional logging output above.

npm ERR! Please include the following file with any support request:
npm ERR! /builds/js-team/node-buble/npm-debug.log
npm ERR! Test failed. See above for more details.
ERROR: Job failed: exit code 1