Add patch to remove browser bundling

2 jobs for master in 5 minutes and 34 seconds (queued for 3 seconds)
Status Job ID Name Coverage
  Test
failed #225379
test:0.12

00:05:34

passed #225380
test:latest

00:03:25

 
Name Stage Failure
failed
test:0.12 Test
npm ERR! Or if that isn't available, you can get their info via:
npm ERR!
npm ERR! npm owner ls buble
npm ERR! There is likely additional logging output above.

npm ERR! Please include the following file with any support request:
npm ERR! /builds/js-team/node-buble/npm-debug.log
npm ERR! Test failed. See above for more details.
ERROR: Job failed: exit code 1