    1	Aaron M. Ucko 	ucko 
    2	Abhijith PA 	abhijith 
    3	Abraham Raji 	abraham 
    4	Adam Borowski 	kilobyte 
    5	Adam D. Barratt 	adsb 
    6	Adam Majer 	adamm 
    7	Adam Powell 	hazelsct 
    8	Adrian Bunk 	bunk 
    9	Adriano Rafael Gomes 	adrianorg 
   10	Afif Elghraoui 	afif 
   11	Agustin Henze 	tin 
   12	Agustín Martín Domingo 	agmartin 
   13	Aigars Mahinovs 	aigarius 
   14	Akira Ohashi 	bg66 
   15	Akira Yamada 	akira 
   16	Alan Woodland 	awoodland 
   17	Alastair McKinstry 	mckinstry 
   18	Alban Vidal 	zordhak 
   19	Albert Huang 	ash 
   20	Alberto Garcia 	berto 
   21	Alberto Gonzalez Iniesta 	agi 
   22	Albin Tonnerre 	lutin 
   23	Alejandro Garrido Mota 	alejandro 
   24	Alen Zekulic 	azekulic 
   25	Alessandro Ghedini 	ghedo 
   26	Alessio Treglia 	alessio 
   27	Alex Muntada 	alexm 
   28	Alex Pennace 	alexp 
   29	Alexander Chernyakhovsky 	achernya 
   30	Alexander GQ Gerasiov 	gq 
   31	Alexander List 	alex 
   32	Alexander Reichle-Schmehl 	tolimar 
   33	Alexander Sack 	asac 
   34	Alexander Wirt 	formorer 
   35	Alexander Zangerl 	az 
   36	Alexandre Delanoë 	anoe 
   37	Alexandre Mestiashvili 	mestia 
   38	Alexandre Viau 	aviau 
   39	Alexei Nikolov 	clown 
   40	Allison Randal 	wendar 
   41	Aloïs Micard 	creekorful 
   42	Amaya Rodrigo Sastre 	amaya 
   43	Amos Waterland 	apw 
   44	Ana Beatriz Guerrero López 	ana 
   45	Ana Carolina Comandulli 	caroll 
   46	Ana Custura 	acute 
   47	Anders Hammarquist 	iko 
   48	Andre Luis Lopes 	andrelop 
   49	Andrea Capriotti 	capriott 
   50	Andrea Colangelo 	warp10 
   51	Andrea Mennucci 	mennucc1 
   52	Andreas B. Mundt 	andi 
   53	Andreas Barth 	aba 
   54	Andreas Beckmann 	anbe 
   55	Andreas Boll 	aboll 
   56	Andreas E. Bombe 	aeb 
   57	Andreas Franzen 	anfra 
   58	Andreas Henriksson 	ah 
   59	Andreas Metzler 	ametzler 
   60	Andreas Rönnquist 	gusnan 
   61	Andreas Tille 	tille 
   62	Andree Leidenfrost 	andree 
   63	Andrej Shadura 	andrewsh 
   64	Andres Salomon 	dilinger 
   65	Andrew Lee 	ajqlee 
   66	Andrew Martin Adrian Cater 	amacater 
   67	Andrew McMillan 	awm 
   68	Andrew Mitchell 	ajmitch 
   69	Andrew Pollock 	apollock 
   70	Andrew Starr-Bochicchio 	asb 
   71	Andrey Rahmatullin 	wrar 
   72	Andrius Merkys 	merkys 
   73	Andy Li 	andyli 
   74	Andy Simpkins 	rattusrattus 
   75	Angel Abad 	angel 
   76	Angus Lees 	gus 
   77	Anibal Monsalve Salazar 	anibal 
   78	Anselm Lingnau 	lingnau 
   79	Ansgar 	ansgar 
   80	Anthony Fok 	foka 
   81	Anthony Towns 	ajt 
   82	Antoine Beaupré 	anarcat 
   83	Anton Gladky 	gladk 
   84	Anton Zinoviev 	zinoviev 
   85	Antonin Kral 	krala 
   86	Antonio Radici 	antonio 
   87	Antonio Terceiro 	terceiro 
   88	Anupa Ann Joseph 	anupa 
   89	Anuradha Weeraman 	anuradha 
   90	Apollon Oikonomopoulos 	apoikos 
   91	Ardo van Rangelrooij 	ardo 
   92	Ari Pollak 	ari 
   93	Arnaud Ferraris 	aferraris 
   94	Arnaud Fontaine 	arnau 
   95	Arnaud Rebillout 	arnaudr 
   96	Arno Töll 	arno 
   97	Aron Xu 	aron 
   98	Arthur de Jong 	adejong 
   99	Arto Jantunen 	viiru 
  100	Arturo Borrero González 	arturo 
  101	Arun Kumar Pariyar 	arun 
  102	Asheesh Laroia 	paulproteus 
  103	Asias He 	asias 
  104	Atsushi Kamoshida 	kamop 
  105	Attila Szalay 	sasa 
  106	Aurelien Jarno 	aurel32 
  107	Aurélien Couderc 	coucouf 
  108	Axel Beckert 	abe 
  109	Balasankar Chelamattathu 	balasankarc 
  110	Balint Reczey 	rbalint 
  111	Baptiste Beauplat 	lyknode 
  112	Barak A. Pearlmutter 	bap 
  113	Barry deFreese 	bdefreese 
  114	Bart Martens 	bartm 
  115	Bartosz Fenski 	fenio 
  116	Bas Wijnen 	wijnen 
  117	Bas Zoetekouw 	bas 
  118	Bastian Blank 	waldi 
  119	Bastian Germann 	bage 
  120	Bastian Venthur 	venthur 
  121	Bastien Roucariès 	rouca 
  122	Bdale Garbee 	bdale 
  123	Ben Armstrong 	synrg 
  124	Ben Burton 	bab 
  125	Ben Finney 	bignose 
  126	Ben Hutchings 	benh 
  127	Benda Xu 	orv 
  128	Benjamin Barenblat 	bbaren 
  129	Benjamin Drung 	bdrung 
  130	Benjamin Hill 	mako 
  131	Benjamin Mesing 	ben 
  132	Bernd Schumacher 	bs 
  133	Bernd Zeimetz 	bzed 
  134	Bernelle Verster 	indiebio 
  135	Bernhard R. Link 	brlink 
  136	Bernhard Schmidt 	berni 
  137	Bertrand Marc 	bmarc 
  138	Bill Allombert 	ballombe 
  139	Birger Schacht 	birger 
  140	Boris Pek 	tehnick 
  141	Boyuan Yang 	byang 
  142	Bradley Bosch 	brad 
  143	Branden Robinson 	branden 
  144	Brendan O'Dea 	bod 
  145	Breno Leitao 	leitao 
  146	Brian Gupta 	bgupta 
  147	Brian May 	bam 
  148	Brian Pellin 	bpellin 
  149	Brian Ristuccia 	brianr 
  150	Brian Thomason 	iamfuzz 
  151	Brian White 	bcwhite 
  152	Brice Goglin 	bgoglin 
  153	Bruno Kleinert 	fuddl 
  154	Cameron Dale 	camrdale 
  155	Camm Maguire 	camm 
  156	Carl Chenet 	chaica 
  157	Carl Worth 	cworth 
  158	Carlo U. Segre 	segre 
  159	Carlos Laviola 	claviola 
  160	Carsten Hey 	carsten 
  161	Carsten Leonhardt 	leo 
  162	Carsten Schoenert 	tijuca 
  163	ChangZhuo Chen 	czchen 
  164	Changwoo Ryu 	cwryu 
  165	Charles Plessy 	plessy 
  166	Chen Baozi 	baozich 
  167	Chris Boot 	bootc 
  168	Chris Boyle 	cmb 
  169	Chris Halls 	halls 
  170	Chris Hofstaedtler 	zeha 
  171	Chris Lamb 	lamby 
  172	Christian Bayle 	bayle 
  173	Christian Ehrhardt 	paelzer 
  174	Christian Kastner 	ckk 
  175	Christian Marillat 	marillat 
  176	Christian T. Steigies 	cts 
  177	Christine Christine Spang 	christine 
  178	Christoph Berg 	myon 
  179	Christoph Biedl 	cbiedl 
  180	Christoph Egger 	christoph 
  181	Christoph Göhre 	gris 
  182	Christoph Haas 	haas 
  183	Christoph Martin 	chrism 
  184	Christopher Knadle 	krait 
  185	Christopher L. Cheney 	ccheney 
  186	Christopher Lawrence 	lawrencc 
  187	Christopher Stuart Hoskin 	mans0954 
  188	Christopher Taylor 	ctaylor 
  189	Christos Trochalakis 	ctrochalakis 
  190	Chrysostomos Nanakos 	cnanakos 
  191	Chuan-kai Lin 	cklin 
  192	Clint Adams 	clint 
  193	Clint Byrum 	spamaps 
  194	Clément Hermann 	nodens 
  195	Colin Watson 	cjwatson 
  196	Cord Beermann 	cord 
  197	Craig Small 	csmall 
  198	Cyril Bouthors 	cyb 
  199	Cyril Brulebois 	kibi 
  200	Cédric Boutillier 	boutil 
  201	Daisuke Higuchi 	dai 
  202	Dale Martin 	dmartin 
  203	Damyan Ivanov 	dmn 
  204	Danai Sae-Han 	danai 
  205	Daniel Baumann 	daniel 
  206	Daniel Echeverry 	epsilon 
  207	Daniel Glassey 	wdg 
  208	Daniel Kahn Gillmor 	dkg 
  209	Daniel Lange 	dlange 
  210	Daniel Leidert 	dleidert 
  211	Daniel Lenharo de Souza 	lenharo 
  212	Daniel Schepler 	schepler 
  213	Daniel Silverstone 	dsilvers 
  214	Daniel Swarbrick 	dswarbrick 
  215	Daniele Tricoli 	eriol 
  216	Dann Frazier 	dannf 
  217	Dario Minnucci 	midget 
  218	Dariusz Dwornikowski 	darek 
  219	Dave Holland 	dave 
  220	David Bremner 	bremner 
  221	David I. Lehn 	dlehn 
  222	David Kalnischkies 	donkult 
  223	David L. Coe 	davidc 
  224	David Nusinow 	dnusinow 
  225	David Paleino 	dapal 
  226	David Prévot 	taffit 
  227	David Steele 	steele 
  228	David Suárez Rodríguez 	deiv 
  229	David Watson 	dwatson 
  230	David Weinehall 	tao 
  231	Davide G.M. Salvetti 	salve 
  232	Davide Puricelli 	evo 
  233	Deepak Tripathi 	deepak 
  234	Denis Barbier 	barbier 
  235	Denis Briand 	denis 
  236	Dennis Braun 	snd 
  237	Dennis L. Clark 	dbugger 
  238	Diane Trout 	diane 
  239	Didier Raboud 	odyx 
  240	Dima Kogan 	dkogan 
  241	Dimitri Ledkov 	xnox 
  242	Dirk Eddelbuettel 	edd 
  243	Dmitry Borodaenko 	angdraug 
  244	Dmitry Oboukhov 	unera 
  245	Dmitry Shachnev 	mitya57 
  246	Dmitry Smirnov 	onlyjob 
  247	Domenico Andreoli 	cavok 
  248	Dominic Hargreaves 	dom 
  249	Dominik George 	natureshadow 
  250	Dominique Belhachemi 	domibel 
  251	Dominique Dumont 	dod 
  252	Don Armstrong 	don 
  253	Donald Norwood 	donald 
  254	Douglas Andrew Torrance 	dtorrance 
  255	Drake Diedrich 	dld 
  256	Drew Parsons 	dparsons 
  257	Dylan Aïssi 	daissi 
  258	Ean Schuessler 	ean 
  259	Ed Boraas 	ed 
  260	Eduard Bloch 	blade 
  261	Eduardo Trápani 	mapache 
  262	Edward Betts 	edward 
  263	Eike Sauer 	eike 
  264	Elana Hashman 	ehashman 
  265	Elena Grandi 	valhalla 
  266	Eloy A. Paris 	peloy 
  267	Emanuele Rocca 	ema 
  268	Emfox Zhou 	emfox 
  269	Emilio Pozuelo Monfort 	pochu 
  270	Emmanuel Bourg 	ebourg 
  271	Emmanuel Bouthenot 	kolter 
  272	Emmanuel Kasper Kasprzyk 	manu 
  273	Enrico Zini 	enrico 
  274	Eric Delaunay 	delaunay 
  275	Eric Dorland 	eric 
  276	Eric Evans 	eevans 
  277	Eric Sharkey 	sharkey 
  278	Erich Schubert 	erich 
  279	Erik Schanze 	eriks 
  280	Erik Wenzel 	erik 
  281	Erinn Clark 	erinn 
  282	Eugene V. Lyubimkin 	jackyf 
  283	Eugeniy Meshcheryakov 	eugen 
  284	Evgeni Golov 	evgeni 
  285	Fabian Fagerholm 	fabbe 
  286	Fabian Greffrath 	fabian 
  287	Fabio Augusto De Muzio Tobich 	ftobich 
  288	Fabio Tranchitella 	kobold 
  289	Faidon Liambotis 	paravoid 
  290	Fathi Boudra 	fabo 
  291	Federico Ceratto 	federico 
  292	Federico Di Gregorio 	fog 
  293	Felipe Augusto van de Wiel 	faw 
  294	Felipe Sateler 	fsateler 
  295	Felix Geyer 	fgeyer 
  296	Felix Lechner 	lechner 
  297	Ferenc Wágner 	wferi 
  298	Filippo Giunchedi 	filippo 
  299	Filippo Rusconi 	lopippo 
  300	Florian Ernst 	florian 
  301	Florian Hinzmann 	fh 
  302	Florian Lohoff 	flo 
  303	Florian Schlichting 	fsfs 
  304	Florian Weimer 	fw 
  305	Francesco Lovergine 	frankie 
  306	Francesco Namuri 	franam 
  307	Francisco Manuel García Claramonte 	francisco 
  308	Francisco Vilmar Cardoso Ruviaro 	vilmar 
  309	Francois Marier 	francois 
  310	Frank Lichtenheld 	djpig 
  311	Frederic Peters 	fpeters 
  312	Fredrik Hallenberg 	hallon 
  313	Free Ekanayaka 	freee 
  314	Frédéric Bonnard 	frediz 
  315	Frédéric-Emmanuel Picca 	picca 
  316	Félix Sipma 	felix 
  317	Gabriel F. T. Gomes 	gabriel 
  318	Gard Spreemann 	gspr 
  319	Gaudenz Steinlin 	gaudenz 
  320	Geert Stappers 	stappers 
  321	Gennaro Oliva 	oliva 
  322	Geoffroy Youri Berret 	kaliko 
  323	Georg Faerber 	georg 
  324	George Danchev 	danchev 
  325	Georges Khaznadar 	georgesk 
  326	Gerrit Pape 	pape 
  327	Gert Wollny 	gewo 
  328	Giacomo Catenazzi 	cate 
  329	Gianfranco Costamagna 	locutusofborg 
  330	Gilles Filippini 	pini 
  331	Giovani Augusto Ferreira 	giovani 
  332	Giovanni Mascellani 	gio 
  333	Giuseppe Sacco 	eppesuig 
  334	Gleydson Mazioli da Silva 	gleydson 
  335	Goedson Teixeira Paixao 	goedson 
  336	Gonéri Le Bouder 	goneri 
  337	Gordon Ball 	chronitis 
  338	Graham Inggs 	ginggs 
  339	Gregor Herrmann 	gregoa 
  340	Gregory Colpart 	reg 
  341	Guido Guenther 	agx 
  342	Guido Trotter 	ultrotter 
  343	Guilhem Moulin 	guilhem 
  344	Guillem Jover 	guillem 
  345	Gunnar Hjalmarsson 	gunnarhj 
  346	Gunnar Wolf 	gwolf 
  347	Gustavo Franco 	stratus 
  348	Gustavo Noronha 	kov 
  349	Gustavo Panizzo 	gfa 
  350	Guus Sliepen 	guus 
  351	Göran Weinholt 	weinholt 
  352	Gürkan Myczko 	tar 
  353	HAYASHI Kentaro 	kenhys 
  354	Hakan Ardo 	hakan 
  355	Hannes von Haugwitz 	hvhaugwitz 
  356	Hanno Wagner 	wagner 
  357	Hans-Christoph Steiner 	eighthave 
  358	Harlan Lieberman-Berg 	hlieberman 
  359	Harshula Jayasuriya 	harshula 
  360	Hector Garcia 	hector 
  361	Hector Oron 	zumbi 
  362	Heiko Stübner 	mmind 
  363	Helge Deller 	deller 
  364	Helmut Grohne 	helmutg 
  365	Henning Glawe 	glaweh 
  366	Henrique de Moraes Holschuh 	hmh 
  367	Henry-Nicolas Tourneur 	hntourne 
  368	Hideki Yamane 	henrich 
  369	Hilko Bengen 	bengen 
  370	Holger Levsen 	holger 
  371	Holger Wansing 	holgerw 
  372	Hubert Chan 	uhoreg 
  373	Hugh McMaster 	hmc 
  374	Hugo Lefeuvre 	hle 
  375	Hwei Sheng Teoh 	hsteoh 
  376	IOhannes m zmölnig 	umlaeute 
  377	Iain Lane 	laney 
  378	Ian Jackson 	iwj 
  379	Ian James Campbell 	ijc 
  380	Ian Wienand 	ianw 
  381	Ilias Tsitsimpis 	iliastsi 
  382	Iustin Pop 	iustin 
  383	Ivan Kohler 	ivan 
  384	Ivo De Decker 	ivodd 
  385	Jaakko Niemi 	liiwi 
  386	Jaime Robles 	jaime 
  387	Jakob Haufe 	sur5r 
  388	Jakub Ružička 	jru 
  389	Jakub Wilk 	jwilk 
  390	Jaldhar H. Vyas 	jaldhar 
  391	James Bromberger 	jeb 
  392	James Cowgill 	jcowgill 
  393	James Downing Page 	jamespage 
  394	James Lu 	jlu 
  395	James McCoy 	jamessan 
  396	James Troup 	troup 
  397	James Valleroy 	jvalleroy 
  398	Jamie Wilkinson 	jaq 
  399	Jan Dittberner 	jandd 
  400	Jan Hauke Rahm 	jhr 
  401	Jan Lübbe 	jluebbe 
  402	Jan Niehusmann 	jan 
  403	Jan Wagner 	waja 
  404	Javier Fernandez-Sanguino Peña 	jfs 
  405	Javier Merino Cacho 	vicho 
  406	Jay Berkenbilt 	qjb 
  407	Jay Bonci 	jaybonci 
  408	Jean Baptiste Favre 	jbfavre 
  409	Jean-Michel Kelbert 	kelbert 
  410	Jean-Michel Vourgère 	nirgal 
  411	Jean-Philippe MENGUAL 	jpmengual 
  412	Jeff Breidenbach 	jab 
  413	Jeffrey Ratcliffe 	jjr 
  414	Jelmer Vernooij 	jelmer 
  415	Jeremy Bicha 	jbicha 
  416	Jeremy Bouse 	jbouse 
  417	Jeremy Lainé 	sharky 
  418	Jeroen Ploemen 	jcfp 
  419	Jeroen van Wolffelaar 	jeroen 
  420	Jerome Charaoui 	lavamind 
  421	Jerome Georges Benoit 	calculus 
  422	Jessica Clarke 	jrtc27 
  423	Jim Meyering 	meyering 
  424	Jimmy Kaplowitz 	jimmy 
  425	Jo Shields 	directhex 
  426	Joachim Reichel 	reichel 
  427	Joao Eriberto Mota Filho 	eriberto 
  428	Jochen Sprickerhof 	jspricke 
  429	Joel Rosdahl 	joel 
  430	Joerg Jaspert 	joerg 
  431	Johann Felix Soden 	johfel 
  432	Johannes Schauer 	josch 
  433	John Francesco Ferlito 	johnf 
  434	John Goerzen 	jgoerzen 
  435	John H. IV Robinson 	jaqque 
  436	John Leuner 	jewel 
  437	John Lightsey 	lightsey 
  438	John Lines 	jlines 
  439	John Paul Adrian Glaubitz 	glaubitz 
  440	John Sullivan 	johns 
  441	John V. Belmonte 	jbelmonte 
  442	John Wright 	jsw 
  443	Jon Bernard 	jbernard 
  444	Jonas Genannt 	genannt 
  445	Jonas Meurer 	mejo 
  446	Jonas Smedegaard 	js 
  447	Jonathan Bustillos 	jathan 
  448	Jonathan Cristopher Carter 	jcc 
  449	Jonathan Dowland 	jmtd 
  450	Jonathan Marler 	jmarler 
  451	Jonathan McDowell 	noodles 
  452	Jonathan Nieder 	jrnieder 
  453	Jonathan Oxer 	jon 
  454	Jonathan Wiltshire 	jmw 
  455	Jonny Lamb 	jonny 
  456	Joost van Baal 	joostvb 
  457	Jordan Justen 	jljusten 
  458	Jordi Mallach 	jordi 
  459	Jorge Salamero Sanz 	bencer 
  460	Jose Luis Rivas Contreras 	ghostbar 
  461	Jose M. Calhariz 	calhariz 
  462	Jose Parrella 	bureado 
  463	Joseph Nahmias 	jello 
  464	Joshua Kwan 	joshk 
  465	Josip Rodin 	joy 
  466	Josselin Mouette 	joss 
  467	Josué Abarca 	jmaslibre 
  468	Josué Ortega 	josue 
  469	José L. Redrejo Rodríguez 	jredrejo 
  470	Juan Cespedes 	cespedes 
  471	Juan Gregorio Hernando Rivero 	ghe 
  472	Judit Foglszinger 	urbec 
  473	Julian Andres Klode 	jak 
  474	Julian Gilbey 	jdg 
  475	Juliane Friederike Holzt 	jule 
  476	Julien Cristau 	jcristau 
  477	Julien Patriarca 	leatherface 
  478	Julien Puydt 	jpuydt 
  479	Julián Moreno Patiño 	julian 
  480	Junichi Uekawa 	dancer 
  481	Jérémy Lal 	kapouer 
  482	Jörgen Hägg 	jh 
  483	Kai Wasserbäch 	curan 
  484	Kamal Mostafa 	kamal 
  485	Kanru Chen 	koster 
  486	Karen M Sandler 	karen 
  487	Kari Pahula 	kaol 
  488	Karsten Merker 	merker 
  489	Kartik Mistry 	kartik 
  490	Kees Cook 	kees 
  491	Keita Maehara 	maehara 
  492	Keith Packard 	keithp 
  493	Keng-Yu Lin 	kengyu 
  494	Kenneth J. Pronovici 	pronovic 
  495	Kevin Coyner 	kcoyner 
  496	Kevin M. Rosenberg 	kmr 
  497	Khalid Aziz 	khalid 
  498	Kilian Krause 	kilian 
  499	Klee Dienes 	klee 
  500	Konstantinos Margaritis 	markos 
  501	Krzysztof Krzyzaniak 	eloy 
  502	Kumar Appaiah 	akumar 
  503	Kunal Mehta 	legoktm 
  504	Kurt Kremitzki 	kkremitzki 
  505	Kurt Roeckx 	kroeckx 
  506	Kyle Robbertze 	paddatrapper 
  507	Kåre Thor Olsen 	kaare 
  508	Lamont Jones 	lamont 
  509	Lars Bahner 	bahner 
  510	Laszlo Kajan 	lkajan 
  511	Laura Arjona Reina 	larjona 
  512	Laurent Bigonville 	bigon 
  513	Lenart Janos 	ocsi 
  514	Leo Costela 	costela 
  515	Lev Lamberov 	dogsleg 
  516	Lionel Elie Mamane 	lmamane 
  517	Lior Kaplan 	kaplan 
  518	Lisa Baron 	jeffity 
  519	Lisandro Damián Nicanor Pérez Meyer 	lisandro 
  520	Loic Dachary 	loic 
  521	Loong Jin Chow 	hyperair 
  522	Louis-Philippe Véronneau 	pollo 
  523	Loïc Minier 	lool 
  524	Luca Boccassi 	bluca 
  525	Luca Bruno 	lucab 
  526	Luca Falavigna 	dktrkranz 
  527	Luca Filipozzi 	lfilipoz 
  528	Lucas Kanashiro 	kanashiro 
  529	Lucas Nussbaum 	lucas 
  530	Luciano Bello 	luciano 
  531	Ludovic Brenta 	lbrenta 
  532	Ludovic Drolez 	ldrolez 
  533	Ludovic Rousseau 	rousseau 
  534	Ludovico Cavedon 	cavedon 
  535	Ludovico Gardenghi 	garden 
  536	Luigi Gangitano 	luigi 
  537	Lukasz Jachowicz 	honey 
  538	Luke Faraone 	lfaraone 
  539	László Böszörményi 	gcs 
  540	M J Ray 	mjr 
  541	Maarten Bernardus Lankhorst 	maarten 
  542	Magnus Holmgren 	holmgren 
  543	Maitland Bottoms 	bottoms 
  544	Makoto OHURA 	ohura 
  545	Manoj Srivastava 	srivasta 
  546	Manuel A. Fernandez Montecelo 	mafm 
  547	Manuel Prinz 	manuel 
  548	Marc Dequènes 	duck 
  549	Marc Haber 	zugschlus 
  550	Marc Singer 	elf 
  551	Marcela Tiznado 	mlt 
  552	Marcelo Jorge Vieira 	metal 
  553	Marcin Kulisz 	kula 
  554	Marcin Owsiany 	porridge 
  555	Marcio de Souza Oliveira 	marciosouza 
  556	Marco Nenciarini 	mnencia 
  557	Marco d'Itri 	md 
  558	Marcos Fouces 	marcos 
  559	Marcos Talau 	talau 
  560	Margarita Manterola 	marga 
  561	Mario Joussen 	joussen 
  562	Mark Brown 	broonie 
  563	Mark Eichin 	eichin 
  564	Mark Hindley 	leepen 
  565	Mark Hymers 	mhy 
  566	Mark Lee Garrett 	lee 
  567	Mark Purcell 	msp 
  568	Markus Frosch 	lazyfrosch 
  569	Markus Koschany 	apo 
  570	Markus Wanner 	markus 
  571	Martijn van Brummelen 	mvb 
  572	Martin 	debacle 
  573	Martin A. Godisch 	godisch 
  574	Martin Albert 	ma 
  575	Martin Bagge 	brother 
  576	Martin Buck 	mbuck 
  577	Martin F. Krafft 	madduck 
  578	Martin Loschwitz 	madkiss 
  579	Martin Meredith 	mez 
  580	Martin Michlmayr 	tbm 
  581	Martin Pitt 	mpitt 
  582	Martin Quinson 	mquinson 
  583	Martin Wuertele 	maxx 
  584	Martin Zobel-Helas 	zobel 
  585	Martina Ferrari 	tina 
  586	Masahito Omote 	omote 
  587	Masanori Goto 	gotom 
  588	Masayuki Hatta 	mhatta 
  589	Mathias Behrle 	mbehrle 
  590	Mathias Gibbens 	gibmat 
  591	Mathieu Malaterre 	malat 
  592	Mathieu Parent 	sathieu 
  593	Matt Taggart 	taggart 
  594	Matt Zimmerman 	mdz 
  595	Matteo F. Vescovi 	mfv 
  596	Matthew Brown 	mattb 
  597	Matthew Danish 	mrd 
  598	Matthew Garrett 	mjg59 
  599	Matthew Grant 	grantma 
  600	Matthew Palmer 	mpalmer 
  601	Matthew Vernon 	matthew 
  602	Matthias Klose 	doko 
  603	Matthias Klumpp 	mak 
  604	Matthias Urlichs 	smurf 
  605	Matthieu Caneill 	matthieucan 
  606	Mattia Dongili 	malattia 
  607	Mattia Rizzolo 	mattia 
  608	Mattias Ellert 	ellert 
  609	Mattias Nordstrom 	mnordstr 
  610	Mattias Wadenstein 	maswan 
  611	Max Vozeler 	xam 
  612	Maximilian Attems 	maks 
  613	Maximiliano Curia 	maxy 
  614	Mazen Neifer 	mazen 
  615	Mechtilde Stehmann 	mechtilde 
  616	Mehdi Dogguy 	mehdi 
  617	Miah Gregory 	mace 
  618	Micah Anderson 	micah 
  619	Micha Lenk 	micha 
  620	Michael Ablassmeier 	abi 
  621	Michael Banck 	mbanck 
  622	Michael Beattie 	mjb 
  623	Michael Biebl 	biebl 
  624	Michael Bramer 	grisu 
  625	Michael C. Schultheiss 	schultmc 
  626	Michael D. Mattice 	mattice 
  627	Michael Fladischer 	fladi 
  628	Michael Gilbert 	mgilbert 
  629	Michael Hanke 	mih 
  630	Michael Hudson-Doyle 	mwhudson 
  631	Michael Janssen 	jamuraa 
  632	Michael Jeanson 	mjeanson 
  633	Michael Lustfield 	mtecknology 
  634	Michael Meskes 	meskes 
  635	Michael Prokop 	mika 
  636	Michael Robin Crusoe 	crusoe 
  637	Michael Schmitz 	schmitz 
  638	Michael Schutte 	michi 
  639	Michael Stapelberg 	stapelberg 
  640	Michael Stone 	mstone 
  641	Michael Tautschnig 	mt 
  642	Michael Tokarev 	mjt 
  643	Michael Vogt 	mvo 
  644	Michal Arbet 	kevko 
  645	Michal Cihar 	nijel 
  646	Miguel Landaeta 	nomadium 
  647	Mikael Djurfeldt 	mdj 
  648	Mike Gabriel 	sunweaver 
  649	Mike Hommey 	glandium 
  650	Mike Markley 	madhack 
  651	Mike Miller 	mtmiller 
  652	Mikhail Gusarov 	dottedmag 
  653	Milan Kupcevic 	milan 
  654	Milan Zamazal 	pdm 
  655	Ming-ting Yao Wei 	mwei 
  656	Miquel van Smoorenburg 	miquels 
  657	Mirco Bauer 	meebey 
  658	Miriam Ruiz 	miriam 
  659	Mo Zhou 	lumin 
  660	Modestas Vainius 	modax 
  661	Mohammed Adnène Trojette 	adn 
  662	Mohammed Sameer 	msameer 
  663	Molly de Blanc 	mollydb 
  664	Moray Allan 	moray 
  665	Moritz Muehlenhoff 	jmm 
  666	Morten Werner Forsbring 	werner 
  667	Muammar El Khatib 	muammar 
  668	Murat Demirten 	murat 
  669	Mutsumi Ishikawa 	ishikawa 
  670	NIIBE Yutaka 	gniibe 
  671	Nathan Scott 	nathans 
  672	Nathaniel Harrison Handler 	nhandler 
  673	Nattie Mayer-Hutchings 	nattie 
  674	Neil A. Schemenauer 	nas 
  675	Neil L. Roeth 	neil 
  676	Neil McGovern 	neilm 
  677	Neil Williams 	codehelp 
  678	Neutron Soutmun 	neutrons 
  679	Nicholas Breen 	nbreen 
  680	Nicholas D Steeves 	sten 
  681	Nick Morrott 	nickm 
  682	Nick Phillips 	nwp 
  683	Nicolas Boulenguez 	nicolas 
  684	Nicolas Boullis 	nboullis 
  685	Nicolas Dandrimont 	olasd 
  686	Nicolas Mora 	babelouest 
  687	Niels Thykier 	nthykier 
  688	Niko Tyni 	ntyni 
  689	Nilesh Patra 	nilesh 
  690	Nils Boeffel 	lohner 
  691	Noah Meyerhans 	noahm 
  692	Nobuhiro Iwamatsu 	iwamatsu 
  693	Norbert Veber 	nveber 
  694	Noèl Köthe 	noel 
  695	Obey Arthur Liu 	arthurliu 
  696	Ognyan Kulev 	ogi 
  697	Ola Lundqvist 	opal 
  698	Ole Streicher 	olebole 
  699	Olek Wojnar 	olek 
  700	Olivier Sallou 	osallou 
  701	Olly Betts 	olly 
  702	Ondrej Sury 	ondrej 
  703	Ondřej Kobližek 	kobla 
  704	Ondřej Nový 	onovy 
  705	Ondřej Čertík 	certik 
  706	Osamu Aoki 	osamu 
  707	Otto Kekäläinen 	otto 
  708	Ove Kåven 	ovek 
  709	Pablo Lorenzzoni 	spectra 
  710	Paride Legovini 	paride 
  711	Patrick Franz 	deltaone 
  712	Patrick Matthäi 	pmatthaei 
  713	Patrick Ouellette 	pouelle 
  714	Patryk Cisek 	patryk 
  715	Patty Langasek 	harmoney 
  716	Paul Brossier 	piem 
  717	Paul Cannon 	pik 
  718	Paul Gevers 	elbrus 
  719	Paul Martin 	pm 
  720	Paul Slootman 	paul 
  721	Paul Tagliamonte 	paultag 
  722	Paul Waite 	paulwaite 
  723	Paul Wise 	pabs 
  724	Paul van Tilburg 	paulvt 
  725	Paulo Henrique de Lima Santana 	phls 
  726	Per Andersson 	avtobiff 
  727	Peter De Schrijver 	p2 
  728	Peter Eisentraut 	petere 
  729	Peter Kelemen 	fuji 
  730	Peter Michael Green 	plugwash 
  731	Peter Palfrader 	weasel 
  732	Peter Pentchev 	roam 
  733	Peter S. Galbraith 	psg 
  734	Peter Van Eynde 	pvaneynd 
  735	Petr Cech 	cech 
  736	Petter Reinholdtsen 	pere 
  737	Phil Brooke 	pjb 
  738	Phil Morrell 	emorrp1 
  739	Philip Hands 	philh 
  740	Philip Rinn 	rinni 
  741	Philipp Huebner 	debalance 
  742	Philipp Hug 	hug 
  743	Philipp Kern 	pkern 
  744	Philipp Matthias Hahn 	pmhahn 
  745	Philippe Thierry 	philou 
  746	Pierre Chifflier 	pollux 
  747	Pierre Gruet 	pgt 
  748	Pierre-Elliott Bécue 	peb 
  749	Pino Toscano 	pino 
  750	Piotr Ożarowski 	piotr 
  751	Piotr Roszatycki 	dexter 
  752	Prach Pongpanich 	prach 
  753	Praveen Arimbrathodiyil 	praveen 
  754	Punit Agrawal 	punit 
  755	RISKO Gergely 	risko 
  756	Radovan Garabik 	garabik 
  757	Rafael Laboissiere 	rafael 
  758	Ralf Treinen 	treinen 
  759	Raphael Bossek 	bossekr 
  760	Raphael Geissert 	geissert 
  761	Raphaël Hertzog 	hertzog 
  762	Raúl Benencia 	rul 
  763	Recai Oktas 	roktas 
  764	Reinhard Tartler 	siretart 
  765	Remi Vanicat 	vanicat 
  766	Rene Engelhard 	rene 
  767	Rene Mayorga 	rmayorga 
  768	Rene Weber 	rweber 
  769	Rhonda D'Vine 	rhonda 
  770	Ricardo Mones 	mones 
  771	Riccardo Setti 	giskard 
  772	Richard A. Nelson 	cowboy 
  773	Richard Hecker 	hecker 
  774	Richard Kreckel 	kreckel 
  775	Richard Laager 	rlaager 
  776	Richard Michael Hartmann 	richih 
  777	Ritesh Raj Sarraf 	rrs 
  778	Rob Browning 	rlb 
  779	Robert Alan Larson 	blarson 
  780	Robert Edmonds 	edmonds 
  781	Robert Haist 	rha 
  782	Robert Luberda 	robert 
  783	Robert Millan 	rmh 
  784	Robert Woodcock 	rcw 
  785	Roberto C. Sanchez 	roberto 
  786	Roberto Lumbreras 	rover 
  787	Robie Basak 	rbasak 
  788	Roger Shimizu 	rosh 
  789	Roland Dreier 	rbd 
  790	Roland Fehrenbacher 	rfehren 
  791	Roland Marcus Rutschmann 	rudi 
  792	Roland Mas 	lolando 
  793	Roland Rosenfeld 	roland 
  794	Romain Francoise 	rfrancoise 
  795	Ron Lee 	ron 
  796	Ross Burton 	ross 
  797	Ross Gammon 	rossgammon 
  798	Ross Peachey 	rcp 
  799	Ross Vandegrift 	rvandegrift 
  800	Ruben Undheim 	rubund 
  801	Russ Allbery 	rra 
  802	Russell Coker 	etbe 
  803	Russell Stuart 	ras 
  804	Ryan Kavanagh 	rak 
  805	Ryan M. Golbeck 	rmgolbeck 
  806	SZ Lin 	szlin 
  807	Sahil Dhiman 	sahil 
  808	Sakirnth Nagarasa 	sakirnth 
  809	Salvador Abreu 	spa 
  810	Salvatore Bonaccorso 	carnil 
  811	Sam Clegg 	samo 
  812	Sam Hartman 	hartmans 
  813	Sam Johnston 	samj 
  814	Samuel Henrique 	samueloph 
  815	Samuel Mimram 	smimram 
  816	Samuel Thibault 	sthibault 
  817	Sandro Knauß 	hefee 
  818	Sandro Tosi 	morph 
  819	Santiago Garcia Mantinan 	manty 
  820	Santiago Ruano Rincón 	santiago 
  821	Santiago Vila 	sanvila 
  822	Sascha Steinbiss 	satta 
  823	Scarlett Moore 	sgmoore 
  824	Scott Kitterman 	kitterman 
  825	Scott Sheridan Howard 	showard 
  826	Scott Talbert 	swt2c 
  827	Sean Whitton 	spwhitton 
  828	Sebastiaan Couwenberg 	sebastic 
  829	Sebastian Andrzej Siewior 	bigeasy 
  830	Sebastian Dröge 	slomo 
  831	Sebastian Harl 	tokkee 
  832	Sebastian Ramacher 	sramacher 
  833	Sebastian Reichel 	sre 
  834	Sebastian Rittau 	srittau 
  835	Sebastien Bacher 	seb128 
  836	Sebastien Badia 	sbadia 
  837	Sebastien Delafond 	seb 
  838	Serafeim Zanikolas 	sez 
  839	Sergei Golovan 	sgolovan 
  840	Sergio Durigan Junior 	sergiodj 
  841	Sergio Talens-Oliag 	sto 
  842	Shachar Shemesh 	shachar 
  843	Shane Wegner 	shane 
  844	Shaun Jackman 	sjackman 
  845	Shengjing Zhu 	zhsj 
  846	Shigeo Noshiro 	noshiro 
  847	Shih-Yuan Lee 	fourdollars 
  848	Siegfried-Angel Gevatter Pujals 	sgevatter 
  849	Simon Horman 	horms 
  850	Simon Josefsson 	jas 
  851	Simon Kelley 	srk 
  852	Simon McVittie 	smcv 
  853	Simon Quigley 	tsimonq2 
  854	Simon Richter 	sjr 
  855	Sjoerd Simons 	sjoerd 
  856	Sophie Brun 	sophieb 
  857	Sruthi Chandran 	srud 
  858	Stefan Alfredsson 	alfs 
  859	Stefan Fritsch 	sf 
  860	Stefan Hornburg 	racke 
  861	Stefano Rivera 	stefanor 
  862	Stefano Zacchiroli 	zack 
  863	Steffen Möller 	moeller 
  864	Stein Magnus Jodal 	jodal 
  865	Steinar H. Gunderson 	sesse 
  866	Stephan Lachnit 	stephanlachnit 
  867	Stephan Suerken 	absurd 
  868	Stephen Frost 	sfrost 
  869	Stephen Gelman 	ssgelm 
  870	Stephen Kitt 	skitt 
  871	Stephen Leake 	stephe 
  872	Steve Kemp 	skx 
  873	Steve Kostecke 	steve 
  874	Steve Kowalik 	stevenk 
  875	Steve Langasek 	vorlon 
  876	Steve McIntyre 	93sam 
  877	Steven Chamberlain 	stevenc 
  878	Steven Michael Robbins 	smr 
  879	Stig Sandbeck Mathisen 	ssm 
  880	Stuart Prescott 	stuart 
  881	Stéphane Blondon 	sblondon 
  882	Stéphane Glondu 	glondu 
  883	Sudip Mukherjee 	sudip 
  884	Sune Vuorela 	sune 
  885	Sven Bartscher 	kritzefitz 
  886	Sven Eckelmann 	ecsv 
  887	Sven Hoexter 	hoexter 
  888	Sven Mueller 	sven 
  889	Sylvain Beucler 	beuc 
  890	Sylvestre Ledru 	sylvestre 
  891	Sébastien Villemot 	sebastien 
  892	Takaki Taniguchi 	takaki 
  893	Takatsugu Nokubi 	knok 
  894	Takeshi YAEGASHI 	yaegashi 
  895	Taku Yasui 	tach 
  896	Takuo KITAME 	kitame 
  897	Tanguy Ortolo 	tanguy 
  898	Taowa 	taowa 
  899	Tatsuya Kinoshita 	tats 
  900	Teemu Hukkanen 	tjhukkan 
  901	Teruyuki Morimura 	morimura 
  902	Teus Benschop 	teusbenschop 
  903	Thaddeus H. Black 	thb 
  904	Thadeu Cascardo 	cascardo 
  905	Theodore Y. Ts'o 	tytso 
  906	Theppitak Karoonboonyanan 	thep 
  907	Thiago Andrade Marques 	andrade 
  908	Thibaut Jean-Claude Paumard 	thibaut 
  909	Thierry Randrianiriana 	thierry 
  910	Thijs Kinkhorst 	thijs 
  911	Thom May 	thom 
  912	Thomas Girard 	tgg 
  913	Thomas Goirand 	zigo 
  914	Thomas Lange 	lange 
  915	Thomas Preud'homme 	robotux 
  916	Thomas Schmidt 	tschmidt 
  917	Thomas Vincent 	tvincent 
  918	Thomas Wana 	greuff 
  919	Thomas Weber 	tweber 
  920	Thorsten Alteholz 	alteholz 
  921	Thorsten Glaser 	tg 
  922	Tiago Bortoletto Vaz 	tiago 
  923	Tianon Gravi 	tianon 
  924	Tim Cutts 	tjrc1 
  925	Tim Retout 	diocles 
  926	Tim Riker 	timr 
  927	Timo Aaltonen 	tjaalton 
  928	Timo Juhani Lindfors 	lindi 
  929	Timo Jyrinki 	timo 
  930	Timo Röhling 	roehling 
  931	Timo Weingärtner 	tiwe 
  932	Timothy Martin Potter 	tpot 
  933	Tino Didriksen 	tinodidriksen 
  934	Tobias Frost 	tobi 
  935	Tobias Grimm 	etobi 
  936	Tobias Hansen 	thansen 
  937	Tobias Quathamer 	toddy 
  938	Tollef Fog Heen 	tfheen 
  939	Tomas Fasth 	tomfa 
  940	Tomas Pospisek 	tpo 
  941	Tomasz Buchert 	tomasz 
  942	Tomasz Rybak 	serpent 
  943	Tommi Vainikainen 	tvainika 
  944	Toni Mueller 	toni 
  945	Tony Mancill 	tmancill 
  946	Torsten Landschoff 	torsten 
  947	Torsten Marek 	shlomme 
  948	Tristan Seligmann 	mithrandi 
  949	Troy Heber 	troyh 
  950	Tzafrir Cohen 	tzafrir 
  951	Tássia Camões Araújo 	tassia 
  952	Ulises Vitulli 	dererk 
  953	Ulrich Dangel 	uli 
  954	Unit 193 	unit193 
  955	Utkarsh Gupta 	utkarsh 
  956	Uwe Hermann 	uwe 
  957	Uwe Kleine-König 	ukleinek 
  958	Uwe Steinmann 	steinm 
  959	Vagrant Cascadian 	vagrant 
  960	Valentin Vidic 	vvidic 
  961	Varun Hiremath 	varun 
  962	Vasudev Sathish Kamath 	vasudev 
  963	Victor Seva 	vseva 
  964	Vincent Bernat 	bernat 
  965	Vincent Cheng 	vcheng 
  966	Vincent Danjean 	vdanjean 
  967	Vincent Legout 	vlegout 
  968	Vincent Prat 	vivi 
  969	Vincent Sanders 	vince 
  970	Wartan Hachaturow 	wart 
  971	Werner Heuser 	wehe 
  972	Wesley W. Terpstra 	terpstra 
  973	Will Newton 	will 
  974	Willi Mann 	willi 
  975	William Blough 	bblough 
  976	Wilmer van der Gaast 	lintux 
  977	Wookey 	wookey 
  978	Wouter Verhelst 	wouter 
  979	Xavier Lüthi 	xluthi 
  980	Xavier Roche 	xavier 
  981	Ximin Luo 	infinity0 
  982	Yadd 	yadd 
  983	Yann Dirson 	dirson 
  984	Yaroslav Halchenko 	yoh 
  985	Yasuhiro Araki 	ar 
  986	Ying-Chun Liu 	paulliu 
  987	Yukiharu Yabuki 	yyabuki 
  988	YunQiang Su 	syq 
  989	Yuuma Oohara 	oohara 
  990	Yves-Alexis Perez 	corsac 
  991	Zed Pobre 	zed 
  992	Zlatan Todoric 	zlatan 
  993	intrigeri 	intrigeri 
  994	nick black 	dank 
  995	nicoo 	nicoo 
  996	Étienne Mollier 	emollier 
