module github.com/jrhouston/tfk8s

go 1.19

require (
	github.com/spf13/pflag v1.0.3
	github.com/stretchr/testify v1.5.1
	github.com/zclconf/go-cty v1.8.0
	sigs.k8s.io/yaml v1.1.0
)

require (
	github.com/davecgh/go-spew v1.1.1 // indirect
	github.com/google/go-cmp v0.5.2 // indirect
	github.com/pmezard/go-difflib v1.0.0 // indirect
	golang.org/x/text v0.3.5 // indirect
	gopkg.in/check.v1 v1.0.0-20190902080502-41f04d3bba15 // indirect
	gopkg.in/yaml.v2 v2.2.8 // indirect
)
