<define-tag pagetitle>DLA-2398-1 puma</define-tag>
<define-tag report_date>2020-10-08</define-tag>
<define-tag secrefs>CVE-2020-11076 CVE-2020-11077</define-tag>
<define-tag packages>puma</define-tag>
<define-tag isvulnerable>yes</define-tag>
<define-tag fixed>yes</define-tag>
<define-tag fixed-section>no</define-tag>

#use wml::debian::security

