<define-tag pagetitle>DLA-2174-1 php-horde-data</define-tag>
<define-tag report_date>2020-04-14</define-tag>
<define-tag secrefs>CVE-2020-8518 Bug#951537</define-tag>
<define-tag packages>php-horde-data</define-tag>
<define-tag isvulnerable>yes</define-tag>
<define-tag fixed>yes</define-tag>
<define-tag fixed-section>no</define-tag>

#use wml::debian::security

