<define-tag pagetitle>DLA-2478-1 postgresql-9.6</define-tag>
<define-tag report_date>2020-12-02</define-tag>
<define-tag secrefs>CVE-2020-25694 CVE-2020-25695 CVE-2020-25696</define-tag>
<define-tag packages>postgresql-9.6</define-tag>
<define-tag isvulnerable>yes</define-tag>
<define-tag fixed>yes</define-tag>
<define-tag fixed-section>no</define-tag>

#use wml::debian::security

