<define-tag pagetitle>DLA-2610-1 linux-4.19</define-tag>
<define-tag report_date>2021-3-30</define-tag>
<define-tag secrefs>CVE-2020-27170 CVE-2020-27171 CVE-2021-3348 CVE-2021-3428 CVE-2021-26930 CVE-2021-26931 CVE-2021-26932 CVE-2021-2736 CVE-2021-27364 CVE-2021-27365 CVE-2021-28038 CVE-2021-28660 Bug#983595</define-tag>
<define-tag packages>linux-4.19</define-tag>
<define-tag isvulnerable>yes</define-tag>
<define-tag fixed>yes</define-tag>
<define-tag fixed-section>no</define-tag>

#use wml::debian::security

