<define-tag pagetitle>DSA-4463-1 znc</define-tag>
<define-tag report_date>2019-6-14</define-tag>
<define-tag secrefs>CVE-2019-9917 CVE-2019-12816 Bug#925285</define-tag>
<define-tag packages>znc</define-tag>
<define-tag isvulnerable>yes</define-tag>
<define-tag fixed>yes</define-tag>
<define-tag fixed-section>no</define-tag>

#use wml::debian::security



</dl>
