<define-tag pagetitle>DLA-1226-1 wireshark</define-tag>
<define-tag report_date>2017-12-31</define-tag>
<define-tag secrefs>CVE-2017-11408 CVE-2017-17083 CVE-2017-17084 CVE-2017-17085</define-tag>
<define-tag packages>wireshark</define-tag>
<define-tag isvulnerable>yes</define-tag>
<define-tag fixed>yes</define-tag>
<define-tag fixed-section>no</define-tag>

#use wml::debian::security

