<define-tag pagetitle>DLA-2004-1 389-ds-base</define-tag>
<define-tag report_date>2019-11-29</define-tag>
<define-tag secrefs>CVE-2019-14824 Bug#944150</define-tag>
<define-tag packages>389-ds-base</define-tag>
<define-tag isvulnerable>yes</define-tag>
<define-tag fixed>yes</define-tag>
<define-tag fixed-section>no</define-tag>

#use wml::debian::security

