<define-tag pagetitle>DLA-0009-1 lxml</define-tag>
<define-tag report_date>2014-6-26</define-tag>
<define-tag secrefs>CVE-2014-3146 Bug##746812</define-tag>
<define-tag packages>lxml</define-tag>
<define-tag isvulnerable>yes</define-tag>
<define-tag fixed>yes</define-tag>
<define-tag fixed-section>no</define-tag>

#use wml::debian::security

