releasing package bfs version 1.5-3

2 jobs for debian/sid in 3 minutes and 7 seconds (queued for 3 seconds)
Status Job ID Name Coverage
  Deploy
failed #278404
pages

00:03:07

failed #228872
pages

00:03:21

 
Name Stage Failure
failed
pages Deploy
make[1]: *** [Makefile:101: check] Error 1
make[1]: Leaving directory '/builds/lamby/pkg-bfs'
dh_auto_test: make -j1 check returned exit code 2
make: *** [debian/rules:6: build] Error 255
dpkg-buildpackage: error: debian/rules build subprocess returned exit status 2
debuild: fatal error at line 1182:
dpkg-buildpackage -us -uc -ui -i -I failed
gbp:error: 'debuild -i -I -uc -us' failed: it exited with 29
ERROR: Job failed: exit code 1