module zabbix.com

go 1.19

require (
	github.com/dustin/gomemcached v0.0.0-20160817010731-a2284a01c143
	github.com/fsnotify/fsnotify v1.4.9
	github.com/go-ldap/ldap v3.0.3+incompatible
	github.com/go-ole/go-ole v1.2.4
	github.com/go-sql-driver/mysql v1.5.0
	github.com/godbus/dbus v4.1.0+incompatible
	github.com/godror/godror v0.20.1
	github.com/jackc/pgx/v4 v4.18.3
	github.com/mattn/go-sqlite3 v1.14.8
	github.com/mediocregopher/radix/v3 v3.5.0
	github.com/memcachier/mc/v3 v3.0.1
	github.com/miekg/dns v1.1.43
	github.com/natefinch/npipe v0.0.0-20160621034901-c1b8fa8bdcce
	github.com/omeid/go-yarn v0.0.1
	golang.org/x/sys v0.26.0
	gopkg.in/mgo.v2 v2.0.0-20190816093944-a6b53ec6cb22
)

require (
	github.com/go-logfmt/logfmt v0.5.0 // indirect
	github.com/jackc/chunkreader/v2 v2.0.1 // indirect
	github.com/jackc/pgconn v1.14.3 // indirect
	github.com/jackc/pgio v1.0.0 // indirect
	github.com/jackc/pgpassfile v1.0.0 // indirect
	github.com/jackc/pgproto3/v2 v2.3.3 // indirect
	github.com/jackc/pgservicefile v0.0.0-20221227161230-091c0ba34f0a // indirect
	github.com/jackc/pgtype v1.14.0 // indirect
	github.com/jackc/puddle v1.3.0 // indirect
	github.com/pkg/errors v0.9.1 // indirect
	golang.org/x/crypto v0.28.0 // indirect
	golang.org/x/net v0.30.0 // indirect
	golang.org/x/text v0.19.0 // indirect
	golang.org/x/xerrors v0.0.0-20220907171357-04be3eba64a2 // indirect
	gopkg.in/asn1-ber.v1 v1.0.0-20181015200546-f715ec2f112d // indirect
	gopkg.in/natefinch/npipe.v2 v2.0.0-20160621034901-c1b8fa8bdcce // indirect
	gopkg.in/yaml.v2 v2.2.8 // indirect
)
