update debian changelog

5 jobs from debian/1.2.5-1_bpo9+1 in 2 minutes and 23 seconds (queued for 1 second)
latest
Status Job ID Name Coverage
  Build
failed #106560
build

00:02:23

 
  Test
skipped #106563
autopkgtest
skipped #106562
lintian
skipped #106564
piuparts
skipped #106561
reprotest
 
Name Stage Failure
failed
build Build
make[1]: *** [/usr/share/dh-lua/make/dh-lua.Makefile.multiple:12: build] Error 1
dh_auto_build: make --no-print-directory -f /usr/share/dh-lua/make/dh-lua.Makefile.multiple build returned exit code 2
make: *** [debian/rules:4: build] Error 2
dpkg-buildpackage: error: debian/rules build subprocess returned exit status 2
+ cleanup
+ docker rm -f 94ff4105d109c6b1434ee6947aa7fe416308160acc844caacb2514e71f91cbdc
94ff4105d109c6b1434ee6947aa7fe416308160acc844caacb2514e71f91cbdc
gbp:error: 'docker-build.sh registry.salsa.debian.org/salsa-ci-team/images/dockerbuilder:unstable' failed: it exited with 2
ERROR: Job failed: exit code 1