%!PS-Adobe-3.0 EPSF-3.0
%%Creator: cairo 1.15.12 (http://cairographics.org)
%%CreationDate: Sat Oct 20 15:33:32 2018
%%Pages: 1
%%DocumentData: Clean7Bit
%%LanguageLevel: 2
%%BoundingBox: 0 0 66 24
%%EndComments
%%BeginProlog
50 dict begin
/q { gsave } bind def
/Q { grestore } bind def
/cm { 6 array astore concat } bind def
/w { setlinewidth } bind def
/J { setlinecap } bind def
/j { setlinejoin } bind def
/M { setmiterlimit } bind def
/d { setdash } bind def
/m { moveto } bind def
/l { lineto } bind def
/c { curveto } bind def
/h { closepath } bind def
/re { exch dup neg 3 1 roll 5 3 roll moveto 0 rlineto
      0 exch rlineto 0 rlineto closepath } bind def
/S { stroke } bind def
/f { fill } bind def
/f* { eofill } bind def
/n { newpath } bind def
/W { clip } bind def
/W* { eoclip } bind def
/BT { } bind def
/ET { } bind def
/BDC { mark 3 1 roll /BDC pdfmark } bind def
/EMC { mark /EMC pdfmark } bind def
/cairo_store_point { /cairo_point_y exch def /cairo_point_x exch def } def
/Tj { show currentpoint cairo_store_point } bind def
/TJ {
  {
    dup
    type /stringtype eq
    { show } { -0.001 mul 0 cairo_font_matrix dtransform rmoveto } ifelse
  } forall
  currentpoint cairo_store_point
} bind def
/cairo_selectfont { cairo_font_matrix aload pop pop pop 0 0 6 array astore
    cairo_font exch selectfont cairo_point_x cairo_point_y moveto } bind def
/Tf { pop /cairo_font exch def /cairo_font_matrix where
      { pop cairo_selectfont } if } bind def
/Td { matrix translate cairo_font_matrix matrix concatmatrix dup
      /cairo_font_matrix exch def dup 4 get exch 5 get cairo_store_point
      /cairo_font where { pop cairo_selectfont } if } bind def
/Tm { 2 copy 8 2 roll 6 array astore /cairo_font_matrix exch def
      cairo_store_point /cairo_font where { pop cairo_selectfont } if } bind def
/g { setgray } bind def
/rg { setrgbcolor } bind def
/d1 { setcachedevice } bind def
/cairo_data_source {
  CairoDataIndex CairoData length lt
    { CairoData CairoDataIndex get /CairoDataIndex CairoDataIndex 1 add def }
    { () } ifelse
} def
/cairo_flush_ascii85_file { cairo_ascii85_file status { cairo_ascii85_file flushfile } if } def
/cairo_image { image cairo_flush_ascii85_file } def
/cairo_imagemask { imagemask cairo_flush_ascii85_file } def
%%EndProlog
%%BeginSetup
%%EndSetup
%%Page: 1 1
%%BeginPageSetup
%%PageBoundingBox: 0 0 66 24
%%EndPageSetup
q 0 0 66 24 rectclip
1 0 0 -1 0 24 cm q
0.658824 0.690196 0.670588 rg
1.727 0.281 m 64.074 0.395 l 64.941 0.395 65.723 0.266 65.723 2.141 c 65.645
 22.809 l 0.152 22.809 l 0.152 2.066 l 0.152 1.141 0.242 0.281 1.727 0.281
 c h
1.727 0.281 m f
0 g
64.766 0 m 1.238 0 l 0.555 0 0 0.559 0 1.242 c 0 22.969 l 0 23.125 0.125
 23.25 0.277 23.25 c 65.723 23.25 l 65.875 23.25 66 23.125 66 22.969 c 66
 1.242 l 66 0.559 65.445 0 64.766 0 c h
1.238 0.562 m 64.766 0.562 l 65.141 0.562 65.441 0.867 65.441 1.242 c 65.441
 1.242 65.441 10.016 65.441 16.344 c 19.887 16.344 l 18.223 19.371 15.02
 21.43 11.34 21.43 c 7.656 21.43 4.449 19.375 2.785 16.344 c 0.559 16.344
 l 0.559 10.016 0.559 1.242 0.559 1.242 c 0.559 0.867 0.863 0.562 1.238 
0.562 c h
1.238 0.562 m f
1 g
40.594 18.129 m 40.77 18.129 40.93 18.145 41.07 18.172 c 41.215 18.207 
41.336 18.254 41.438 18.324 c 41.539 18.395 41.621 18.488 41.676 18.605 
c 41.73 18.723 41.762 18.863 41.762 19.039 c 41.762 19.223 41.719 19.375
 41.633 19.496 c 41.551 19.621 41.43 19.723 41.266 19.801 c 41.492 19.867
 41.656 19.98 41.77 20.141 c 41.879 20.305 41.938 20.504 41.938 20.73 c 
41.938 20.914 41.902 21.078 41.828 21.211 c 41.758 21.348 41.66 21.457 41.539
 21.543 c 41.418 21.629 41.281 21.691 41.125 21.734 c 40.969 21.773 40.812
 21.793 40.648 21.793 c 38.879 21.793 l 38.879 18.129 l h
40.492 19.613 m 40.637 19.613 40.754 19.578 40.848 19.508 c 40.938 19.438
 40.984 19.332 40.984 19.176 c 40.984 19.09 40.969 19.02 40.938 18.969 c
 40.906 18.91 40.867 18.867 40.812 18.84 c 40.766 18.805 40.707 18.785 40.637
 18.773 c 40.574 18.762 40.504 18.758 40.434 18.758 c 39.68 18.758 l 39.68
 19.613 l h
40.539 21.168 m 40.617 21.168 40.695 21.16 40.766 21.145 c 40.836 21.129
 40.898 21.102 40.953 21.066 c 41.008 21.031 41.051 20.984 41.082 20.922
 c 41.117 20.859 41.133 20.781 41.133 20.684 c 41.133 20.496 41.082 20.363
 40.977 20.281 c 40.871 20.199 40.73 20.164 40.555 20.164 c 39.68 20.164
 l 39.68 21.168 l h
40.539 21.168 m f
42.078 18.129 m 42.977 18.129 l 43.828 19.578 l 44.676 18.129 l 45.57 18.129
 l 44.219 20.387 l 44.219 21.793 l 43.414 21.793 l 43.414 20.367 l h
42.078 18.129 m f
18.84 10.855 m 18.844 15.02 15.488 18.402 11.344 18.406 c 7.203 18.406 
3.844 15.031 3.84 10.863 c 3.84 10.859 3.84 10.859 3.84 10.855 c 3.84 6.688
 7.195 3.305 11.336 3.301 c 15.477 3.301 18.84 6.676 18.84 10.848 c 18.84
 10.848 18.84 10.852 18.84 10.855 c h
18.84 10.855 m f
0 g
17.438 4.707 m 19.098 6.383 19.93 8.43 19.93 10.855 c 19.93 13.277 19.113
 15.305 17.48 16.938 c 15.746 18.652 13.695 19.512 11.328 19.512 c 8.996
 19.512 6.98 18.66 5.289 16.957 c 3.594 15.254 2.75 13.219 2.75 10.855 c
 2.75 8.488 3.594 6.438 5.289 4.707 c 6.934 3.031 8.949 2.195 11.328 2.195
 c 13.738 2.195 15.773 3.031 17.438 4.707 c h
6.406 5.832 m 5 7.262 4.297 8.938 4.297 10.855 c 4.297 12.777 4.996 14.434
 6.383 15.836 c 7.777 17.234 9.434 17.938 11.355 17.938 c 13.277 17.938 
14.949 17.23 16.367 15.816 c 17.715 14.5 18.391 12.848 18.391 10.855 c 18.391
 8.879 17.703 7.203 16.336 5.82 c 14.965 4.441 13.309 3.754 11.355 3.754
 c 9.406 3.754 7.754 4.449 6.406 5.832 c h
10.109 10.012 m 9.891 9.539 9.57 9.305 9.141 9.305 c 8.383 9.305 8.004 
9.816 8.004 10.848 c 8.004 11.871 8.383 12.383 9.141 12.383 c 9.641 12.383
 10 12.137 10.215 11.633 c 11.266 12.195 l 10.766 13.094 10.016 13.543 9.012
 13.543 c 8.238 13.543 7.617 13.305 7.156 12.828 c 6.688 12.348 6.453 11.691
 6.453 10.855 c 6.453 10.027 6.695 9.375 7.176 8.891 c 7.656 8.41 8.254 
8.164 8.969 8.164 c 10.027 8.164 10.785 8.586 11.246 9.426 c h
15.051 10.012 m 14.836 9.539 14.52 9.305 14.105 9.305 c 13.332 9.305 12.945
 9.816 12.945 10.848 c 12.945 11.871 13.332 12.383 14.105 12.383 c 14.609
 12.383 14.961 12.137 15.16 11.633 c 16.234 12.195 l 15.734 13.094 14.984
 13.543 13.98 13.543 c 13.211 13.543 12.594 13.305 12.129 12.828 c 11.664
 12.348 11.434 11.691 11.434 10.855 c 11.434 10.027 11.668 9.375 12.137 
8.891 c 12.609 8.41 13.211 8.164 13.941 8.164 c 14.996 8.164 15.754 8.586
 16.211 9.426 c h
15.051 10.012 m f
1 g
47.855 8.422 m 47.855 11.707 45.207 14.367 41.949 14.367 c 38.684 14.367
 36.043 11.707 36.043 8.422 c 36.043 5.141 38.684 2.48 41.949 2.48 c 45.207
 2.48 47.855 5.141 47.855 8.422 c h
47.855 8.422 m f
0 g
43.656 6.703 m 43.656 6.477 43.473 6.289 43.246 6.289 c 40.637 6.289 l 
40.41 6.289 40.227 6.477 40.227 6.703 c 40.227 9.328 l 40.953 9.328 l 40.953
 12.441 l 42.93 12.441 l 42.93 9.328 l 43.656 9.328 l h
43.656 6.703 m f
42.832 5.047 m 42.832 5.539 42.434 5.945 41.941 5.945 c 41.445 5.945 41.047
 5.539 41.047 5.047 c 41.047 4.551 41.445 4.148 41.941 4.148 c 42.434 4.148
 42.832 4.551 42.832 5.047 c h
42.832 5.047 m f
41.934 1.875 m 40.168 1.875 38.668 2.496 37.445 3.734 c 36.191 5.02 35.562
 6.539 35.562 8.293 c 35.562 10.047 36.191 11.555 37.445 12.816 c 38.703
 14.082 40.199 14.711 41.934 14.711 c 43.688 14.711 45.211 14.074 46.496
 12.805 c 47.711 11.594 48.32 10.09 48.32 8.293 c 48.32 6.496 47.703 4.977
 46.469 3.734 c 45.23 2.496 43.719 1.875 41.934 1.875 c h
41.949 3.031 m 43.395 3.031 44.625 3.543 45.637 4.57 c 46.66 5.586 47.168
 6.828 47.168 8.293 c 47.168 9.77 46.668 10.996 45.668 11.969 c 44.613 13.016
 43.375 13.543 41.949 13.543 c 40.52 13.543 39.293 13.023 38.258 11.984 
c 37.227 10.945 36.711 9.715 36.711 8.293 c 36.711 6.871 37.234 5.629 38.277
 4.57 c 39.277 3.543 40.5 3.031 41.949 3.031 c h
41.949 3.031 m f*
Q Q
showpage
%%Trailer
end
%%EOF
