Last-Update: Fri, 14 Mar 2025 01:42:04 +0000

 Source                        | Vote   | Tasks                                      |                                 Tags                                 
-------------------------------+--------+--------------------------------------------+----------------------------------------------------------------------
 dicomscope                    |     25 | {imaging}                                  | 
 mrtrix3                       |     13 | {imaging}                                  | 
 orthanc-gdcm                  |     12 | {imaging}                                  | 
 pixelmed                      |     11 | {imaging}                                  | 
 sight                         |     11 | {imaging}                                  | 
 gnumed-server                 |     10 | {covid-19,practice}                        | 
 oscar                         |     10 | {data,practice,tools}                      | 
 orthanc-postgresql            |      9 | {imaging}                                  | 
 adun.app                      |      8 | {bio}                                      | 
 icb-utils                     |      8 | {bio-dev}                                  | 
 orthanc-mysql                 |      8 | {imaging}                                  | 
 jebl2                         |      7 | {bio-dev}                                  | 
 mia                           |      7 | {imaging}                                  | 
 bart-view                     |      6 | {imaging}                                  | 
 biojava-live                  |      6 | {bio-dev}                                  | 
 libminc                       |      6 | {imaging-dev}                              | 
 heudiconv                     |      5 | {imaging}                                  | 
 king                          |      5 | {typesetting,imaging}                      | 
 biojava6-live                 |      4 | {bio-dev}                                  | 
 getdata                       |      3 | {bio}                                      | 
 piler                         |      3 | {bio}                                      | 
 plasmidid                     |      3 | {covid-19,bio}                             | 
 staden                        |      3 | {bio}                                      | 
 ants                          |      2 | {imaging}                                  | 
 bio-tradis                    |      2 | {bio,bio-dev}                              | 
 cufflinks                     |      2 | {cloud,bio}                                | 
 elastix                       |      2 | {imaging}                                  | 
 embassy-domainatrix           |      2 | {cloud,bio}                                | 
 libdivsufsort                 |      2 | {bio-dev}                                  | 
 librg-utils-perl              |      2 | {bio}                                      | 
 melting                       |      2 | {cloud,bio}                                | 
 mhap                          |      2 | {bio,bio-ngs}                              | 
 phyutility                    |      2 | {cloud,bio}                                | 
 plasmidseeker                 |      2 | {bio}                                      | 
 proalign                      |      2 | {bio-phylogeny,bio}                        | 
 pscan-chip                    |      2 | {bio}                                      | 
 rtax                          |      2 | {cloud,bio}                                | 
 sprai                         |      2 | {bio}                                      | 
 spread-phy                    |      2 | {bio-phylogeny,bio}                        | 
 tophat-recondition            |      2 | {bio,covid-19}                             | 
 treeview                      |      2 | {bio-phylogeny,bio}                        | 
 vienna-rna                    |      2 | {bio,covid-19}                             | 
 anfo                          |      1 | {bio,cloud}                                | 
 beast-mcmc                    |      1 | {bio,bio-phylogeny}                        | 
 bitseq                        |      1 | {bio}                                      | 
 brig                          |      1 | {bio}                                      | 
 cmtk                          |      1 | {imaging}                                  | 
 dextractor                    |      1 | {bio,covid-19}                             | 
 embassy-domalign              |      1 | {bio,cloud}                                | 
 embassy-domsearch             |      1 | {cloud,bio}                                | 
 fastml                        |      1 | {bio}                                      | 
 hinge                         |      1 | {bio}                                      | 
 insighttoolkit5               |      1 | {imaging-dev}                              | 
 ipig                          |      1 | {bio}                                      | 
 jmodeltest                    |      1 | {bio,bio-phylogeny}                        | 
 kmerresistance                |      1 | {bio}                                      | 
 lamarc                        |      1 | {bio}                                      | 
 libctapimkt                   |      1 | {practice}                                 | 
 libgenome                     |      1 | {bio-dev}                                  | 
 libpal-java                   |      1 | {bio-dev}                                  | 
 librdp-taxonomy-tree-java     |      1 | {bio-dev}                                  | 
 mauve-aligner                 |      1 | {bio}                                      | 
 metaphlan                     |      1 | {bio}                                      | 
 pigx-rnaseq                   |      1 | {covid-19,bio}                             | 
 placnet                       |      1 | {bio}                                      | 
 python-seqcluster             |      1 | {covid-19,bio-dev}                         | 
 qcumber                       |      1 | {bio}                                      | 
 rambo-k                       |      1 | {bio}                                      | 
 rdp-alignment                 |      1 | {bio}                                      | 
 rdp-classifier                |      1 | {bio}                                      | 
 runcircos-gui                 |      1 | {bio}                                      | 
 saint                         |      1 | {bio}                                      | 
 seq-gen                       |      1 | {bio}                                      | 
 sga                           |      1 | {bio}                                      | 
 sibsim4                       |      1 | {cloud,bio}                                | 
 sight                         |      1 | {imaging}                                  | 
 soapaligner                   |      1 | {bio}                                      | 
 soapsnp                       |      1 | {bio}                                      | 
 suitename                     |      1 | {bio}                                      | 
 surankco                      |      1 | {bio}                                      | 
 thesias                       |      1 | {bio,covid-19}                             | 
 tracetuner                    |      1 | {bio}                                      | 
 varscan                       |      1 | {covid-19,bio}                             | 
 acedb                         |      0 | {cloud,bio}                                | 
 bambamc                       |      0 | {bio-dev}                                  | 
 biojava4-live                 |      0 | {bio-dev}                                  | 
 biosyntax                     |      0 | {bio}                                      | 
 blimps                        |      0 | {bio}                                      | 
 btllib                        |      0 | {bio-dev}                                  | 
 btllib                        |      0 | {bio}                                      | 
 camp                          |      0 | {imaging-dev}                              | 
 capsule-maven-nextflow        |      0 | {bio-dev}                                  | 
 ctffind                       |      0 | {bio}                                      | 
 ctn                           |      0 | {imaging-dev}                              | 
 eegdev                        |      0 | {imaging-dev}                              | 
 emboss-explorer               |      0 | {bio}                                      | 
 fis-gtm                       |      0 | {his}                                      | 
 gatk-bwamem                   |      0 | {bio-dev}                                  | 
 gatk-fermilite                |      0 | {bio-dev}                                  | 
 htscodecs                     |      0 | {bio-dev,covid-19}                         | 
 libbio-mage-utils-perl        |      0 | {bio-dev}                                  | 
 libbioparser-dev              |      0 | {bio-dev}                                  | 
 libbiosoup-dev                |      0 | {bio-dev}                                  | 
 libbpp-core                   |      0 | {bio-dev}                                  | 
 libbpp-phyl                   |      0 | {bio-dev}                                  | 
 libbpp-phyl-omics             |      0 | {bio-dev}                                  | 
 libbpp-popgen                 |      0 | {bio-dev}                                  | 
 libbpp-raa                    |      0 | {bio-dev}                                  | 
 libbpp-seq                    |      0 | {bio-dev}                                  | 
 libbpp-seq-omics              |      0 | {bio-dev}                                  | 
 libchado-perl                 |      0 | {bio-dev}                                  | 
 libgkarrays                   |      0 | {bio-dev}                                  | 
 libhmsbeagle                  |      0 | {bio-dev}                                  | 
 libics                        |      0 | {covid-19,imaging-dev}                     | 
 libjloda-java                 |      0 | {bio-dev}                                  | 
 libmaus2                      |      0 | {covid-19,bio-dev}                         | 
 libmems                       |      0 | {bio-dev}                                  | 
 libmialm                      |      0 | {imaging-dev}                              | 
 libmuscle                     |      0 | {bio-dev}                                  | 
 libpsortb                     |      0 | {bio-dev}                                  | 
 libqes                        |      0 | {bio-dev}                                  | 
 libseqlib                     |      0 | {bio-dev}                                  | 
 libstatgen                    |      0 | {bio-dev}                                  | 
 libvbz-hdf-plugin             |      0 | {bio-dev}                                  | 
 libvistaio                    |      0 | {imaging-dev}                              | 
 libwfa2                       |      0 | {bio-dev}                                  | 
 libxdf                        |      0 | {imaging-dev}                              | 
 malt                          |      0 | {bio}                                      | 
 maxflow                       |      0 | {imaging-dev}                              | 
 megan-ce                      |      0 | {bio}                                      | 
 metastudent-data              |      0 | {bio}                                      | 
 metastudent-data-2            |      0 | {bio}                                      | 
 mia                           |      0 | {imaging-dev}                              | 
 milib                         |      0 | {covid-19,bio-dev}                         | 
 mssstest                      |      0 | {tools}                                    | 
 ncbi-vdb                      |      0 | {bio-dev}                                  | 
 opencfu                       |      0 | {laboratory}                               | 
 orthanc-imagej                |      0 | {imaging}                                  | 
 papyrus                       |      0 | {imaging-dev}                              | 
 pbcopper                      |      0 | {bio-dev}                                  | 
 pbseqlib                      |      0 | {bio-dev}                                  | 
 provean                       |      0 | {bio}                                      | 
 pymia                         |      0 | {imaging-dev}                              | 
 python-cgelib                 |      0 | {bio-dev}                                  | 
 python-seqcluster             |      0 | {bio}                                      | 
 resfinder-db                  |      0 | {bio}                                      | 
 savvy                         |      0 | {bio}                                      | 
 savvy                         |      0 | {bio-dev}                                  | 
 sbmltoolbox                   |      0 | {bio-dev}                                  | 
 sift                          |      0 | {bio}                                      | 
 sight                         |      0 | {imaging-dev}                              | 
 skesa                         |      0 | {bio}                                      | 
 smrtanalysis                  |      0 | {covid-19,bio}                             | 
 srf                           |      0 | {bio-dev}                                  | 
 surpyvor                      |      0 | {bio}                                      | 
 trace2dbest                   |      0 | {bio}                                      | 
 xdffileio                     |      0 | {imaging-dev}                              | 
 xxsds-dynamic                 |      0 | {bio-dev}                                  | 
 tipp                          |     -1 | {covid-19,bio}                             | 
(185 rows)

