Last-Update: Wed, 12 Mar 2025 01:42:04 +0000

     Source                             | Vote   |                          Tags                          
----------------------------------------+--------+--------------------------------------------------------
 fail2ban                               |  24510 | 
 mpmath                                 |   9545 | 
 python-repoze.lru                      |   6883 | 
 netifaces                              |   5015 | 
 ghp-import                             |   4714 | 
 python-lunr                            |   4709 | 
 python-babel                           |   4254 | 
 python-babel                           |   3729 | 
 sortedcontainers                       |   3581 | 
 aiosignal                              |   2797 | 
 hyperlink                              |   2343 | 
 python-notify2                         |   1957 | 
 humanfriendly                          |   1792 | 
 python-invoke                          |   1534 | 
 python-mysqldb                         |   1465 | 
 python-pandocfilters                   |   1440 | 
 python-hpack                           |   1422 | 
 python-hyperframe                      |   1421 | 
 websocket-client                       |   1376 | 
 python-gssapi                          |   1239 | 
 python-rsa                             |   1116 | 
 pdfarranger                            |   1048 | 
 referencing                            |    977 | 
 menulibre                              |    954 | 
 python-webob                           |    904 | 
 python-levenshtein                     |    885 | 
 python-linux-procfs                    |    879 | 
 autopep8                               |    864 | 
 python-geoip                           |    861 | 
 firmware-microbit-micropython          |    768 | 
 kazam                                  |    768 | 
 powerline                              |    737 | 
 pytoolconfig                           |    729 | 
 powerline                              |    723 | 
 powerline                              |    711 | 
 u-msgpack-python                       |    597 | 
 dockerpty                              |    585 | 
 gaupol                                 |    573 | 
 python-et-xmlfile                      |    527 | 
 asn1crypto                             |    518 | 
 python-gevent                          |    516 | 
 catfish                                |    458 | 
 python-ewmh                            |    430 | 
 python-toml                            |    412 | 
 python-requests-oauthlib               |    397 | 
 python-ntlm-auth                       |    354 | 
 spf-engine                             |    341 | 
 pypdf2                                 |    297 | 
 spf-engine                             |    285 | 
 django-stronghold                      |    228 | 
 python-ldap3                           |    227 | 
 cairocffi                              |    206 | 
 helpdev                                |    195 | 
 python-smmap                           |    194 | 
 python-mimeparse                       |    187 | 
 mypaint                                |    176 | 
 python-hidapi                          |    173 | 
 yq                                     |    168 | 
 python-anyjson                         |    152 | 
 httpie                                 |    144 | 
 autokey                                |    143 | 
 smem                                   |    136 | 
 kivy                                   |    130 | 
 python-aiostream                       |    127 | 
 python-click-repl                      |    122 | 
 mugshot                                |    117 | 
 smartypants                            |    113 | 
 pacparser                              |    107 | 
 nodeenv                                |    102 | 
 python-consul                          |    102 | 
 pymacaroons                            |    100 | 
 lollypop                               |     99 | 
 pymediainfo                            |     92 | 
 timekpr-next                           |     91 | 
 python-colour                          |     87 | 
 pssh                                   |     82 | 
 python-pyu2f                           |     82 | 
 python-rfc6555                         |     81 | 
 pywavelets                             |     75 | 
 pymacs                                 |     71 | 
 python-pykka                           |     71 | 
 mitmproxy                              |     68 | 
 numpy-stl                              |     68 | 
 python-i3ipc                           |     67 | 
 itstool                                |     60 | 
 python-uritools                        |     60 | 
 fabric                                 |     57 | 
 python-libusb1                         |     55 | 
 ueberzug                               |     55 | 
 python-pysol-cards                     |     53 | 
 blockdiag                              |     52 | 
 hatchling                              |     52 | 
 trac                                   |     50 | 
 weasyprint                             |     50 | 
 show-in-file-manager                   |     49 | 
 python-scp                             |     46 | 
 khard                                  |     44 | 
 certipy                                |     43 | 
 pamela                                 |     43 | 
 pdfposter                              |     43 | 
 python-stdnum                          |     42 | 
 jupyterhub                             |     41 | 
 sshtunnel                              |     41 | 
 powerline-gitstatus                    |     39 | 
 pylibmc                                |     38 | 
 persepolis                             |     35 | 
 membernator                            |     34 | 
 python-scrypt                          |     34 | 
 seqdiag                                |     34 | 
 pyquery                                |     33 | 
 sphinxcontrib-blockdiag                |     32 | 
 sphinxcontrib-seqdiag                  |     31 | 
 python-fire                            |     30 | 
 pssh                                   |     29 | 
 kivy                                   |     28 | 
 dkimpy-milter                          |     27 | 
 python-args                            |     26 | 
 python-statsd                          |     26 | 
 depthcharge-tools                      |     25 | 
 webpy                                  |     25 | 
 rst2pdf                                |     24 | 
 mistune0                               |     23 | 
 nwdiag                                 |     23 | 
 python-clint                           |     23 | 
 actdiag                                |     22 | 
 enzyme                                 |     22 | 
 python-demjson                         |     22 | 
 elasticsearch-curator                  |     21 | 
 python-rangehttpserver                 |     21 | 
 python-sdnotify                        |     20 | 
 txt2tags                               |     20 | 
 alot                                   |     19 | 
 cppman                                 |     19 | 
 python-dbussy                          |     19 | 
 python-looseversion                    |     19 | 
 sphinxcontrib-actdiag                  |     19 | 
 python-simpy                           |     18 | 
 sphinxcontrib-nwdiag                   |     18 | 
 subliminal                             |     18 | 
 backoff                                |     17 | 
 python-kyotocabinet                    |     17 | 
 sphinxcontrib-log-cabinet              |     17 | 
 video-downloader                       |     17 | 
 flask-principal                        |     16 | 
 pwntools                               |     16 | 
 spf-engine                             |     16 | 
 typogrify                              |     16 | 
 django-environ                         |     15 | 
 python-ethtool                         |     15 | 
 python-pyscss                          |     15 | 
 python-xtermcolor                      |     15 | 
 sphinx-inline-tabs                     |     15 | 
 ansi                                   |     14 | 
 easyprocess                            |     14 | 
 fabric                                 |     14 | 
 python-translationstring               |     14 | 
 ruff                                   |     14 | 
 autotiling                             |     13 | 
 beancount                              |     13 | 
 notebook-shim                          |     13 | 
 policyd-rate-limit                     |     13 | 
 pyp                                    |     13 | 
 python-zstd                            |     13 | 
 social-auth-core                       |     13 | 
 subliminal                             |     13 | 
 unearth                                |     13 | 
 webtest                                |     13 | 
 btchip-python                          |     12 | 
 pykwalify                              |     12 | 
 python-inotify                         |     12 | 
 python-pem                             |     12 | 
 python-pyalsa                          |     12 | 
 python-pyrss2gen                       |     12 | 
 slimit                                 |     12 | 
 python-hupper                          |     11 | 
 python-priority                        |     11 | 
 todoman                                |     11 | 
 beancount                              |     10 | 
 flask-security                         |     10 | 
 gmplot                                 |     10 | 
 pylint-common                          |     10 | 
 python-versioneer                      |     10 | 
 elasticsearch-curator                  |      9 | 
 htmlmin                                |      9 | 
 jschema-to-python                      |      9 | 
 junos-eznc                             |      9 | 
 mercurial-evolve                       |      9 | 
 nwg-displays                           |      9 | 
 pdm                                    |      9 | 
 python-digitalocean                    |      9 | 
 python-mastodon                        |      9 | 
 python-pysubs2                         |      9 | 
 python-sarif-python-om                 |      9 | 
 trac-wysiwyg                           |      9 | 
 traittypes                             |      9 | 
 clustershell                           |      8 | 
 debiancontributors                     |      8 | 
 gtextfsm                               |      8 | 
 mypy-protobuf                          |      8 | 
 pybik                                  |      8 | 
 pytest-runner                          |      8 | 
 python-crcelk                          |      8 | 
 python-pyld                            |      8 | 
 speaklater                             |      8 | 
 syllabipy                              |      8 | 
 django-sass                            |      7 | 
 flask-session                          |      7 | 
 httpcode                               |      7 | 
 python-openstep-plist                  |      7 | 
 django-auditlog                        |      6 | 
 drf-extensions                         |      6 | 
 flake8-black                           |      6 | 
 flask-paranoid                         |      6 | 
 hachoir                                |      6 | 
 micropython-mpremote                   |      6 | 
 pydrive2                               |      6 | 
 pytest-django                          |      6 | 
 python-aiohttp-security                |      6 | 
 python-ansicolors                      |      6 | 
 python-halo                            |      6 | 
 python-overpy                          |      6 | 
 python-pyaml-env                       |      6 | 
 tuna                                   |      6 | 
 django-model-utils                     |      5 | 
 drf-yasg-nonfree                       |      5 | 
 imap-tools                             |      5 | 
 logilab-constraint                     |      5 | 
 numpy-stl                              |      5 | 
 pycallgraph                            |      5 | 
 pyfltk                                 |      5 | 
 pyjokes                                |      5 | 
 pytaglib                               |      5 | 
 python-drf-spectacular-sidecar-nonfree |      5 | 
 python-dynaconf                        |      5 | 
 python-envs                            |      5 | 
 python-numpysane                       |      5 | 
 python-parse-type                      |      5 | 
 python-simpy                           |      5 | 
 s3ql                                   |      5 | 
 securestring                           |      5 | 
 sphinx-intl                            |      5 | 
 utidylib                               |      5 | 
 azote                                  |      4 | 
 clustershell                           |      4 | 
 cram                                   |      4 | 
 django-jinja                           |      4 | 
 django-paintstore                      |      4 | 
 drf-haystack                           |      4 | 
 extension-helpers                      |      4 | 
 flask-mongoengine                      |      4 | 
 graphql-relay                          |      4 | 
 htmlmin                                |      4 | 
 kconfiglib                             |      4 | 
 librouteros                            |      4 | 
 pyjokes                                |      4 | 
 pynliner                               |      4 | 
 pyrad                                  |      4 | 
 python-cookies                         |      4 | 
 python-dbus-next                       |      4 | 
 python-pgmagick                        |      4 | 
 python-srp                             |      4 | 
 python-text-unidecode                  |      4 | 
 redis-py-cluster                       |      4 | 
 ruff                                   |      4 | 
 sorl-thumbnail                         |      4 | 
 trac-accountmanager                    |      4 | 
 voltron                                |      4 | 
 bootstrap-flask                        |      3 | 
 django-cachalot                        |      3 | 
 django-cacheops                        |      3 | 
 django-celery-email                    |      3 | 
 django-pglocks                         |      3 | 
 django-render-block                    |      3 | 
 django-templated-email                 |      3 | 
 dotdrop                                |      3 | 
 enlighten                              |      3 | 
 etm                                    |      3 | 
 flask-api                              |      3 | 
 flufl.testing                          |      3 | 
 karabo-bridge                          |      3 | 
 nbclassic                              |      3 | 
 omgifol                                |      3 | 
 onetimepass                            |      3 | 
 orsopy                                 |      3 | 
 pqconnect                              |      3 | 
 pyroma                                 |      3 | 
 python-biplist                         |      3 | 
 python-bitbucket-api                   |      3 | 
 python-deepmerge                       |      3 | 
 python-dirq                            |      3 | 
 python-django-push-notifications       |      3 | 
 python-django-registration             |      3 | 
 python-funcy                           |      3 | 
 python-libguess                        |      3 | 
 python-netfilterqueue                  |      3 | 
 python-networkmanager                  |      3 | 
 python-noise                           |      3 | 
 python-xdo                             |      3 | 
 requests-aws                           |      3 | 
 sphinxcontrib-globalsubs               |      3 | 
 sphinx-paramlinks                      |      3 | 
 sphinxtesters                          |      3 | 
 testrepository                         |      3 | 
 trac-xmlrpc                            |      3 | 
 zabbix-cli                             |      3 | 
 zzzeeksphinx                           |      3 | 
 aiomysql                               |      2 | 
 backupchecker                          |      2 | 
 bqplot                                 |      2 | 
 brebis                                 |      2 | 
 django-any-js                          |      2 | 
 django-bitfield                        |      2 | 
 django-ckeditor                        |      2 | 
 django-cleanup                         |      2 | 
 django-graphene                        |      2 | 
 django-js-reverse                      |      2 | 
 django-macaddress                      |      2 | 
 django-maintenance-mode                |      2 | 
 django-pagination                      |      2 | 
 django-redis-sessions                  |      2 | 
 django-simple-redis-admin              |      2 | 
 django-xmlrpc                          |      2 | 
 django-yarnpkg                         |      2 | 
 flask-flatpages                        |      2 | 
 flask-paginate                         |      2 | 
 gtkman                                 |      2 | 
 jpylyzer                               |      2 | 
 namecheap                              |      2 | 
 okasha                                 |      2 | 
 pacparser                              |      2 | 
 panoramisk                             |      2 | 
 pqconnect                              |      2 | 
 proglog                                |      2 | 
 pyclamd                                |      2 | 
 pycrc                                  |      2 | 
 pyjunitxml                             |      2 | 
 pykwalify                              |      2 | 
 python3-onelogin-saml2                 |      2 | 
 python-commentjson                     |      2 | 
 python-django-casclient                |      2 | 
 python-django-contact-form             |      2 | 
 python-gnuplotlib                      |      2 | 
 python-ipfix                           |      2 | 
 python-jpype                           |      2 | 
 python-markuppy                        |      2 | 
 python-openshift                       |      2 | 
 python-opentracing                     |      2 | 
 python-py-zipkin                       |      2 | 
 python-qtpynodeeditor                  |      2 | 
 python-securesystemslib                |      2 | 
 python-webdavclient                    |      2 | 
 slimit                                 |      2 | 
 sphinx-autorun                         |      2 | 
 sphinx-markdown-tables                 |      2 | 
 sphinx-sitemap                         |      2 | 
 trac-subcomponents                     |      2 | 
 wikitrans                              |      2 | 
 apkinspector                           |      1 | 
 celery-progress                        |      1 | 
 django-select2                         |      1 | 
 errbot                                 |      1 | 
 glyphspkg                              |      1 | 
 hypothesis-auto                        |      1 | 
 jsonrpclib-pelix                       |      1 | 
 korean-lunar-calendar                  |      1 | 
 libthumbor                             |      1 | 
 mbed-test-wrapper                      |      1 | 
 mkdocs-macros-plugin                   |      1 | 
 myst-nb                                |      1 | 
 polyline                               |      1 | 
 power                                  |      1 | 
 pylint-celery                          |      1 | 
 pyment                                 |      1 | 
 pypass                                 |      1 | 
 pyprind                                |      1 | 
 pytest-expect                          |      1 | 
 python-aio-pika                        |      1 | 
 python-banal                           |      1 | 
 python-broadlink                       |      1 | 
 python-btrees                          |      1 | 
 python-chartkick                       |      1 | 
 python-dataset                         |      1 | 
 python-dnsq                            |      1 | 
 python-ephemeral-port-reserve          |      1 | 
 python-flask-seeder                    |      1 | 
 python-fluent-logger                   |      1 | 
 python-getdns                          |      1 | 
 python-gfloat                          |      1 | 
 python-gpsoauth                        |      1 | 
 python-kanboard                        |      1 | 
 python-netfilter                       |      1 | 
 python-openid-cla                      |      1 | 
 python-persist-queue                   |      1 | 
 python-pyout                           |      1 | 
 python-rdflib-endpoint                 |      1 | 
 python-schedutils                      |      1 | 
 python-sphinx-examples                 |      1 | 
 python-undetected-chromedriver         |      1 | 
 python-urlobject                       |      1 | 
 python-vega-datasets                   |      1 | 
 python-yubiotp                         |      1 | 
 python-zc.customdoctests               |      1 | 
 pytkdocs                               |      1 | 
 quark-sphinx-theme                     |      1 | 
 smem                                   |      1 | 
 sphinxcontrib-github-alt               |      1 | 
 trac-customfieldadmin                  |      1 | 
 trac-httpauth                          |      1 | 
 trac-wikiprint                         |      1 | 
 vcversioner                            |      1 | 
 vf1                                    |      1 | 
 vrfydmn                                |      1 | 
 wchartype                              |      1 | 
 wikitrans                              |      1 | 
 yotta                                  |      1 | 
 zlmdb                                  |      1 | 
 aioairzone                             |      0 | 
 aioaseko                               |      0 | 
 aioeagle                               |      0 | 
 aiomysql                               |      0 | 
 aiotask-context                        |      0 | 
 alot                                   |      0 | 
 aptly-api-client                       |      0 | 
 beangrow                               |      0 | 
 beangulp                               |      0 | 
 beanprice                              |      0 | 
 beanquery                              |      0 | 
 bootstrap-flask                        |      0 | 
 cairocffi                              |      0 | 
 celery-haystack-ng                     |      0 | 
 codicefiscale                          |      0 | 
 colorthief                             |      0 | 
 concurrent-log-handler                 |      0 | 
 cplay-ng                               |      0 | 
 customidenticon                        |      0 | 
 django-ajax-selects                    |      0 | 
 django-dynamic-preferences             |      0 | 
 django-favicon-plus-reloaded           |      0 | 
 django-graphene                        |      0 | 
 django-haystack-redis                  |      0 | 
 django-menu-generator-ng               |      0 | 
 django-model-utils                     |      0 | 
 django-otp-yubikey                     |      0 | 
 django-titofisto                       |      0 | 
 django-widget-tweaks                   |      0 | 
 drafthorse                             |      0 | 
 drf-yasg-nonfree                       |      0 | 
 elasticsearch-curator                  |      0 | 
 enlighten                              |      0 | 
 escapism                               |      0 | 
 faadelays                              |      0 | 
 fava                                   |      0 | 
 firmware-microbit-micropython          |      0 | 
 fivem-api                              |      0 | 
 flake8-pytest                          |      0 | 
 flask-flatpages                        |      0 | 
 flask-multistatic                      |      0 | 
 flask-paginate                         |      0 | 
 flask-security                         |      0 | 
 flask-session                          |      0 | 
 frozen-flask                           |      0 | 
 fypp                                   |      0 | 
 gdown                                  |      0 | 
 gitlike-commands                       |      0 | 
 grequests                              |      0 | 
 hatch-jupyter-builder                  |      0 | 
 httpie-aws-authv4                      |      0 | 
 humanfriendly                          |      0 | 
 jpy                                    |      0 | 
 jpylyzer                               |      0 | 
 jupyter-sphinx                         |      0 | 
 kivy                                   |      0 | 
 milksnake                              |      0 | 
 mpmath                                 |      0 | 
 mssql-django                           |      0 | 
 mwoauth                                |      0 | 
 mypaint                                |      0 | 
 nbgitpuller                            |      0 | 
 okasha                                 |      0 | 
 open-garage                            |      0 | 
 pacparser                              |      0 | 
 panoramisk                             |      0 | 
 parsimonious                           |      0 | 
 portio                                 |      0 | 
 powerline                              |      0 | 
 powerline-gitstatus                    |      0 | 
 prospector                             |      0 | 
 psrecord                               |      0 | 
 purl                                   |      0 | 
 pwntools                               |      0 | 
 pyatag                                 |      0 | 
 pydataverse                            |      0 | 
 pydenticon                             |      0 | 
 pydle                                  |      0 | 
 pyeverlights                           |      0 | 
 pyfg                                   |      0 | 
 pyfltk                                 |      0 | 
 pyina                                  |      0 | 
 pykmtronic                             |      0 | 
 pylibmc                                |      0 | 
 pymediainfo                            |      0 | 
 pyment                                 |      0 | 
 pynag                                  |      0 | 
 pysequoia                              |      0 | 
 pyssim                                 |      0 | 
 python3-simpleobsws                    |      0 | 
 python-aiohttp-security                |      0 | 
 python-aioinflux                       |      0 | 
 python-aio-pika                        |      0 | 
 python-asv-bench-memray                |      0 | 
 python-babel                           |      0 | 
 python-betterproto                     |      0 | 
 python-bottle-beaker                   |      0 | 
 python-bottle-cork                     |      0 | 
 python-bottle-sqlite                   |      0 | 
 python-briefcase                       |      0 | 
 python-brother-ql                      |      0 | 
 python-btrees                          |      0 | 
 python-calendarweek                    |      0 | 
 python-calendra                        |      0 | 
 python-certstream                      |      0 | 
 python-chocolate                       |      0 | 
 python-cogapp                          |      0 | 
 python-digitalocean                    |      0 | 
 python-django-casclient                |      0 | 
 python-django-contact-form             |      0 | 
 python-django-registration             |      0 | 
 python-easy-ansi                       |      0 | 
 python-ewmh                            |      0 | 
 python-flanker                         |      0 | 
 python-fudge                           |      0 | 
 python-fullykiosk                      |      0 | 
 python-funcy                           |      0 | 
 python-gammu                           |      0 | 
 python-genson                          |      0 | 
 python-getdns                          |      0 | 
 python-gevent                          |      0 | 
 python-ionoscloud                      |      0 | 
 python-laszip                          |      0 | 
 python-levenshtein                     |      0 | 
 python-lunr                            |      0 | 
 python-makefun                         |      0 | 
 python-markdown-rundoc                 |      0 | 
 python-meld3                           |      0 | 
 python-netsnmpagent                    |      0 | 
 python-noseofyeti                      |      0 | 
 python-nubia                           |      0 | 
 python-nvchecker                       |      0 | 
 python-openqa-client                   |      0 | 
 python-openshift                       |      0 | 
 python-opentracing                     |      0 | 
 python-persisting-theory               |      0 | 
 python-pook                            |      0 | 
 python-pubchempy                       |      0 | 
 python-pypump                          |      0 | 
 python-pysubs2                         |      0 | 
 python-qnapstats                       |      0 | 
 python-requests-oauthlib               |      0 | 
 python-rova                            |      0 | 
 python-rpcq                            |      0 | 
 python-simpy                           |      0 | 
 python-slip10                          |      0 | 
 python-socketpool                      |      0 | 
 python-sphinx-examples                 |      0 | 
 python-spur                            |      0 | 
 python-stdnum                          |      0 | 
 python-tatsu                           |      0 | 
 python-tatsu-lts                       |      0 | 
 python-webob                           |      0 | 
 python-wither                          |      0 | 
 python-zipfile-zstd                    |      0 | 
 pywavelets                             |      0 | 
 pyyardian                              |      0 | 
 rdflib-sqlalchemy                      |      0 | 
 redis-py-cluster                       |      0 | 
 sorl-thumbnail                         |      0 | 
 sortedcontainers                       |      0 | 
 soundcraft-utils                       |      0 | 
 sphinxcontrib-emojicodes               |      0 | 
 sphinxcontrib-googleanalytics          |      0 | 
 stackview                              |      0 | 
 symmetrize                             |      0 | 
 testrepository                         |      0 | 
 thumbor-plugins-gifv                   |      0 | 
 trac-roadmap                           |      0 | 
 turbosearch                            |      0 | 
 vncdotool                              |      0 | 
 webpy                                  |      0 | 
 webtest                                |      0 | 
 west                                   |      0 | 
 yotta                                  |      0 | 
 zktop                                  |      0 | 
 django-cachalot                        |     -1 | 
 python-asv-bench-memray                |     -1 | 
 python-gfloat                          |     -1 | 
 python-gradientmodel                   |     -1 | 
 python-zopfli                          |     -1 | 
 s3ql                                   |     -1 | 
 sphinxcontrib-emojicodes               |     -1 | 
 symmetrize                             |     -1 | 
(615 rows)

