<?xml version="1.0" encoding="UTF-8" standalone="no"?>
<svg
   xmlns:dc="http://purl.org/dc/elements/1.1/"
   xmlns:cc="http://web.resource.org/cc/"
   xmlns:rdf="http://www.w3.org/1999/02/22-rdf-syntax-ns#"
   xmlns:svg="http://www.w3.org/2000/svg"
   xmlns="http://www.w3.org/2000/svg"
   xmlns:sodipodi="http://sodipodi.sourceforge.net/DTD/sodipodi-0.dtd"
   xmlns:inkscape="http://www.inkscape.org/namespaces/inkscape"
   version="1.1"
   width="900"
   height="600"
   id="svg2"
   sodipodi:version="0.32"
   inkscape:version="0.45.1"
   sodipodi:docname="fr.svg"
   inkscape:output_extension="org.inkscape.output.svg.inkscape"
   sodipodi:docbase="/deb/svn/debian-med/trunk/community/website/img/langs">
  <metadata
     id="metadata13">
    <rdf:RDF>
      <cc:Work
         rdf:about="">
        <dc:format>image/svg+xml</dc:format>
        <dc:type
           rdf:resource="http://purl.org/dc/dcmitype/StillImage" />
        <dc:source>http://commons.wikimedia.org/wiki/Image:Flag_of_France.svg</dc:source>
        <cc:license
           rdf:resource="http://web.resource.org/cc/PublicDomain" />
      </cc:Work>
      <cc:License
         rdf:about="http://web.resource.org/cc/PublicDomain">
        <cc:permits
           rdf:resource="http://web.resource.org/cc/Reproduction" />
        <cc:permits
           rdf:resource="http://web.resource.org/cc/Distribution" />
        <cc:permits
           rdf:resource="http://web.resource.org/cc/DerivativeWorks" />
      </cc:License>
    </rdf:RDF>
  </metadata>
  <defs
     id="defs11" />
  <sodipodi:namedview
     inkscape:window-height="622"
     inkscape:window-width="797"
     inkscape:pageshadow="2"
     inkscape:pageopacity="0.0"
     guidetolerance="10.0"
     gridtolerance="10.0"
     objecttolerance="10.0"
     borderopacity="1.0"
     bordercolor="#666666"
     pagecolor="#ffffff"
     id="base"
     inkscape:zoom="0.4796541"
     inkscape:cx="450"
     inkscape:cy="300"
     inkscape:window-x="216"
     inkscape:window-y="79"
     inkscape:current-layer="svg2" />
  <rect
     width="900"
     height="600"
     style="fill:#00209F"
     id="rect4"
     inkscape:export-filename="/deb/svn/debian-med/trunk/community/website/img/langs/fr.png"
     inkscape:export-xdpi="1.2"
     inkscape:export-ydpi="1.2" />
  <rect
     width="600"
     height="600"
     x="300"
     style="fill:#fff"
     id="rect6"
     inkscape:export-filename="/deb/svn/debian-med/trunk/community/website/img/langs/fr.png"
     inkscape:export-xdpi="1.2"
     inkscape:export-ydpi="1.2" />
  <rect
     width="300"
     height="600"
     x="600"
     style="fill:#F42A41"
     id="rect8"
     inkscape:export-filename="/deb/svn/debian-med/trunk/community/website/img/langs/fr.png"
     inkscape:export-xdpi="1.2"
     inkscape:export-ydpi="1.2" />
</svg>
