Correct library

1 job for master in 12 minutes and 19 seconds (queued for 1 second)
Status Job ID Name Coverage
  Build
failed #219371
build

00:12:19

 
Name Stage Failure
failed
build Build
 => 0 words(s) documented in 0 s.
Problem building full-text index
ninja: build stopped: subcommand failed.
dh_auto_build: cd obj-x86_64-linux-gnu && LC_ALL=C.UTF-8 ninja -j1 -v returned exit code 1
make[1]: *** [debian/rules:107: override_dh_auto_build-arch] Error 1
make[1]: Leaving directory '/builds/med-team/gdcm'
make: *** [debian/rules:49: build] Error 2
dpkg-buildpackage: error: debian/rules build subprocess returned exit status 2
ERROR: Job failed: exit code 1