<?xml version="1.0" encoding="UTF-8" standalone="no"?>
<!-- Created with Inkscape (http://www.inkscape.org/) -->

<svg
   xmlns:dc="http://purl.org/dc/elements/1.1/"
   xmlns:cc="http://creativecommons.org/ns#"
   xmlns:rdf="http://www.w3.org/1999/02/22-rdf-syntax-ns#"
   xmlns:svg="http://www.w3.org/2000/svg"
   xmlns="http://www.w3.org/2000/svg"
   xmlns:sodipodi="http://sodipodi.sourceforge.net/DTD/sodipodi-0.dtd"
   xmlns:inkscape="http://www.inkscape.org/namespaces/inkscape"
   version="1.1"
   id="svg2"
   xml:space="preserve"
   width="1122.5197"
   height="793.70074"
   viewBox="0 0 1122.5197 793.70074"
   sodipodi:docname="miniDebConf_Dos_staff.svg"
   inkscape:version="0.92.1 r15371"
   inkscape:export-filename="/home/jcougnoux/Documents/teeshirts/miniDebConf_Dos_staff.png"
   inkscape:export-xdpi="100"
   inkscape:export-ydpi="100"><metadata
     id="metadata8"><rdf:RDF><cc:Work
         rdf:about=""><dc:format>image/svg+xml</dc:format><dc:type
           rdf:resource="http://purl.org/dc/dcmitype/StillImage" /><dc:title></dc:title></cc:Work></rdf:RDF></metadata><defs
     id="defs6"><clipPath
       clipPathUnits="userSpaceOnUse"
       id="clipPath4626"><rect
         style="opacity:1;fill:#ffffff;fill-opacity:1;stroke:#6b838f;stroke-width:8.42480278;stroke-linecap:square;stroke-linejoin:miter;stroke-miterlimit:4;stroke-dasharray:none;stroke-opacity:1;paint-order:stroke fill markers"
         id="rect4628"
         width="326.98602"
         height="300.50943"
         x="153.23457"
         y="-641.15869"
         ry="1.436017"
         transform="scale(1,-1)" /></clipPath><clipPath
       clipPathUnits="userSpaceOnUse"
       id="clipPath4656"><rect
         ry="1.436017"
         y="-649.36835"
         x="231.8786"
         height="284.57114"
         width="223.72533"
         id="rect4658"
         style="opacity:1;fill:#ffffff;fill-opacity:1;stroke:none;stroke-width:8.42480278;stroke-linecap:square;stroke-linejoin:miter;stroke-miterlimit:4;stroke-dasharray:none;stroke-opacity:1;paint-order:stroke fill markers"
         transform="scale(1,-1)" /></clipPath><clipPath
       clipPathUnits="userSpaceOnUse"
       id="clipPath4662"><rect
         style="opacity:1;fill:#ffffff;fill-opacity:1;stroke:none;stroke-width:8.42480278;stroke-linecap:square;stroke-linejoin:miter;stroke-miterlimit:4;stroke-dasharray:none;stroke-opacity:1;paint-order:stroke fill markers"
         id="rect4664"
         width="140.98788"
         height="202.87695"
         x="270.52997"
         y="-572.84814"
         ry="0.88102376"
         transform="scale(1,-1)" /></clipPath><clipPath
       clipPathUnits="userSpaceOnUse"
       id="clipPath4683"><path
         style="fill:#ffffff;fill-opacity:1;stroke:none;stroke-width:0.75px;stroke-linecap:butt;stroke-linejoin:miter;stroke-opacity:1"
         d="m 773.06252,199.03127 -6.44535,-11.29688 12.46875,-1.52344 -4.54688,12.28125 z"
         id="path4685"
         inkscape:connector-curvature="0" /></clipPath></defs><sodipodi:namedview
     pagecolor="#ffffff"
     bordercolor="#666666"
     borderopacity="1"
     objecttolerance="10"
     gridtolerance="10"
     guidetolerance="10"
     inkscape:pageopacity="0"
     inkscape:pageshadow="2"
     inkscape:window-width="1276"
     inkscape:window-height="1041"
     id="namedview4"
     showgrid="false"
     inkscape:zoom="0.35355339"
     inkscape:cx="464.55102"
     inkscape:cy="883.72048"
     inkscape:window-x="4480"
     inkscape:window-y="37"
     inkscape:window-maximized="0"
     inkscape:current-layer="g10"
     showguides="true"
     inkscape:guide-bbox="true" /><g
     id="g10"
     inkscape:groupmode="layer"
     inkscape:label="miniDebConf"
     transform="matrix(1.3333333,0,0,-1.3333333,0,793.70077)"><rect
       style="opacity:1;fill:#b61f4a;fill-opacity:1;stroke:none;stroke-width:8.29699802;stroke-linecap:square;stroke-linejoin:miter;stroke-miterlimit:10;stroke-dasharray:none;stroke-opacity:1;paint-order:stroke fill markers"
       id="rect4741"
       width="841.88977"
       height="595.27557"
       x="-4.7351673e-06"
       y="-595.27557"
       transform="scale(1,-1)" /><g
       id="g4720"
       transform="matrix(0.89760144,0,0,0.89760144,105.0102,-120.38818)"><text
         y="-245.68382"
         x="242.05745"
         transform="scale(1.0024677,-0.99753838)"
         style="font-variant:normal;font-weight:bold;font-size:101.47831726px;font-family:'Amatic SC';-inkscape-font-specification:AmaticSC-Bold;writing-mode:lr-tb;fill:#4e8baa;fill-opacity:1;fill-rule:nonzero;stroke:none;stroke-width:1.10075223"
         id="text40"><tspan
           style="font-size:99.16272736px;fill:#4e8baa;fill-opacity:1;stroke-width:1.10075223"
           x="242.05745 288.02713 310.96124 359.56937 382.50348 420.76077 459.22107 488.04092 516.96222 551.1604 587.69257 636.30121"
           y="-245.68382"
           sodipodi:role="line"
           id="tspan38">Mini-DebConf</tspan></text>
<text
         xml:space="preserve"
         style="font-style:normal;font-variant:normal;font-weight:bold;font-stretch:normal;font-size:331.60955811px;line-height:1.25;font-family:'Amatic SC';-inkscape-font-specification:'Amatic SC Bold';letter-spacing:0px;word-spacing:0px;fill:#4e8baa;fill-opacity:1;stroke:none;stroke-width:1.72713327"
         x="124.87628"
         y="817.37634"
         id="text4506"
         transform="matrix(0,1,1,0,0,0)"><tspan
           sodipodi:role="line"
           id="tspan4504"
           x="124.87628"
           y="817.37634"
           style="font-style:normal;font-variant:normal;font-weight:bold;font-stretch:normal;font-size:172.45344543px;font-family:'Amatic SC';-inkscape-font-specification:'Amatic SC Bold';fill:#4e8baa;fill-opacity:1;stroke-width:1.72713327">2019</tspan></text>
<text
         y="-144.95592"
         x="370.20035"
         transform="scale(1.0024677,-0.99753838)"
         style="font-variant:normal;font-weight:bold;font-size:95.04839325px;font-family:'FabfeltScript Bold';-inkscape-font-specification:FabfeltScript-Bold;writing-mode:lr-tb;fill:#ffffff;fill-opacity:1;fill-rule:nonzero;stroke:none;stroke-width:1.18518054"
         id="text44"><tspan
           style="fill:#ffffff;fill-opacity:1;stroke-width:1.18518054"
           x="370.20035 432.36185 467.90994 496.13901 523.60791 554.02338 575.02917 606.49017 637.8562"
           y="-144.95592"
           sodipodi:role="line"
           id="tspan42">Marseille</tspan></text>
<g
         transform="translate(-319.84513,-77.686899)"
         id="g4625"><g
           transform="translate(-3.9763947e-8,-1.0102778)"
           id="g4598"><path
             d="m 373.92544,379.26796 c -5.88898,-0.0893 1.10186,-3.04128 8.79624,-4.20269 2.12182,1.64161 4.04263,3.31673 5.75869,4.94346 -4.7834,-1.16141 -9.65614,-1.1763 -14.55493,-0.74077"
             style="fill:#6b838f;fill-opacity:1;fill-rule:nonzero;stroke:none;stroke-width:3.72249007"
             id="path4592"
             inkscape:connector-curvature="0" /><path
             d="m 405.49215,387.14847 c 3.50287,4.81318 6.06394,10.10656 6.94989,15.58979 -0.78544,-3.88256 -2.89237,-7.27375 -4.8839,-10.82128 -10.99252,-6.92011 -1.04602,4.11707 -0.0149,8.30487 -11.80774,-14.88996 -1.61556,-8.93025 -2.0511,-13.07338"
             style="fill:#6b838f;fill-opacity:1;fill-rule:nonzero;stroke:none;stroke-width:3.72249007"
             id="path4594"
             inkscape:connector-curvature="0" /><path
             d="m 417.15472,417.46815 c 0.6961,10.58304 -2.09577,7.24024 -3.04128,3.18273 1.10558,-0.55093 1.98037,-7.47476 3.04128,-3.18273"
             style="fill:#6b838f;fill-opacity:1;fill-rule:nonzero;stroke:none;stroke-width:3.72249007"
             id="path4596"
             inkscape:connector-curvature="0" /><path
             d="m 351.61655,562.2209 c 3.1269,-0.53604 6.79355,-0.98646 6.26868,-1.71607 3.43213,0.72961 4.21758,1.42572 -6.26868,1.71607"
             style="fill:#6b838f;fill-opacity:1;fill-rule:nonzero;stroke:none;stroke-width:3.72249007"
             id="path4598"
             inkscape:connector-curvature="0" /><path
             d="m 357.88523,560.50483 -2.21116,-0.46531 2.06598,0.18985 0.14518,0.27546"
             style="fill:#6b838f;fill-opacity:1;fill-rule:nonzero;stroke:none;stroke-width:3.72249007"
             id="path4600"
             inkscape:connector-curvature="0" /><path
             d="m 309.72737,371.18271 -0.83011,-4.11335 c 3.86767,-5.26733 6.935,-10.93668 11.86357,-15.02397 -3.54753,6.90894 -6.19422,9.75664 -11.03346,19.13732"
             style="fill:#6b838f;fill-opacity:1;fill-rule:nonzero;stroke:none;stroke-width:3.72249007"
             id="path4604"
             inkscape:connector-curvature="0" /><path
             d="m 318.85864,371.54751 c -2.0362,2.267 -3.25718,4.98442 -4.61216,7.70556 1.29542,-4.76851 3.957,-8.88559 6.42874,-13.04361 l -1.81658,5.33805"
             style="fill:#6b838f;fill-opacity:1;fill-rule:nonzero;stroke:none;stroke-width:3.72249007"
             id="path4606"
             inkscape:connector-curvature="0" /><path
             d="m 480.58222,406.70643 -0.87106,-2.16649 c -1.57089,-11.26797 -5.00303,-22.40939 -10.25174,-32.71696 5.79964,10.892 9.53702,22.80025 11.1228,34.88345"
             style="fill:#6b838f;fill-opacity:1;fill-rule:nonzero;stroke:none;stroke-width:3.72249007"
             id="path4608"
             inkscape:connector-curvature="0" /><path
             d="m 352.78169,565.05744 c 3.98307,1.4406 9.78643,0.80033 14.0189,1.74585 -5.51301,-0.45043 -10.98134,-0.72961 -16.40501,-1.42572 l 2.38611,-0.32013"
             style="fill:#6b838f;fill-opacity:1;fill-rule:nonzero;stroke:none;stroke-width:3.72249007"
             id="path4610"
             inkscape:connector-curvature="0" /><path
             d="m 213.17343,490.81237 c 0.90084,-8.47983 -6.38407,-11.77796 1.61556,-6.17933 4.2883,9.66731 -1.69001,2.65786 -1.61556,6.17933"
             style="fill:#6b838f;fill-opacity:1;fill-rule:nonzero;stroke:none;stroke-width:3.72249007"
             id="path4612"
             inkscape:connector-curvature="0" /><path
             d="m 203.7518,451.55127 c 1.84636,5.66935 2.19627,9.03076 2.89238,12.34378 -5.08865,-6.52925 -2.35634,-7.92518 -2.89238,-12.34378"
             style="fill:#6b838f;fill-opacity:1;fill-rule:nonzero;stroke:none;stroke-width:3.72249007"
             id="path4614"
             inkscape:connector-curvature="0" /></g><path
           d="m 455.77556,413.44042 c 0.34991,-9.51096 -2.77698,-14.1194 -5.61352,-22.30888 l -5.07375,-2.51268 c -4.15802,-8.10014 0.42064,-5.14821 -2.59086,-11.57695 -6.48457,-5.75869 -19.68825,-18.04291 -23.91699,-19.19316 -3.08223,0.0856 2.09203,3.64804 2.76208,5.05887 -8.69573,-5.95971 -6.97967,-8.9712 -20.26896,-12.60435 l -0.39458,0.85617 c -32.79142,-15.41483 -78.34725,15.16542 -77.73676,56.86848 -0.36108,-2.6318 -1.00135,-1.96175 -1.73096,-3.03755 -1.68629,21.44899 9.92044,43.01337 29.48957,51.80962 19.13732,9.48118 41.58766,5.58373 55.28642,-7.18441 -7.51943,9.86088 -22.5099,20.29874 -40.27734,19.34206 -17.39148,-0.2643 -33.67737,-11.34243 -39.13082,-23.3549 -8.90047,-5.59863 -9.94649,-21.62022 -13.81416,-24.55727 -5.24871,-38.43471 9.81621,-55.01096 35.3041,-74.53914 3.99795,-2.70253 1.12047,-3.11201 1.66023,-5.17799 -8.46495,3.9719 -16.21517,9.96139 -22.59924,17.27608 3.38746,-4.95836 7.05412,-9.75665 11.76307,-13.5387 -7.98102,2.70625 -18.63851,19.34206 -21.75051,20.00839 13.73971,-24.63172 55.79268,-43.18461 77.83727,-33.98262 -10.19218,-0.36108 -23.15017,-0.18612 -34.57821,4.03146 -4.82807,2.4829 -11.37221,7.60133 -10.1959,8.54684 30.0591,-11.2382 61.10467,-8.47611 87.10254,12.36239 6.61487,5.1482 13.84394,13.92956 15.93598,14.01517 -3.14178,-4.70895 0.53977,-2.26699 -1.87613,-6.4399 6.58881,10.6426 -2.8626,4.33298 6.80471,18.36304 l 3.57731,-4.92858 c -1.33637,8.84092 10.96646,19.54308 9.7157,33.50242 2.82165,4.26225 3.15295,-4.59356 0.14518,-14.40976 4.15802,10.90689 1.10558,12.66391 2.16649,21.62394 1.16142,-3.01149 2.66158,-6.224 3.44703,-9.41045 -2.70625,10.51603 2.77697,17.72649 4.11335,23.8351 -1.32149,0.61049 -4.15802,-4.63822 -4.79829,7.79117 0.0856,5.39761 1.48155,2.83654 2.02131,4.16175 -1.04602,0.61049 -3.823,4.75362 -5.51301,12.69369 1.20981,1.87613 3.27207,-4.84296 4.94719,-5.11843 -1.0758,6.32452 -2.93704,11.12281 -3.01149,15.98065 -4.87274,10.19218 -1.73096,-1.36615 -5.66936,4.36276 -5.20776,16.19656 4.3032,3.76344 4.94347,11.1228 7.86562,-11.38709 12.34378,-29.06892 14.40976,-36.39478 -1.57089,8.94142 -4.10218,17.56271 -7.21419,25.93831 2.40101,-1.01624 -3.83788,18.35188 3.11201,5.5279 -7.43009,27.34913 -31.80124,52.90031 -54.2218,64.87928 2.73231,-2.52757 6.20912,-5.65446 4.97325,-6.16444 -11.15258,6.64464 -9.20572,7.16951 -10.80639,9.97627 -9.07171,3.67782 -9.6673,-0.32014 -15.6754,-0.0149 -17.11229,9.07171 -20.42903,8.10014 -36.19005,13.81416 l 0.72588,-3.35769 c -11.34243,3.77833 -13.21856,-1.42571 -25.47672,0 -0.74078,0.56582 3.94212,2.09204 7.78,2.65786 -10.96273,-1.43688 -10.45275,2.16649 -21.18469,-0.42064 2.64669,1.87614 5.43856,3.09711 8.27137,4.68289 -8.95631,-0.55465 -21.35964,-5.21893 -17.53292,-0.9604 -14.56983,-6.52925 -40.48208,-15.66052 -55.01096,-29.28483 l -0.46532,3.05244 c -6.65953,-8.0108 -29.05031,-23.89094 -30.82594,-34.25808 l -1.78679,-0.39086 c -3.46192,-5.86292 -5.70286,-12.53734 -8.46494,-18.55661 -4.52283,-7.73533 -6.62976,-2.99288 -5.98949,-4.1878 -8.91537,-18.07269 -13.34885,-33.28279 -17.17557,-45.73079 2.72114,-4.07241 0.0596,-24.53121 1.09069,-40.88784 -4.47816,-80.87854 56.75308,-159.41192 123.68718,-177.50322 9.81621,-3.53264 24.38603,-3.40235 36.80426,-3.73738 -14.64428,4.15802 -16.5353,2.19627 -30.78499,7.18441 -10.29641,4.84296 -12.54852,10.36713 -19.83343,16.70653 l 2.87748,-5.11842 c -14.29064,5.06259 -8.31604,6.26867 -19.93393,9.94649 l 3.08222,4.02774 c -4.63822,0.34991 -12.25816,7.79489 -14.3502,11.93802 l -5.07748,-0.20473 c -6.08999,7.51943 -9.33228,12.9282 -9.08659,17.1309 l -1.64162,-2.92216 c -1.85008,3.16784 -22.40939,28.17925 -11.73701,22.36472 -1.99154,1.7868 -4.62334,2.93705 -7.47476,8.1262 l 2.16649,2.47173 c -5.11843,6.6037 -9.43652,15.07981 -9.10149,17.88657 2.7323,-3.7076 4.62333,-4.39254 6.49946,-5.03281 -12.93937,32.13626 -13.66898,1.79052 -23.4703,32.73186 l 2.0511,0.16006 c -1.58206,2.38612 -2.54246,4.98814 -3.823,7.54921 l 0.90084,9.00099 c -9.32111,10.75799 -2.58713,45.8313 -1.25076,65.05423 0.93063,7.82468 7.78001,16.1705 12.98405,29.19922 l -3.16784,0.55093 c 6.07883,10.57187 34.65266,42.51828 47.88239,40.87666 6.41385,8.05547 -1.26564,0.0298 -2.5164,2.05109 14.07846,14.56983 18.51194,10.29269 28.00802,12.9096 10.26662,6.09372 -8.78508,-2.35261 -3.92723,2.32656 17.7265,4.53771 12.5634,10.2964 35.6689,12.59318 2.44195,-1.39593 -5.65446,-2.13671 -7.69067,-3.93839 14.77457,7.22535 46.73215,5.58373 67.48503,-4.00168 24.07707,-11.26798 51.13957,-44.53587 52.23026,-75.85691 l 1.20609,-0.33502 c -0.61049,-12.43312 1.90591,-26.84288 -2.45685,-40.03166 l 2.96683,6.23889"
           style="fill:#4e8baa;fill-opacity:1;fill-rule:nonzero;stroke:none;stroke-width:3.72249031"
           id="path4602"
           inkscape:connector-curvature="0" /></g><path
         d="m 78.649849,154.45294 c 0.51597,0.50075 1.08563,0.99511 0,1.74583 -1.5992,0.69225 -1.78748,3.53651 1.09205,3.05178 6.05308,4.54763 14.54986,0.35013 13.27273,-3.14552 l 5.09887,0.2067 c 1.59919,2.07193 0.22194,1.3268 0.34372,3.39551 0.77636,1.32118 2.184881,0.63215 3.373861,1.94051 -0.30045,2.49415 0.68263,3.68394 -0.96064,4.7231 1.07041,0.69465 1.48702,1.71458 1.11447,3.12949 l 18.10159,5.23587 0.43507,0.6538 -1.74263,0.43505 2.18088,2.18169 0.21953,1.52707 0.8701,0.6546 0.43826,6.10597 6.75976,2.83545 c -1.22665,1.78989 -0.0657,3.07662 1.52709,2.83546 0.24437,0.80442 -0.37816,1.51508 -1.03917,2.21933 0.87973,0.11538 1.584,0.35013 1.76827,0.93501 5.07641,1.30515 6.00662,1.49345 8.21233,3.38669 2.80182,0.26599 0.69545,0.83245 1.64007,1.92449 l 1.23305,-0.012 0.0256,-1.20502 1.96214,0.43506 0.0658,4.61654 0.75713,-4.39782 11.40513,0.41023 0.14021,5.20783 c -0.002,0.77314 -0.71307,1.2771 -1.5271,1.74661 0.61053,0.28443 0.39421,0.70986 0.43507,1.08883 l 0.8733,0.21874 c -0.18508,7.01694 -0.36294,5.08924 -0.21952,7.63386 0.18828,0.87332 -0.62895,1.20501 -1.29234,2.07834 l 1.07681,0.10254 4.10296,7.87503 6.48174,0.002 c -0.11937,3.49886 1.35483,8.08975 -0.76995,10.22415 0.98308,1.7907 -0.15624,2.61675 -0.27242,3.94995 1.87482,0.62574 1.62725,2.45969 2.76977,4.18148 0.0937,0.70105 0.79478,0.0657 0.93579,0.65378 1.77147,7.37026 5.76228,10.24019 10.08717,11.49565 0.9983,3.57418 0.47911,6.13403 0.65378,9.16018 h -1.08884 l 0.0625,0.55123 0.96066,0.11537 0.50075,1.29635 0.59208,-1.29635 1.10166,-0.23156 0.10337,-0.61291 -0.9238,-0.041 c -0.57607,-2.87633 -0.37256,-7.69878 1.10486,-8.73472 9.69296,-4.94825 9.12651,-11.49567 12.68786,-16.64101 l -0.0657,22.06755 c 0.41662,2.42204 -1.721,2.83866 -2.61674,4.23117 l 1.43656,0.82043 c -0.1282,1.24186 1.09524,2.5414 -0.76995,3.71118 l 1.37406,0.44786 c -0.35974,1.22104 -0.0215,2.5382 -1.10167,3.4524 0.75794,0.58166 2.33472,1.25787 0.58889,1.55192 -0.23796,0.64495 -0.56965,2.00942 -1.37405,1.89645 1.19539,-0.59449 2.47251,-1.08242 2.66318,0.45749 0.069,0.54722 1.26431,-1.01112 2.00622,-0.75153 0.0345,-1.30836 0.1314,-2.40362 -0.23154,-5.09166 1.60241,-0.8701 2.24097,-0.67621 2.83545,-0.43825 0.67303,0.36294 1.58318,1.15133 1.04237,1.51427 1.60801,1.53671 0.74431,2.73852 0.12499,4.18148 2.01262,1.31478 0.0184,1.97176 0.0657,3.05499 0.45347,0.92621 1.05436,0.266 1.60239,0.16585 0.55363,3.74644 0.24116,6.19331 0,8.75075 l -0.62574,0.49755 c -0.20029,0.86049 -0.006,1.64246 0.30607,2.4004 1.11447,0.25959 1.74022,0.92299 2.24417,1.69295 1.34922,2.47251 0.84527,3.03576 0.25718,4.83526 0.74432,0.44147 0.11217,1.1241 0.30605,2.15683 1.74344,1.05119 0.72029,6.61314 0.96465,9.68577 -1.09924,0.22593 -1.4149,1.94371 -1.17696,6.48172 0.38458,1.6625 1.38288,2.65441 1.76825,3.90908 0.29405,1.66491 -0.50074,3.37386 1.64007,3.52769 1.65529,-0.78277 0.61934,-2.49495 1.56475,-3.87461 2.11279,1.03916 3.5269,-0.46311 4.09335,-2.96125 -0.5384,-0.31887 -1.08563,-0.56005 -1.72419,-0.16906 -0.13781,-1.0728 0.0625,-2.29704 0.532,-3.27051 0.16264,-0.44065 0.87652,-0.54401 -0.45427,-1.17056 0.32288,-3.36105 1.52148,-6.87913 0.25717,-9.96136 l -1.11448,0.50074 c -0.0625,-1.18016 -0.48792,-2.25698 0.10337,-3.62142 0.41021,-3.25129 0.11617,-6.4529 3.4019,-8.45271 -0.0101,-0.69224 0.0785,-1.39971 -0.59128,-1.991 l 0.0498,-6.69404 c 0.28201,-1.52148 0.0441,-2.93001 1.15533,-4.63495 0.0593,-2.10638 0.14341,-4.20632 -0.19389,-6.41284 h 4.48113 c 0.62654,2.3347 -1.11687,3.95874 -0.14342,6.77257 l 0.923,0.17786 c -0.10977,2.24418 2.11918,0.10977 3.61823,0.96465 0.11537,-1.63686 -0.84848,-2.27222 -2.00301,-2.97327 l 1.87401,-0.65458 c -0.16264,-0.83245 0.25079,-1.37086 -0.68182,-2.06551 -0.7419,-1.15132 0.58488,-1.78988 0.10656,-3.23285 -1.17376,-1.9277 0.4695,-3.22644 1.47742,-3.86501 -1.20821,-1.22984 -2.82985,-2.34431 -2.3916,-4.16625 0.0874,-5.24789 -0.23795,-11.92671 0.028,-15.74205 1.54633,-2.13121 1.04878,-1.84998 -0.24356,-4.26882 l 0.60411,-24.00805 2.30586,-0.20352 -0.0625,-3.47723 0.82045,-0.22833 0.15944,-1.96215 -0.87652,0.0473 c -0.42224,-7.47763 -0.14342,-16.91662 -0.0657,-24.80926 l 3.42674,0.0376 0.10096,-1.80912 16.92221,-0.50074 c 3.86823,1.16414 8.09296,1.42692 12.08696,1.88683 l 2.21534,0.15061 -0.16585,1.6585 1.69295,-0.0785 0.282,-1.57676 c 7.34544,0.65698 6.07473,1.43336 8.66263,2.269 l 5.1958,0.002 3.5269,3.88343 c 0.30366,1.12088 -0.87332,3.59018 1.53991,2.78577 l 14.60034,0.0497 c 0.072,-11.69516 2.00941,-22.5026 7.97758,-28.79604 0.72909,2.42204 2.54702,2.25938 3.7208,0.7387 4.7351,2.89475 7.35503,2.27222 10.37477,-1.17695 1.05839,0.16582 1.51828,-0.15064 1.96295,-1.58078 3.51167,-0.64099 3.69594,-0.56006 4.71588,-3.87143 2.46931,0.49755 1.55274,-0.71948 0.0817,-3.98038 3.41793,0.98547 5.21103,1.50786 5.80552,-0.0257 0.50397,-0.76995 -0.006,-2.83546 2.34432,-1.22663 1.50867,0.14421 1.54312,-1.09204 1.96216,-1.96535 20.64701,-9.44219 21.38812,-18.73454 21.22228,-21.80796 H 47.24582 c 10.20011,18.83147 9.66491,14.1116 31.403969,20.28408 z"
         style="fill:#ffffff;fill-opacity:1;fill-rule:nonzero;stroke:none;stroke-width:0.80120349"
         id="path48"
         inkscape:connector-curvature="0" /></g><text
       xml:space="preserve"
       style="font-style:normal;font-variant:normal;font-weight:normal;font-stretch:normal;font-size:134.73417664px;line-height:1.25;font-family:'League Spartan';-inkscape-font-specification:'League Spartan';letter-spacing:0px;word-spacing:0px;fill:#ffffff;fill-opacity:1;stroke:none;stroke-width:0.7017405"
       x="287.16821"
       y="-453.28763"
       id="text4515"
       transform="scale(1,-1)"><tspan
         sodipodi:role="line"
         id="tspan4513"
         x="287.16821"
         y="-453.28763"
         style="font-style:normal;font-variant:normal;font-weight:normal;font-stretch:normal;font-size:184.88014221px;font-family:'Amatic SC';-inkscape-font-specification:'Amatic SC';fill:#ffffff;fill-opacity:1;stroke-width:0.7017405">STAFF</tspan></text>
</g></svg>