<?xml version="1.0" encoding="UTF-8" standalone="no"?>
<!-- Created with Inkscape (http://www.inkscape.org/) -->

<svg
   width="1775"
   height="270"
   viewBox="0 0 469.63542 71.437476"
   version="1.1"
   id="svg454"
   inkscape:version="1.2.2 (b0a8486541, 2022-12-01)"
   sodipodi:docname="data-bene-logo-name.svg"
   inkscape:export-filename="data-bene-logo-name.png"
   inkscape:export-xdpi="31.153076"
   inkscape:export-ydpi="31.153076"
   xmlns:inkscape="http://www.inkscape.org/namespaces/inkscape"
   xmlns:sodipodi="http://sodipodi.sourceforge.net/DTD/sodipodi-0.dtd"
   xmlns="http://www.w3.org/2000/svg"
   xmlns:svg="http://www.w3.org/2000/svg">
  <sodipodi:namedview
     id="namedview456"
     pagecolor="#ffffff"
     bordercolor="#000000"
     borderopacity="0.25"
     inkscape:showpageshadow="2"
     inkscape:pageopacity="0.0"
     inkscape:pagecheckerboard="0"
     inkscape:deskcolor="#d1d1d1"
     inkscape:document-units="mm"
     showgrid="true"
     inkscape:zoom="0.47158032"
     inkscape:cx="585.26615"
     inkscape:cy="219.47481"
     inkscape:window-width="1584"
     inkscape:window-height="1018"
     inkscape:window-x="-5"
     inkscape:window-y="26"
     inkscape:window-maximized="0"
     inkscape:current-layer="layer1">
    <inkscape:grid
       type="xygrid"
       id="grid764"
       originx="0"
       originy="0" />
  </sodipodi:namedview>
  <defs
     id="defs451" />
  <g
     inkscape:label="Calque 1"
     inkscape:groupmode="layer"
     id="layer1">
    <g
       id="DAB-Symb2"
       transform="matrix(0.26458333,0,0,0.26458333,-30.0806,-30.065863)">
      <g
         id="DAB-Symbole_2_">
        <g
           id="g168">
          <polygon
             points="118.694,379.808 118.694,118.694 296.727,118.694 296.727,379.808 "
             id="polygon166" />
        </g>
        <g
           id="g172">
          <polygon
             points="320.464,237.382 320.464,118.694 401.388,118.694 401.388,237.382 "
             id="polygon170" />
        </g>
        <g
           id="g176">
          <polygon
             points="320.464,261.12 498.496,261.12 498.496,379.808 320.464,379.808 "
             id="polygon174" />
        </g>
      </g>
    </g>
    <g
       id="DAB-Name2"
       transform="matrix(0.26458333,0,0,0.26458333,-30.0806,-30.065863)">
      <g
         id="g198">
        <g
           id="g196">
          <path
             d="m 639.458,144.638 c 76.588,2.191 109.327,42.969 109.327,104.505 0,63.727 -34.932,106.551 -110.352,106.551 H 569.738 V 144.343 c 5.261,0.003 51.304,-0.142 69.72,0.295 z m -19.73,171.445 h 20.169 c 28.793,0 57.003,-17.976 57.003,-67.525 0,-44.14 -22.216,-64.602 -56.709,-64.602 h -20.463 z"
             id="path180" />
          <path
             d="m 759.283,311.407 c 0,-32.885 24.41,-51.153 78.636,-51.449 l 15.347,-0.145 v -7.746 c 0,-11.689 -6.578,-17.833 -20.755,-17.685 -10.232,0.295 -21.924,4.091 -26.31,16.225 h -40.779 c 1.608,-34.201 30.987,-48.962 69.28,-48.962 49.55,0 66.211,18.708 66.211,47.357 v 106.695 h -41.362 l -4.238,-24.996 c -9.792,21.197 -23.677,27.917 -44.433,27.917 -28.792,0 -51.597,-16.81 -51.597,-47.211 z m 93.983,-6.575 v -20.607 l -12.278,0.146 c -15.202,0.147 -34.932,5.26 -34.932,21.925 0,12.863 10.083,20.317 21.922,20.317 13.155,-0.004 24.996,-10.382 25.288,-21.781 z"
             id="path182" />
          <path
             d="m 986.253,238.621 0.146,74.542 c 0,8.914 4.091,10.374 11.252,10.374 h 22.071 V 353.5 c -4.092,1.901 -11.84,4.095 -28.354,4.095 -43.704,0 -54.81,-17.979 -54.81,-42.242 v -76.729 h -24.556 v -34.058 h 26.31 l 12.715,-46.331 h 35.227 v 46.041 h 33.177 v 34.348 h -33.179 v -0.003 z"
             id="path184" />
          <path
             d="m 1034.619,311.407 c 0,-32.885 24.41,-51.153 78.636,-51.449 l 15.348,-0.145 v -7.746 c 0,-11.689 -6.578,-17.833 -20.755,-17.685 -10.23,0.295 -21.925,4.091 -26.308,16.225 h -40.778 c 1.607,-34.201 30.984,-48.962 69.28,-48.962 49.549,0 66.211,18.708 66.211,47.357 v 106.695 h -41.362 l -4.238,-24.996 c -9.792,21.197 -23.677,27.917 -44.434,27.917 -28.798,0 -51.6,-16.81 -51.6,-47.211 z m 93.981,-6.575 v -20.607 l -12.28,0.146 c -15.2,0.147 -34.932,5.26 -34.932,21.925 0,12.863 10.087,20.317 21.924,20.317 13.157,-0.004 24.994,-10.382 25.288,-21.781 z"
             id="path186" />
          <path
             d="m 1224.855,144.346 h 80.536 c 57.294,0 83.312,19.731 83.312,55.69 0,20.169 -8.771,34.931 -35.371,47.206 36.101,10.087 40.342,33.326 40.342,51.011 0,39.17 -24.555,57.44 -84.188,57.44 h -84.627 V 144.346 Z m 87.99,84.921 c 15.493,0 27.915,-8.039 27.915,-22.948 0,-15.347 -13.006,-24.116 -30.254,-24.116 h -35.811 v 47.064 z m -1.754,88.572 c 21.048,0 32.01,-10.959 32.01,-25.142 0,-15.199 -12.567,-24.554 -30.253,-24.554 h -38.149 v 49.695 h 36.392 z"
             id="path188" />
          <path
             d="m 1483.096,323.392 c 12.571,0 22.802,-4.385 27.188,-17.391 h 44.435 c -4.972,32.888 -37.856,52.616 -70.304,52.616 -46.039,0 -77.318,-30.253 -77.318,-76.731 0,-44.291 27.626,-80.242 74.98,-80.242 47.792,0 72.348,32.447 72.348,77.462 v 12.426 h -98.366 c -0.147,20.607 10.815,31.86 27.037,31.86 z m 25.143,-60.51 c 0,-14.907 -8.772,-27.185 -26.163,-27.185 -15.639,0 -26.164,13.153 -26.164,27.185 z"
             id="path190" />
          <path
             d="m 1572.967,204.566 h 49.109 v 21.195 c 6.577,-10.232 18.416,-22.215 42.239,-22.215 27.038,0 52.912,14.907 52.912,52.031 v 100.12 h -49.986 v -93.542 c 0,-13.301 -10.083,-20.024 -21.193,-20.024 -11.253,0 -23.386,6.43 -23.386,18.856 V 355.7 h -49.695 z"
             id="path192" />
          <path
             d="m 1809.724,323.392 c 12.569,0 22.802,-4.385 27.188,-17.391 h 44.433 c -4.967,32.888 -37.854,52.616 -70.303,52.616 -46.043,0 -77.319,-30.253 -77.319,-76.731 0,-44.291 27.624,-80.242 74.98,-80.242 47.793,0 72.352,32.447 72.352,77.462 v 12.426 h -98.367 c -0.149,20.607 10.812,31.86 27.036,31.86 z m 25.138,-60.51 c 0,-14.907 -8.771,-27.185 -26.163,-27.185 -15.641,0 -26.16,13.153 -26.16,27.185 z"
             id="path194" />
        </g>
      </g>
    </g>
  </g>
</svg>
