<?xml version="1.0" encoding="UTF-8" standalone="no"?>
<!-- Created with Inkscape (http://www.inkscape.org/) -->

<svg
   xmlns:dc="http://purl.org/dc/elements/1.1/"
   xmlns:cc="http://creativecommons.org/ns#"
   xmlns:rdf="http://www.w3.org/1999/02/22-rdf-syntax-ns#"
   xmlns:svg="http://www.w3.org/2000/svg"
   xmlns="http://www.w3.org/2000/svg"
   xmlns:xlink="http://www.w3.org/1999/xlink"
   xmlns:sodipodi="http://sodipodi.sourceforge.net/DTD/sodipodi-0.dtd"
   xmlns:inkscape="http://www.inkscape.org/namespaces/inkscape"
   width="307mm"
   height="430mm"
   viewBox="0 0 307 430"
   version="1.1"
   id="svg8"
   inkscape:version="0.92.1 r15371"
   sodipodi:docname="saturday_morning.svg"
   style="enable-background:new"
   inkscape:export-filename="/home/jlecour/work/minidebconfmrs/2019-organization/Program/saturday_morning.png"
   inkscape:export-xdpi="150"
   inkscape:export-ydpi="150">
  <defs
     id="defs2">
    <linearGradient
       inkscape:collect="always"
       id="linearGradient4492">
      <stop
         style="stop-color:#708894;stop-opacity:1;"
         offset="0"
         id="stop4488" />
      <stop
         style="stop-color:#708894;stop-opacity:0;"
         offset="1"
         id="stop4490" />
    </linearGradient>
    <linearGradient
       inkscape:collect="always"
       xlink:href="#linearGradient4492"
       id="linearGradient4494"
       x1="140.3165"
       y1="412.78381"
       x2="140.31651"
       y2="395.67853"
       gradientUnits="userSpaceOnUse"
       gradientTransform="matrix(1.0070774,0,0,1.0808122,3.1787833,-36.122584)" />
    <filter
       inkscape:collect="always"
       style="color-interpolation-filters:sRGB"
       id="filter6830">
      <feBlend
         inkscape:collect="always"
         mode="darken"
         in2="BackgroundImage"
         id="feBlend6832" />
    </filter>
  </defs>
  <sodipodi:namedview
     id="base"
     pagecolor="#ffffff"
     bordercolor="#666666"
     borderopacity="1.0"
     inkscape:pageopacity="1"
     inkscape:pageshadow="2"
     inkscape:zoom="0.70710678"
     inkscape:cx="417.90504"
     inkscape:cy="495.45511"
     inkscape:document-units="mm"
     inkscape:current-layer="g7587"
     showgrid="false"
     inkscape:window-width="2556"
     inkscape:window-height="1041"
     inkscape:window-x="1440"
     inkscape:window-y="37"
     inkscape:window-maximized="0"
     showguides="false"
     inkscape:guide-bbox="true"
     inkscape:lockguides="false"
     height="430mm"
     inkscape:snap-to-guides="false"
     inkscape:pagecheckerboard="false"
     inkscape:snap-page="false">
    <sodipodi:guide
       position="153.5,425.25923"
       orientation="1,0"
       id="guide6051"
       inkscape:locked="false"
       inkscape:label=""
       inkscape:color="rgb(0,0,255)" />
    <sodipodi:guide
       position="5,409.04583"
       orientation="1,0"
       id="guide6948"
       inkscape:locked="false"
       inkscape:label=""
       inkscape:color="rgb(255,0,0)" />
    <sodipodi:guide
       position="40,411.1625"
       orientation="1,0"
       id="guide6989"
       inkscape:locked="false"
       inkscape:label=""
       inkscape:color="rgb(0,0,255)" />
    <inkscape:grid
       type="xygrid"
       id="grid7083" />
    <sodipodi:guide
       position="35,390.78958"
       orientation="1,0"
       id="guide4622"
       inkscape:locked="false"
       inkscape:label=""
       inkscape:color="rgb(0,0,255)" />
    <sodipodi:guide
       position="297,474.13333"
       orientation="1,0"
       id="guide6598"
       inkscape:locked="false"
       inkscape:label=""
       inkscape:color="rgb(0,0,255)" />
    <sodipodi:guide
       position="-21.960417,425"
       orientation="0,1"
       id="guide6684"
       inkscape:locked="false"
       inkscape:label=""
       inkscape:color="rgb(255,0,0)" />
    <sodipodi:guide
       position="302,424.99999"
       orientation="1,0"
       id="guide6686"
       inkscape:locked="false"
       inkscape:label=""
       inkscape:color="rgb(255,0,0)" />
    <sodipodi:guide
       position="-22.49,5"
       orientation="0,1"
       id="guide6688"
       inkscape:locked="false"
       inkscape:label=""
       inkscape:color="rgb(255,0,0)" />
  </sodipodi:namedview>
  <metadata
     id="metadata5">
    <rdf:RDF>
      <cc:Work
         rdf:about="">
        <dc:format>image/svg+xml</dc:format>
        <dc:type
           rdf:resource="http://purl.org/dc/dcmitype/StillImage" />
        <dc:title />
      </cc:Work>
    </rdf:RDF>
  </metadata>
  <g
     inkscape:label="Calque 1"
     inkscape:groupmode="layer"
     id="layer1"
     transform="translate(0,133)"
     style="display:inline" />
  <g
     inkscape:groupmode="layer"
     id="layer2"
     inkscape:label="Calque 2"
     transform="translate(0,10)"
     style="display:inline">
    <rect
       style="opacity:1;fill:url(#linearGradient4494);fill-opacity:1;stroke:none;stroke-width:0;stroke-linecap:round;stroke-linejoin:bevel;stroke-miterlimit:4;stroke-dasharray:none;stroke-dashoffset:0;stroke-opacity:1;paint-order:markers stroke fill"
       id="rect4486"
       width="301.19128"
       height="28.309088"
       x="2.6404612"
       y="390.37604" />
  </g>
  <g
     inkscape:groupmode="layer"
     id="layer3"
     inkscape:label="Calque 3"
     transform="translate(0,10)"
     style="display:inline">
    <g
       id="g6709"
       transform="translate(0,-4.7625002)">
      <text
         id="text40"
         style="font-variant:normal;font-weight:bold;font-size:9.29549694px;font-family:'Amatic SC';-inkscape-font-specification:AmaticSC-Bold;writing-mode:lr-tb;fill:#ffffff;fill-opacity:1;fill-rule:nonzero;stroke:none;stroke-width:0.1008298"
         transform="scale(1.0185153,0.98182128)"
         x="213.4388"
         y="424.31873">
        <tspan
           id="tspan38"
           sodipodi:role="line"
           y="424.31873"
           x="213.4388 217.64966 219.75044 224.20299 226.30376 229.80817 233.33116 235.97107 238.6203 241.75287 245.09924 249.5518"
           style="stroke-width:0.1008298">Mini-DebConf</tspan>
      </text>
      <text
         id="text44"
         style="font-variant:normal;font-size:11.02847099px;font-family:CairoFont-1;-inkscape-font-specification:CairoFont-1-0;writing-mode:lr-tb;fill:#d70751;fill-opacity:1;fill-rule:nonzero;stroke:none;stroke-width:0.13751659"
         transform="scale(1.0185153,0.98182128)"
         x="252.77657"
         y="424.20581">
        <tspan
           style="font-style:normal;font-variant:normal;font-weight:normal;font-stretch:normal;font-family:FabfeltScript;-inkscape-font-specification:FabfeltScript;stroke-width:0.13751659"
           id="tspan42"
           sodipodi:role="line"
           y="424.20581"
           x="252.77657 259.98929 264.11395 267.38943 270.57669 274.1058 276.54309 280.19348 283.83292">Marseille</tspan>
      </text>
      <path
         inkscape:connector-curvature="0"
         id="path48"
         style="fill:#000000;fill-opacity:1;fill-rule:nonzero;stroke:none;stroke-width:0.11619514"
         d="m 243.01726,404.81615 c 0.0762,-0.0714 0.16007,-0.14205 0,-0.24931 -0.23564,-0.0987 -0.26327,-0.50481 0.16091,-0.43551 0.89191,-0.64912 2.144,-0.05 1.95582,0.449 l 0.75119,-0.0294 c 0.23563,-0.29574 0.0328,-0.18938 0.0508,-0.48467 0.1144,-0.18859 0.32182,-0.0902 0.49713,-0.27699 -0.0443,-0.35613 0.10047,-0.52585 -0.14155,-0.67418 0.15772,-0.0992 0.219,-0.24474 0.1641,-0.44672 l 2.66733,-0.74736 0.0641,-0.0934 -0.25689,-0.0621 0.32146,-0.31129 0.0322,-0.21798 0.12821,-0.0934 0.0645,-0.87158 0.99616,-0.40474 c -0.18087,-0.25548 -0.01,-0.43915 0.22501,-0.40473 0.0358,-0.11482 -0.0559,-0.21627 -0.15311,-0.31678 0.12961,-0.0165 0.23327,-0.05 0.26053,-0.13359 0.748,-0.18629 0.88494,-0.21306 1.21008,-0.4833 0.41272,-0.0379 0.10235,-0.11883 0.24165,-0.27481 l 0.1817,0.003 0.003,0.17201 0.28912,-0.0621 0.01,-0.65896 0.11168,0.62774 1.68039,-0.0585 0.0208,-0.74337 c -3.3e-4,-0.11035 -0.10518,-0.18229 -0.225,-0.24931 0.0898,-0.0406 0.0581,-0.10144 0.0641,-0.15543 l 0.12856,-0.0313 c -0.0272,-1.00148 -0.0534,-0.72633 -0.0322,-1.08955 0.0276,-0.12465 -0.0927,-0.17199 -0.19042,-0.29667 l 0.15856,-0.0147 0.60468,-1.12397 0.95493,-3.2e-4 c -0.0174,-0.49943 0.19976,-1.15474 -0.11345,-1.45941 0.14486,-0.2556 -0.023,-0.37351 -0.04,-0.56381 0.27612,-0.0893 0.23977,-0.35111 0.40811,-0.59687 0.0138,-0.10007 0.11711,-0.009 0.13789,-0.0933 0.26102,-1.05203 0.84894,-1.46169 1.4862,-1.64089 0.14721,-0.51019 0.0706,-0.87557 0.0965,-1.30753 h -0.16055 l 0.009,-0.0787 0.14155,-0.0165 0.0737,-0.18493 0.0871,0.18493 0.16234,0.0332 0.0152,0.0875 -0.13599,0.006 c -0.0849,0.41057 -0.0549,1.09893 0.1628,1.2468 1.42811,0.70632 1.34465,1.6409 1.8694,2.37535 l -0.01,-3.14994 c 0.0614,-0.34583 -0.2536,-0.4052 -0.38547,-0.60395 l 0.21168,-0.11711 c -0.0189,-0.17739 0.16138,-0.36277 -0.11345,-0.52985 l 0.20246,-0.0638 c -0.0531,-0.17428 -0.003,-0.3623 -0.16232,-0.49279 0.11155,-0.0831 0.34401,-0.17955 0.0866,-0.22152 -0.0351,-0.0921 -0.0839,-0.28684 -0.20246,-0.27071 0.17613,0.0849 0.36432,0.15451 0.3924,-0.0653 0.0102,-0.0781 0.18642,0.14432 0.29562,0.10727 0.005,0.18676 0.0194,0.34309 -0.0341,0.72678 0.23612,0.1242 0.3302,0.0965 0.4178,0.0625 0.0992,-0.0518 0.23339,-0.16434 0.15358,-0.21626 0.23707,-0.21935 0.1098,-0.3909 0.0184,-0.59675 0.29655,-0.18768 0.003,-0.28146 0.01,-0.43608 0.0669,-0.13221 0.15548,-0.0379 0.23611,-0.0236 0.0817,-0.53475 0.0356,-0.88403 0,-1.24907 l -0.0922,-0.071 c -0.0296,-0.12283 -6.8e-4,-0.23456 0.0452,-0.34264 0.16422,-0.037 0.25642,-0.13175 0.33068,-0.24165 0.19868,-0.35294 0.12442,-0.43333 0.0377,-0.69018 0.10978,-0.063 0.0166,-0.16046 0.0452,-0.30788 0.25689,-0.15004 0.10602,-0.94396 0.14202,-1.38267 -0.16185,-0.0321 -0.20848,-0.27733 -0.17343,-0.92508 0.0568,-0.23731 0.20389,-0.37889 0.26056,-0.55799 0.0434,-0.23777 -0.0737,-0.48159 0.24166,-0.50354 0.24402,0.11172 0.0914,0.35612 0.23056,0.55306 0.31132,-0.14833 0.5198,0.0662 0.60326,0.42269 -0.0794,0.0455 -0.16008,0.0799 -0.25417,0.024 -0.0204,0.15325 0.009,0.328 0.0784,0.46684 0.0241,0.063 0.12915,0.0778 -0.0669,0.16708 0.0475,0.47988 0.22407,0.98194 0.0377,1.42201 l -0.16408,-0.0714 c -0.009,0.16847 -0.072,0.32206 0.0152,0.51694 0.0603,0.46408 0.017,0.92109 0.50126,1.20655 -0.002,0.0988 0.0114,0.19968 -0.0872,0.28418 l 0.007,0.95552 c 0.0415,0.21717 0.007,0.41812 0.17012,0.6616 0.009,0.30066 0.0213,0.60042 -0.0285,0.91537 h 0.6604 c 0.0922,-0.33326 -0.16469,-0.56507 -0.0213,-0.96672 l 0.13613,-0.0255 c -0.0162,-0.32023 0.31214,-0.0156 0.53301,-0.13758 0.0171,0.23364 -0.1249,0.32432 -0.29513,0.4244 l 0.27625,0.0934 c -0.0239,0.11882 0.037,0.19568 -0.10059,0.29482 -0.1092,0.16435 0.0864,0.2555 0.0156,0.46147 -0.17296,0.27516 0.0692,0.46054 0.21769,0.5517 -0.17803,0.17554 -0.41685,0.33462 -0.35228,0.59457 0.0129,0.7492 -0.0351,1.70254 0.004,2.24714 0.22773,0.30422 0.15443,0.26396 -0.036,0.60933 l 0.089,3.42694 0.33989,0.0291 -0.009,0.49633 0.12077,0.0326 0.0235,0.28007 -0.12904,-0.007 c -0.0623,1.06725 -0.0213,2.41469 -0.01,3.54129 l 0.50492,-0.005 0.0147,0.25824 2.49345,0.0714 c 0.56997,-0.16618 1.19259,-0.20368 1.78098,-0.26934 l 0.32655,-0.0216 -0.0244,-0.23674 0.24945,0.0111 0.0414,0.22519 c 1.08234,-0.0938 0.8951,-0.20459 1.27654,-0.32387 l 0.76548,-3.2e-4 0.51979,-0.55434 c 0.0448,-0.15999 -0.12868,-0.51246 0.2269,-0.39764 l 2.1512,-0.007 c 0.0106,1.66938 0.29608,3.21205 1.17547,4.11039 0.10744,-0.34573 0.37543,-0.32252 0.54837,-0.10546 0.69771,-0.41319 1.08363,-0.32433 1.5287,0.16801 0.15583,-0.0236 0.22372,0.0214 0.28912,0.22563 0.51743,0.0915 0.54471,0.0799 0.69499,0.55262 0.36384,-0.0712 0.22867,0.1027 0.0119,0.56816 0.50362,-0.14068 0.76784,-0.21523 0.85555,0.003 0.0743,0.1098 -6.7e-4,0.40475 0.34532,0.17511 0.2223,-0.0206 0.22736,0.15587 0.28923,0.28052 3.04215,1.3478 3.15148,2.6742 3.12704,3.11289 h -45.4811 c 1.50285,-2.68801 1.42399,-2.01441 4.62718,-2.89536 z" />
      <g
         id="g4509"
         transform="matrix(0.09807817,0,0,0.0950119,161.80412,383.70175)">
        <g
           transform="matrix(3.1667914,0,0,-3.1667914,632.48678,279.86426)"
           id="g5185">
          <path
             inkscape:connector-curvature="0"
             id="path4592"
             style="fill:#d70751;fill-opacity:1;fill-rule:nonzero;stroke:none"
             d="m 48.684,53.547 c -1.582,-0.024 0.296,-0.817 2.363,-1.129 0.57,0.441 1.086,0.891 1.547,1.328 C 51.309,53.434 50,53.43 48.684,53.547" />
          <path
             inkscape:connector-curvature="0"
             id="path4594"
             style="fill:#d70751;fill-opacity:1;fill-rule:nonzero;stroke:none"
             d="m 57.164,55.664 c 0.941,1.293 1.629,2.715 1.867,4.188 -0.211,-1.043 -0.777,-1.954 -1.312,-2.907 -2.953,-1.859 -0.281,1.106 -0.004,2.231 -3.172,-4 -0.434,-2.399 -0.551,-3.512" />
          <path
             inkscape:connector-curvature="0"
             id="path4596"
             style="fill:#d70751;fill-opacity:1;fill-rule:nonzero;stroke:none"
             d="m 60.297,63.809 c 0.187,2.843 -0.563,1.945 -0.817,0.855 0.297,-0.148 0.532,-2.008 0.817,-0.855" />
          <path
             inkscape:connector-curvature="0"
             id="path4598"
             style="fill:#d70751;fill-opacity:1;fill-rule:nonzero;stroke:none"
             d="m 42.691,102.695 c 0.84,-0.144 1.825,-0.265 1.684,-0.461 0.922,0.196 1.133,0.383 -1.684,0.461" />
          <path
             inkscape:connector-curvature="0"
             id="path4600"
             style="fill:#d70751;fill-opacity:1;fill-rule:nonzero;stroke:none"
             d="m 44.375,102.234 -0.594,-0.125 0.555,0.051 0.039,0.074" />
          <path
             inkscape:connector-curvature="0"
             id="path4602"
             style="fill:#d70751;fill-opacity:1;fill-rule:nonzero;stroke:none"
             d="m 70.672,62.727 c 0.094,-2.555 -0.746,-3.793 -1.508,-5.993 l -1.363,-0.675 c -1.117,-2.176 0.113,-1.383 -0.696,-3.11 -1.742,-1.547 -5.289,-4.847 -6.425,-5.156 -0.828,0.023 0.562,0.98 0.742,1.359 -2.336,-1.601 -1.875,-2.41 -5.445,-3.386 l -0.106,0.23 c -8.809,-4.141 -21.047,4.074 -20.883,15.277 -0.097,-0.707 -0.269,-0.527 -0.465,-0.816 -0.453,5.762 2.665,11.555 7.922,13.918 5.141,2.547 11.172,1.5 14.852,-1.93 -2.02,2.649 -6.047,5.453 -10.82,5.196 -4.672,-0.071 -9.047,-3.047 -10.512,-6.274 -2.391,-1.504 -2.672,-5.808 -3.711,-6.597 -1.41,-10.325 2.637,-14.778 9.484,-20.024 1.074,-0.726 0.301,-0.836 0.446,-1.391 -2.274,1.067 -4.356,2.676 -6.071,4.641 0.91,-1.332 1.895,-2.621 3.16,-3.637 -2.144,0.727 -5.007,5.196 -5.843,5.375 3.691,-6.617 14.988,-11.601 20.91,-9.129 -2.738,-0.097 -6.219,-0.05 -9.289,1.083 -1.297,0.667 -3.055,2.042 -2.739,2.296 8.075,-3.019 16.415,-2.277 23.399,3.321 1.777,1.383 3.719,3.742 4.281,3.765 -0.844,-1.265 0.145,-0.609 -0.504,-1.73 1.77,2.859 -0.769,1.164 1.828,4.933 l 0.961,-1.324 c -0.359,2.375 2.946,5.25 2.61,9 0.758,1.145 0.847,-1.234 0.039,-3.871 1.117,2.93 0.297,3.402 0.582,5.809 0.312,-0.809 0.715,-1.672 0.926,-2.528 -0.727,2.825 0.746,4.762 1.105,6.403 -0.355,0.164 -1.117,-1.246 -1.289,2.093 0.023,1.45 0.398,0.762 0.543,1.118 -0.281,0.164 -1.027,1.277 -1.481,3.41 0.325,0.504 0.879,-1.301 1.329,-1.375 -0.289,1.699 -0.789,2.988 -0.809,4.293 -1.309,2.738 -0.465,-0.367 -1.523,1.172 -1.399,4.351 1.156,1.011 1.328,2.988 2.113,-3.059 3.316,-7.809 3.871,-9.777 -0.422,2.402 -1.102,4.718 -1.938,6.968 0.645,-0.273 -1.031,4.93 0.836,1.485 -1.996,7.347 -8.543,14.211 -14.566,17.429 0.734,-0.679 1.668,-1.519 1.336,-1.656 -2.996,1.785 -2.473,1.926 -2.903,2.68 -2.437,0.988 -2.597,-0.086 -4.211,-0.004 -4.597,2.437 -5.488,2.176 -9.722,3.711 l 0.195,-0.902 c -3.047,1.015 -3.551,-0.383 -6.844,0 -0.199,0.152 1.059,0.562 2.09,0.714 -2.945,-0.386 -2.808,0.582 -5.691,-0.113 0.711,0.504 1.461,0.832 2.222,1.258 -2.406,-0.149 -5.738,-1.402 -4.71,-0.258 -3.914,-1.754 -10.875,-4.207 -14.778,-7.867 l -0.125,0.82 C 18.91,93.797 12.895,89.531 12.418,86.746 l -0.48,-0.105 C 11.008,85.066 10.406,83.273 9.664,81.656 8.449,79.578 7.883,80.852 8.055,80.531 5.66,75.676 4.469,71.59 3.441,68.246 4.172,67.152 3.457,61.656 3.734,57.262 2.531,35.535 18.98,14.438 36.961,9.578 c 2.637,-0.949 6.551,-0.914 9.887,-1.004 -3.934,1.117 -4.442,0.59 -8.27,1.93 -2.766,1.301 -3.371,2.785 -5.328,4.488 l 0.773,-1.375 c -3.839,1.36 -2.234,1.684 -5.355,2.672 l 0.828,1.082 c -1.246,0.094 -3.293,2.094 -3.855,3.207 l -1.364,-0.055 c -1.636,2.02 -2.507,3.473 -2.441,4.602 L 21.395,24.34 c -0.497,0.851 -6.02,7.57 -3.153,6.008 -0.535,0.48 -1.242,0.789 -2.008,2.183 l 0.582,0.664 c -1.375,1.774 -2.535,4.051 -2.445,4.805 0.734,-0.996 1.242,-1.18 1.746,-1.352 -3.476,8.633 -3.672,0.481 -6.305,8.793 l 0.551,0.043 c -0.425,0.641 -0.683,1.34 -1.027,2.028 l 0.242,2.418 c -2.504,2.89 -0.695,12.312 -0.336,17.476 0.25,2.102 2.09,4.344 3.488,7.844 l -0.851,0.148 c 1.633,2.84 9.309,11.422 12.863,10.981 1.723,2.164 -0.34,0.008 -0.676,0.551 3.782,3.914 4.973,2.765 7.524,3.468 2.758,1.637 -2.36,-0.632 -1.055,0.625 4.762,1.219 3.375,2.766 9.582,3.383 0.656,-0.375 -1.519,-0.574 -2.066,-1.058 3.969,1.941 12.554,1.5 18.129,-1.075 6.468,-3.027 13.738,-11.964 14.031,-20.378 l 0.324,-0.09 c -0.164,-3.34 0.512,-7.211 -0.66,-10.754 l 0.797,1.676" />
          <path
             inkscape:connector-curvature="0"
             id="path4604"
             style="fill:#d70751;fill-opacity:1;fill-rule:nonzero;stroke:none"
             d="M 31.438,51.375 31.215,50.27 c 1.039,-1.415 1.863,-2.938 3.187,-4.036 -0.953,1.856 -1.664,2.621 -2.964,5.141" />
          <path
             inkscape:connector-curvature="0"
             id="path4606"
             style="fill:#d70751;fill-opacity:1;fill-rule:nonzero;stroke:none"
             d="m 33.891,51.473 c -0.547,0.609 -0.875,1.339 -1.239,2.07 0.348,-1.281 1.063,-2.387 1.727,-3.504 l -0.488,1.434" />
          <path
             inkscape:connector-curvature="0"
             id="path4608"
             style="fill:#d70751;fill-opacity:1;fill-rule:nonzero;stroke:none"
             d="m 77.336,60.918 -0.234,-0.582 c -0.422,-3.027 -1.344,-6.02 -2.754,-8.789 1.558,2.926 2.562,6.125 2.988,9.371" />
          <path
             inkscape:connector-curvature="0"
             id="path4610"
             style="fill:#d70751;fill-opacity:1;fill-rule:nonzero;stroke:none"
             d="m 43.004,103.457 c 1.07,0.387 2.629,0.215 3.766,0.469 -1.481,-0.121 -2.95,-0.196 -4.407,-0.383 l 0.641,-0.086" />
          <path
             inkscape:connector-curvature="0"
             id="path4612"
             style="fill:#d70751;fill-opacity:1;fill-rule:nonzero;stroke:none"
             d="M 5.5,83.512 C 5.742,81.234 3.785,80.348 5.934,81.852 7.086,84.449 5.48,82.566 5.5,83.512" />
          <path
             inkscape:connector-curvature="0"
             id="path4614"
             style="fill:#d70751;fill-opacity:1;fill-rule:nonzero;stroke:none"
             d="m 2.969,72.965 c 0.496,1.523 0.59,2.426 0.777,3.316 C 2.379,74.527 3.113,74.152 2.969,72.965" />
        </g>
      </g>
    </g>
  </g>
  <g
     inkscape:groupmode="layer"
     id="layer4"
     inkscape:label="Calque 4"
     style="display:inline;filter:url(#filter6830)"
     transform="translate(0,10)" />
  <g
     inkscape:groupmode="layer"
     id="layer5"
     inkscape:label="Calque 5"
     transform="translate(0,10)"
     style="display:inline">
    <flowRoot
       xml:space="preserve"
       id="flowRoot6853"
       style="font-style:normal;font-weight:normal;font-size:29.33333397px;line-height:25px;font-family:Sans;letter-spacing:0px;word-spacing:0px;fill:#000000;fill-opacity:1;stroke:none;stroke-width:1px;stroke-linecap:butt;stroke-linejoin:miter;stroke-opacity:1"
       transform="scale(0.26458333)"><flowRegion
         id="flowRegion6855"><rect
           id="rect6857"
           width="1081.8734"
           height="39.59798"
           x="12.727922"
           y="283.4967" /></flowRegion><flowPara
         id="flowPara6859" /></flowRoot>    <flowRoot
       xml:space="preserve"
       id="flowRoot6897"
       style="font-style:normal;font-weight:normal;font-size:29.33333397px;line-height:25px;font-family:Sans;letter-spacing:0px;word-spacing:0px;fill:#000000;fill-opacity:1;stroke:none;stroke-width:1px;stroke-linecap:butt;stroke-linejoin:miter;stroke-opacity:1"
       transform="scale(0.26458333)"><flowRegion
         id="flowRegion6899"><rect
           id="rect6901"
           width="349.31076"
           height="52.325901"
           x="15.556349"
           y="446.13126" /></flowRegion><flowPara
         id="flowPara6903" /></flowRoot>    <flowRoot
       xml:space="preserve"
       id="flowRoot6911"
       style="font-style:normal;font-weight:normal;font-size:29.33333397px;line-height:25px;font-family:Sans;letter-spacing:0px;word-spacing:0px;fill:#000000;fill-opacity:1;stroke:none;stroke-width:1px;stroke-linecap:butt;stroke-linejoin:miter;stroke-opacity:1"
       transform="scale(0.26458333)"><flowRegion
         id="flowRegion6913"><rect
           id="rect6915"
           width="994.94507"
           height="52.790344"
           x="104.6518"
           y="504.11401" /></flowRegion><flowPara
         id="flowPara6917" /></flowRoot>    <g
       id="g7601">
      <rect
         y="85.316788"
         x="35"
         height="5.7997489"
         width="1.2160765"
         id="rect6851"
         style="opacity:0.63300003;fill:#cccccc;fill-opacity:0.98039216;stroke:none;stroke-width:0;stroke-linecap:round;stroke-linejoin:bevel;stroke-miterlimit:4;stroke-dasharray:none;stroke-dashoffset:0;stroke-opacity:1;paint-order:markers stroke fill" />
      <flowRoot
         transform="matrix(0.26458333,0,0,0.26458333,16.133564,-47.535008)"
         style="font-style:normal;font-variant:normal;font-weight:bold;font-stretch:normal;font-size:40px;line-height:25px;font-family:Berylium;-inkscape-font-specification:'Berylium, Bold';font-variant-ligatures:normal;font-variant-caps:normal;font-variant-numeric:normal;font-feature-settings:normal;text-align:start;letter-spacing:0px;word-spacing:0px;writing-mode:lr-tb;text-anchor:start;fill:#000000;fill-opacity:1;stroke:none;stroke-width:1px;stroke-linecap:butt;stroke-linejoin:miter;stroke-opacity:1"
         id="flowRoot6919"
         xml:space="preserve"><flowRegion
           id="flowRegion6921"><rect
             y="498.45715"
             x="88.034798"
             height="36.769562"
             width="983.93909"
             id="rect6923" /></flowRegion><flowPara
           style="font-style:italic;font-variant:normal;font-weight:normal;font-stretch:normal;font-size:26.66666794px;font-family:Berylium;-inkscape-font-specification:'Berylium, Italic';font-variant-ligatures:normal;font-variant-caps:normal;font-variant-numeric:normal;font-feature-settings:normal;text-align:start;writing-mode:lr-tb;text-anchor:start"
           id="flowPara6925">Introduction, schedule and practical information…</flowPara></flowRoot>    </g>
    <g
       id="g7594">
      <flowRoot
         transform="matrix(0.26458333,0,0,0.26458333,17.487979,-0.79323013)"
         style="font-style:normal;font-variant:normal;font-weight:bold;font-stretch:normal;font-size:40px;line-height:37px;font-family:Berylium;-inkscape-font-specification:'Berylium, Bold';font-variant-ligatures:normal;font-variant-caps:normal;font-variant-numeric:normal;font-feature-settings:normal;text-align:start;letter-spacing:0px;word-spacing:0px;writing-mode:lr-tb;text-anchor:start;fill:#000000;fill-opacity:1;stroke:none;stroke-width:1px;stroke-linecap:butt;stroke-linejoin:miter;stroke-opacity:1"
         id="flowRoot6919-6"
         xml:space="preserve"><flowRegion
           style="line-height:37px"
           id="flowRegion6921-0"><rect
             style="line-height:37px"
             y="498.45715"
             x="88.034798"
             height="159.22034"
             width="968.75446"
             id="rect6923-4" /></flowRegion><flowPara
           style="font-style:italic;font-variant:normal;font-weight:normal;font-stretch:normal;font-size:26.66666794px;line-height:25px;font-family:Berylium;-inkscape-font-specification:'Berylium, Italic';font-variant-ligatures:normal;font-variant-caps:normal;font-variant-numeric:normal;font-feature-settings:normal;text-align:justify;writing-mode:lr-tb;text-anchor:start"
           id="flowPara6925-5">It might take some efforts to make sure a package and all of its dependencies are candidates for migration to testing; instead of checking individual packages (time-consuming, likely mistakes or omissions), consuming britney's excuses file makes it easy to extract clusters/graphs of related packages.</flowPara></flowRoot>      <rect
         y="133.61784"
         x="35"
         height="25.536129"
         width="1.2160765"
         id="rect6851-6"
         style="opacity:0.63300003;fill:#cccccc;fill-opacity:0.98039216;stroke:none;stroke-width:0;stroke-linecap:round;stroke-linejoin:bevel;stroke-miterlimit:4;stroke-dasharray:none;stroke-dashoffset:0;stroke-opacity:1;paint-order:markers stroke fill" />
    </g>
    <text
       xml:space="preserve"
       style="font-style:normal;font-weight:normal;font-size:7.76111126px;line-height:6.61458349px;font-family:Sans;letter-spacing:0px;word-spacing:0px;fill:#000000;fill-opacity:1;stroke:none;stroke-width:0.26458332px;stroke-linecap:butt;stroke-linejoin:miter;stroke-opacity:1"
       x="4.8909516"
       y="245.76579"
       id="text6907-5-1"><tspan
         sodipodi:role="line"
         x="4.8909516"
         y="251.08916"
         style="stroke-width:0.26458332px"
         id="tspan6909-6-6" /></text>
    <flowRoot
       xml:space="preserve"
       id="flowRoot7012"
       style="font-style:normal;font-variant:normal;font-weight:bold;font-stretch:normal;font-size:40px;line-height:25px;font-family:Berylium;-inkscape-font-specification:'Berylium, Bold';font-variant-ligatures:normal;font-variant-caps:normal;font-variant-numeric:normal;font-feature-settings:normal;text-align:start;letter-spacing:0px;word-spacing:0px;writing-mode:lr-tb;text-anchor:start;fill:#000000;fill-opacity:1;stroke:none;stroke-width:1px;stroke-linecap:butt;stroke-linejoin:miter;stroke-opacity:1"
       transform="scale(0.26458333)"><flowRegion
         id="flowRegion7014"><rect
           id="rect7016"
           width="8.485281"
           height="57.982758"
           x="1549.978"
           y="938.27759" /></flowRegion><flowPara
         id="flowPara7018" /></flowRoot>    <flowRoot
       xml:space="preserve"
       id="flowRoot7020"
       style="font-style:normal;font-variant:normal;font-weight:bold;font-stretch:normal;font-size:40px;line-height:25px;font-family:Berylium;-inkscape-font-specification:'Berylium, Bold';font-variant-ligatures:normal;font-variant-caps:normal;font-variant-numeric:normal;font-feature-settings:normal;text-align:start;letter-spacing:0px;word-spacing:0px;writing-mode:lr-tb;text-anchor:start;fill:#000000;fill-opacity:1;stroke:none;stroke-width:1px;stroke-linecap:butt;stroke-linejoin:miter;stroke-opacity:1"
       transform="scale(0.26458333)"><flowRegion
         id="flowRegion7022"><rect
           id="rect7024"
           width="26.870058"
           height="86.267029"
           x="1530.1791"
           y="939.69177" /></flowRegion><flowPara
         id="flowPara7026" /></flowRoot>    <g
       id="g7587">
      <flowRoot
         transform="matrix(0.26458333,0,0,0.26458333,17.247663,70.713405)"
         style="font-style:normal;font-variant:normal;font-weight:bold;font-stretch:normal;font-size:40px;line-height:25px;font-family:Berylium;-inkscape-font-specification:'Berylium, Bold';font-variant-ligatures:normal;font-variant-caps:normal;font-variant-numeric:normal;font-feature-settings:normal;text-align:start;letter-spacing:0px;word-spacing:0px;writing-mode:lr-tb;text-anchor:start;fill:#000000;fill-opacity:1;stroke:none;stroke-width:1px;stroke-linecap:butt;stroke-linejoin:miter;stroke-opacity:1"
         id="flowRoot6919-6-3"
         xml:space="preserve"><flowRegion
           style="line-height:25px"
           id="flowRegion6921-0-4"><rect
             ry="0"
             style="line-height:25px"
             y="498.45715"
             x="88.034798"
             height="197.57568"
             width="968.33997"
             id="rect6923-4-9" /></flowRegion><flowPara
           id="flowPara7062"
           style="font-style:italic;font-variant:normal;font-weight:normal;font-stretch:normal;font-size:26.66666794px;line-height:25px;font-family:Berylium;-inkscape-font-specification:'Berylium, Italic';font-variant-ligatures:normal;font-variant-caps:normal;font-variant-numeric:normal;font-feature-settings:normal;text-align:justify;writing-mode:lr-tb;text-anchor:start">I co-founded the Raspbian project, to provide an armv6 hard-float variant of Debian, to do this local changes were needed in a number of packages and manually bringing these forward to the new versions from Debian rapidly became a drag.</flowPara><flowPara
           id="flowPara7064"
           style="font-style:italic;font-variant:normal;font-weight:normal;font-stretch:normal;font-size:26.66666794px;line-height:25px;font-family:Berylium;-inkscape-font-specification:'Berylium, Italic';font-variant-ligatures:normal;font-variant-caps:normal;font-variant-numeric:normal;font-feature-settings:normal;text-align:justify;writing-mode:lr-tb;text-anchor:start">Therefore I developed the autoforwardporter tool to automate this process.</flowPara><flowPara
           id="flowPara7264"
           style="font-style:italic;font-variant:normal;font-weight:normal;font-stretch:normal;font-size:26.66666794px;line-height:25px;font-family:Berylium;-inkscape-font-specification:'Berylium, Italic';font-variant-ligatures:normal;font-variant-caps:normal;font-variant-numeric:normal;font-feature-settings:normal;text-align:justify;writing-mode:lr-tb;text-anchor:start">I later took steps to generalise the tool so it would be useable by projects other than Raspbian.</flowPara></flowRoot>      <rect
         y="203.03601"
         x="35"
         height="37.04356"
         width="1.2160765"
         id="rect6851-6-1"
         style="opacity:0.63300003;fill:#cccccc;fill-opacity:0.98039216;stroke:none;stroke-width:0;stroke-linecap:round;stroke-linejoin:bevel;stroke-miterlimit:4;stroke-dasharray:none;stroke-dashoffset:0;stroke-opacity:1;paint-order:markers stroke fill" />
    </g>
    <flowRoot
       transform="matrix(0.26458333,0,0,0.26458333,0.97371575,82.313074)"
       xml:space="preserve"
       id="flowRoot7030-3"
       style="font-style:normal;font-variant:normal;font-weight:bold;font-stretch:normal;font-size:40px;line-height:39px;font-family:Berylium;-inkscape-font-specification:'Berylium, Bold';font-variant-ligatures:normal;font-variant-caps:normal;font-variant-numeric:normal;font-feature-settings:normal;text-align:start;letter-spacing:0px;word-spacing:0px;writing-mode:lr-tb;text-anchor:start;fill:#000000;fill-opacity:1;stroke:none;stroke-width:1px;stroke-linecap:butt;stroke-linejoin:miter;stroke-opacity:1"><flowRegion
         id="flowRegion7032-6"
         style="line-height:39px"><rect
           id="rect7034-5"
           width="1098.8439"
           height="80.610146"
           x="12.727922"
           y="874.638"
           style="line-height:39px" /></flowRegion><flowPara
         id="flowPara7036-9" /></flowRoot>    <g
       id="g7578"
       transform="translate(0,-4.2333333)">
      <flowRoot
         transform="matrix(0.26458333,0,0,0.26458333,16.957569,177.59185)"
         style="font-style:normal;font-variant:normal;font-weight:bold;font-stretch:normal;font-size:40px;line-height:25px;font-family:Berylium;-inkscape-font-specification:'Berylium, Bold';font-variant-ligatures:normal;font-variant-caps:normal;font-variant-numeric:normal;font-feature-settings:normal;text-align:start;letter-spacing:0px;word-spacing:0px;writing-mode:lr-tb;text-anchor:start;fill:#000000;fill-opacity:1;stroke:none;stroke-width:1px;stroke-linecap:butt;stroke-linejoin:miter;stroke-opacity:1"
         id="flowRoot6919-6-3-9"
         xml:space="preserve"><flowRegion
           style="line-height:25px"
           id="flowRegion6921-0-4-0"><rect
             ry="0"
             style="line-height:25px"
             y="498.45715"
             x="88.034798"
             height="118.79388"
             width="970.4364"
             id="rect6923-4-9-0" /></flowRegion><flowPara
           id="flowPara7064-1"
           style="font-style:italic;font-variant:normal;font-weight:normal;font-stretch:normal;font-size:26.66666794px;line-height:25px;font-family:Berylium;-inkscape-font-specification:'Berylium, Italic';font-variant-ligatures:normal;font-variant-caps:normal;font-variant-numeric:normal;font-feature-settings:normal;text-align:justify;writing-mode:lr-tb;text-anchor:start">On June 2014, Freexian invoiced the first LTS sponsors. 5 years later, a small retrospective is in order.</flowPara><flowPara
           id="flowPara7262"
           style="font-style:italic;font-variant:normal;font-weight:normal;font-stretch:normal;font-size:26.66666794px;line-height:25px;font-family:Berylium;-inkscape-font-specification:'Berylium, Italic';font-variant-ligatures:normal;font-variant-caps:normal;font-variant-numeric:normal;font-feature-settings:normal;text-align:justify;writing-mode:lr-tb;text-anchor:start">From there we will question ourselves on why LTS was so successful and whether the Debian community can leverage money to pay contributors at a larger scale.</flowPara></flowRoot>      <rect
         y="310.97281"
         x="35"
         height="21.15526"
         width="1.2160765"
         id="rect6851-6-1-6"
         style="opacity:0.63300003;fill:#cccccc;fill-opacity:0.98039216;stroke:none;stroke-width:0;stroke-linecap:round;stroke-linejoin:bevel;stroke-miterlimit:4;stroke-dasharray:none;stroke-dashoffset:0;stroke-opacity:1;paint-order:markers stroke fill" />
    </g>
    <flowRoot
       xml:space="preserve"
       id="flowRoot4603-3"
       style="font-style:normal;font-weight:normal;font-size:29.33333397px;line-height:25px;font-family:Sans;letter-spacing:0px;word-spacing:0px;fill:#000000;fill-opacity:1;stroke:none;stroke-width:1px;stroke-linecap:butt;stroke-linejoin:miter;stroke-opacity:1;filter:url(#filter6830);enable-background:new"
       transform="matrix(0.26458333,0,0,0.26458333,-113.4284,-29.802302)"><flowRegion
         id="flowRegion4605-9"
         style="fill:#000000"><rect
           id="rect4607-0"
           width="829.42932"
           height="140"
           x="793.57141"
           y="150.51965"
           style="fill:#000000" /></flowRegion><flowPara
         id="flowPara4609-4"
         style="font-style:normal;font-variant:normal;font-weight:bold;font-stretch:normal;font-size:80px;font-family:'Amatic SC';-inkscape-font-specification:'Amatic SC, Bold';font-variant-ligatures:normal;font-variant-caps:normal;font-variant-numeric:normal;font-feature-settings:normal;text-align:start;writing-mode:lr-tb;text-anchor:start;fill:#000000">Saturday morning</flowPara></flowRoot>    <g
       id="g7614">
      <text
         id="text6907-6"
         y="53.802731"
         x="39.604889"
         style="font-style:normal;font-weight:normal;font-size:7.76111126px;line-height:6.61458349px;font-family:Sans;letter-spacing:0px;word-spacing:0px;fill:#000000;fill-opacity:1;stroke:none;stroke-width:0.26458332px;stroke-linecap:butt;stroke-linejoin:miter;stroke-opacity:1;enable-background:new"
         xml:space="preserve"><tspan
           id="tspan6909-3"
           style="font-style:normal;font-variant:normal;font-weight:bold;font-stretch:normal;font-size:9.87777805px;font-family:Berylium;-inkscape-font-specification:'Berylium, Bold';font-variant-ligatures:normal;font-variant-caps:normal;font-variant-numeric:normal;font-feature-settings:normal;text-align:start;writing-mode:lr-tb;text-anchor:start;stroke-width:0.26458332px"
           y="53.802731"
           x="39.604889"
           sodipodi:role="line">French breakfast at the bar</tspan></text>
      <text
         id="text6907-6-7"
         y="53.308842"
         x="36.766003"
         style="font-style:normal;font-weight:normal;font-size:7.76111126px;line-height:6.61458349px;font-family:Sans;text-align:end;letter-spacing:0px;word-spacing:0px;text-anchor:end;fill:#000000;fill-opacity:1;stroke:none;stroke-width:0.26458332px;stroke-linecap:butt;stroke-linejoin:miter;stroke-opacity:1;enable-background:new"
         xml:space="preserve"><tspan
           id="tspan6502"
           style="font-style:normal;font-variant:normal;font-weight:bold;font-stretch:normal;font-size:9.87777805px;font-family:Berylium;-inkscape-font-specification:'Berylium, Bold';font-variant-ligatures:normal;font-variant-caps:normal;font-variant-numeric:normal;font-feature-settings:normal;text-align:end;writing-mode:lr-tb;text-anchor:end;stroke-width:0.26458332px"
           y="53.308842"
           x="36.766003"
           sodipodi:role="line">08:30 –</tspan></text>
    </g>
    <g
       id="g7608">
      <text
         id="text6907"
         y="80.515495"
         x="40.281681"
         style="font-style:normal;font-weight:normal;font-size:7.76111126px;line-height:6.61458302px;font-family:Sans;letter-spacing:0px;word-spacing:0px;fill:#000000;fill-opacity:1;stroke:none;stroke-width:0.26458332px;stroke-linecap:butt;stroke-linejoin:miter;stroke-opacity:1"
         xml:space="preserve"><tspan
           style="font-style:normal;font-variant:normal;font-weight:bold;font-stretch:normal;font-size:9.87777805px;font-family:Berylium;-inkscape-font-specification:'Berylium, Bold';font-variant-ligatures:normal;font-variant-caps:normal;font-variant-numeric:normal;font-feature-settings:normal;text-align:start;writing-mode:lr-tb;text-anchor:start;stroke-width:0.26458332px"
           y="80.515495"
           x="40.281681"
           id="tspan6905"
           sodipodi:role="line">Welcome talk</tspan><tspan
           id="tspan6909"
           style="font-style:normal;font-variant:normal;font-weight:bold;font-stretch:normal;font-size:9.87777805px;font-family:Berylium;-inkscape-font-specification:'Berylium, Bold';font-variant-ligatures:normal;font-variant-caps:normal;font-variant-numeric:normal;font-feature-settings:normal;text-align:start;writing-mode:lr-tb;text-anchor:start;stroke-width:0.26458332px"
           y="87.130081"
           x="40.281681"
           sodipodi:role="line" /></text>
      <text
         id="text6907-6-7-8"
         y="80.505615"
         x="36.766003"
         style="font-style:normal;font-weight:normal;font-size:7.76111126px;line-height:6.61458349px;font-family:Sans;text-align:end;letter-spacing:0px;word-spacing:0px;text-anchor:end;fill:#000000;fill-opacity:1;stroke:none;stroke-width:0.26458332px;stroke-linecap:butt;stroke-linejoin:miter;stroke-opacity:1;enable-background:new"
         xml:space="preserve"><tspan
           id="tspan6502-1"
           style="font-style:normal;font-variant:normal;font-weight:bold;font-stretch:normal;font-size:9.87777805px;font-family:Berylium;-inkscape-font-specification:'Berylium, Bold';font-variant-ligatures:normal;font-variant-caps:normal;font-variant-numeric:normal;font-feature-settings:normal;text-align:end;writing-mode:lr-tb;text-anchor:end;stroke-width:0.26458332px"
           y="80.505615"
           x="36.766003"
           sodipodi:role="line">09:45 –</tspan></text>
    </g>
    <g
       id="g7621">
      <text
         id="text6907-5"
         y="117.21684"
         x="40.463558"
         style="font-style:normal;font-weight:normal;font-size:7.76111126px;line-height:6.61458349px;font-family:Sans;letter-spacing:0px;word-spacing:0px;fill:#000000;fill-opacity:1;stroke:none;stroke-width:0.26458332px;stroke-linecap:butt;stroke-linejoin:miter;stroke-opacity:1"
         xml:space="preserve"><tspan
           y="117.21684"
           x="40.463558"
           style="font-style:normal;font-variant:normal;font-weight:bold;font-stretch:normal;font-size:9.87777805px;line-height:10.58333302px;font-family:Berylium;-inkscape-font-specification:'Berylium Bold'"
           id="tspan4628"
           sodipodi:role="line">Migration to testing and visualization</tspan><tspan
           y="127.80018"
           x="40.463558"
           style="font-style:italic;font-variant:normal;font-weight:bold;font-stretch:normal;font-size:9.87777805px;line-height:10.58333302px;font-family:Berylium;-inkscape-font-specification:'Berylium Bold Italic'"
           id="tspan4630"
           sodipodi:role="line">by Cyril Brulebois [En]</tspan></text>
      <text
         id="text6907-6-7-8-0"
         y="116.65381"
         x="36.766003"
         style="font-style:normal;font-weight:normal;font-size:7.76111126px;line-height:6.61458349px;font-family:Sans;text-align:end;letter-spacing:0px;word-spacing:0px;text-anchor:end;fill:#000000;fill-opacity:1;stroke:none;stroke-width:0.26458332px;stroke-linecap:butt;stroke-linejoin:miter;stroke-opacity:1;enable-background:new"
         xml:space="preserve"><tspan
           id="tspan6502-1-3"
           style="font-style:normal;font-variant:normal;font-weight:bold;font-stretch:normal;font-size:9.87777805px;font-family:Berylium;-inkscape-font-specification:'Berylium, Bold';font-variant-ligatures:normal;font-variant-caps:normal;font-variant-numeric:normal;font-feature-settings:normal;text-align:end;writing-mode:lr-tb;text-anchor:end;stroke-width:0.26458332px"
           y="116.65381"
           x="36.766003"
           sodipodi:role="line">10:00 –</tspan></text>
    </g>
    <g
       id="g7630"
       transform="translate(0,1.5875)">
      <flowRoot
         transform="matrix(0.26458333,0,0,0.26458333,36.759099,-54.504239)"
         style="font-style:normal;font-variant:normal;font-weight:bold;font-stretch:normal;font-size:40px;line-height:39px;font-family:Berylium;-inkscape-font-specification:'Berylium, Bold';font-variant-ligatures:normal;font-variant-caps:normal;font-variant-numeric:normal;font-feature-settings:normal;text-align:start;letter-spacing:0px;word-spacing:0px;writing-mode:lr-tb;text-anchor:start;fill:#000000;fill-opacity:1;stroke:none;stroke-width:1px;stroke-linecap:butt;stroke-linejoin:miter;stroke-opacity:1"
         id="flowRoot7030"
         xml:space="preserve"><flowRegion
           style="line-height:39px"
           id="flowRegion7032"><rect
             style="line-height:39px"
             y="874.638"
             x="12.727922"
             height="98.58075"
             width="970.90277"
             id="rect7034" /></flowRegion><flowPara
           id="flowPara4632"
           style="font-style:normal;font-variant:normal;font-weight:bold;font-stretch:normal;font-size:37.33333206px;line-height:40px;font-family:Berylium;-inkscape-font-specification:'Berylium, Bold';font-variant-ligatures:normal;font-variant-caps:normal;font-variant-numeric:normal;font-feature-settings:normal;text-align:start;letter-spacing:-0.2px;writing-mode:lr-tb;text-anchor:start">autoforwardportergit ; automating the merging of downstream changes</flowPara><flowPara
           id="flowPara6474"
           style="font-style:italic;font-variant:normal;font-weight:bold;font-stretch:normal;font-size:37.33333206px;line-height:40px;font-family:Berylium;-inkscape-font-specification:'Berylium Bold Italic';font-variant-ligatures:normal;font-variant-caps:normal;font-variant-numeric:normal;font-feature-settings:normal;text-align:start;writing-mode:lr-tb;text-anchor:start">by Peter Michael Green [En]</flowPara></flowRoot>      <text
         id="text6907-6-7-8-9"
         y="184.23106"
         x="36.766003"
         style="font-style:normal;font-weight:normal;font-size:7.76111126px;line-height:6.61458349px;font-family:Sans;text-align:end;letter-spacing:0px;word-spacing:0px;text-anchor:end;fill:#000000;fill-opacity:1;stroke:none;stroke-width:0.26458332px;stroke-linecap:butt;stroke-linejoin:miter;stroke-opacity:1;enable-background:new"
         xml:space="preserve"><tspan
           id="tspan6502-1-2"
           style="font-style:normal;font-variant:normal;font-weight:bold;font-stretch:normal;font-size:9.87777805px;font-family:Berylium;-inkscape-font-specification:'Berylium, Bold';font-variant-ligatures:normal;font-variant-caps:normal;font-variant-numeric:normal;font-feature-settings:normal;text-align:end;writing-mode:lr-tb;text-anchor:end;stroke-width:0.26458332px"
           y="184.23106"
           x="36.766003"
           sodipodi:role="line">10:40 –</tspan></text>
    </g>
    <g
       id="g7644"
       transform="translate(0,-4.2333333)">
      <text
         id="text7135"
         y="293.6362"
         x="40.126694"
         style="font-style:normal;font-variant:normal;font-weight:bold;font-stretch:normal;font-size:10.58333302px;line-height:6.61458302px;font-family:Berylium;-inkscape-font-specification:'Berylium, Bold';font-variant-ligatures:normal;font-variant-caps:normal;font-variant-numeric:normal;font-feature-settings:normal;text-align:start;letter-spacing:0px;word-spacing:0px;writing-mode:lr-tb;text-anchor:start;fill:#000000;fill-opacity:1;stroke:none;stroke-width:0.26458332px;stroke-linecap:butt;stroke-linejoin:miter;stroke-opacity:1"
         xml:space="preserve"><tspan
           style="font-style:normal;font-variant:normal;font-weight:bold;font-stretch:normal;font-size:9.87777805px;line-height:10.58333302px;font-family:Berylium;-inkscape-font-specification:'Berylium, Bold';font-variant-ligatures:normal;font-variant-caps:normal;font-variant-numeric:normal;font-feature-settings:normal;text-align:start;writing-mode:lr-tb;text-anchor:start;stroke-width:0.26458332px"
           y="293.6362"
           x="40.126694"
           id="tspan7133"
           sodipodi:role="line">5 years of Debian LTS funding, what's next?</tspan><tspan
           id="tspan4635"
           style="font-style:normal;font-variant:normal;font-weight:bold;font-stretch:normal;font-size:9.87777805px;line-height:10.58333302px;font-family:Berylium;-inkscape-font-specification:'Berylium, Bold';font-variant-ligatures:normal;font-variant-caps:normal;font-variant-numeric:normal;font-feature-settings:normal;text-align:start;writing-mode:lr-tb;text-anchor:start;stroke-width:0.26458332px"
           y="304.21954"
           x="40.126694"
           sodipodi:role="line"><tspan
             id="tspan4620"
             style="font-style:italic;font-variant:normal;font-weight:bold;font-stretch:normal;font-size:9.87777805px;line-height:10.58333302px;font-family:Berylium;-inkscape-font-specification:'Berylium, Bold Italic';font-variant-ligatures:normal;font-variant-caps:normal;font-variant-numeric:normal;font-feature-settings:normal;text-align:start;writing-mode:lr-tb;text-anchor:start">by Raphaël Hertzog [En]</tspan></tspan></text>
      <text
         id="text6907-6-7-8-7"
         y="293.89023"
         x="36.766003"
         style="font-style:normal;font-weight:normal;font-size:7.76111126px;line-height:6.61458349px;font-family:Sans;text-align:end;letter-spacing:0px;word-spacing:0px;text-anchor:end;fill:#000000;fill-opacity:1;stroke:none;stroke-width:0.26458332px;stroke-linecap:butt;stroke-linejoin:miter;stroke-opacity:1;enable-background:new"
         xml:space="preserve"><tspan
           id="tspan6502-1-4"
           style="font-style:normal;font-variant:normal;font-weight:bold;font-stretch:normal;font-size:9.87777805px;font-family:Berylium;-inkscape-font-specification:'Berylium, Bold';font-variant-ligatures:normal;font-variant-caps:normal;font-variant-numeric:normal;font-feature-settings:normal;text-align:end;writing-mode:lr-tb;text-anchor:end;stroke-width:0.26458332px"
           y="293.89023"
           x="36.766003"
           sodipodi:role="line">11:40 –</tspan></text>
    </g>
    <g
       id="g7636"
       transform="translate(0,-5.2916667)">
      <text
         id="text6907-6-7-8-6"
         y="271.25797"
         x="36.766003"
         style="font-style:normal;font-weight:normal;font-size:7.76111126px;line-height:6.61458349px;font-family:Sans;text-align:end;letter-spacing:0px;word-spacing:0px;text-anchor:end;fill:#000000;fill-opacity:1;stroke:none;stroke-width:0.26458332px;stroke-linecap:butt;stroke-linejoin:miter;stroke-opacity:1;enable-background:new"
         xml:space="preserve"><tspan
           id="tspan6502-1-6"
           style="font-style:normal;font-variant:normal;font-weight:bold;font-stretch:normal;font-size:9.87777805px;font-family:Berylium;-inkscape-font-specification:'Berylium, Bold';font-variant-ligatures:normal;font-variant-caps:normal;font-variant-numeric:normal;font-feature-settings:normal;text-align:end;writing-mode:lr-tb;text-anchor:end;stroke-width:0.26458332px"
           y="271.25797"
           x="36.766003"
           sodipodi:role="line">11:25 –</tspan></text>
      <text
         id="text6907-6-3"
         y="271.26785"
         x="39.604889"
         style="font-style:normal;font-weight:normal;font-size:7.76111126px;line-height:6.61458349px;font-family:Sans;letter-spacing:0px;word-spacing:0px;fill:#000000;fill-opacity:1;stroke:none;stroke-width:0.26458332px;stroke-linecap:butt;stroke-linejoin:miter;stroke-opacity:1;enable-background:new"
         xml:space="preserve"><tspan
           id="tspan6594"
           style="font-style:normal;font-variant:normal;font-weight:bold;font-stretch:normal;font-size:9.87777805px;font-family:Berylium;-inkscape-font-specification:'Berylium, Bold';font-variant-ligatures:normal;font-variant-caps:normal;font-variant-numeric:normal;font-feature-settings:normal;text-align:start;writing-mode:lr-tb;text-anchor:start;stroke-width:0.26458332px"
           y="271.26785"
           x="39.604889"
           sodipodi:role="line">Break</tspan></text>
    </g>
    <g
       id="g7650"
       transform="translate(0,-5.2916667)">
      <text
         id="text6907-6-7-8-6-7"
         y="362.61026"
         x="36.766003"
         style="font-style:normal;font-weight:normal;font-size:7.76111126px;line-height:6.61458349px;font-family:Sans;text-align:end;letter-spacing:0px;word-spacing:0px;text-anchor:end;fill:#000000;fill-opacity:1;stroke:none;stroke-width:0.26458332px;stroke-linecap:butt;stroke-linejoin:miter;stroke-opacity:1;enable-background:new"
         xml:space="preserve"><tspan
           id="tspan6502-1-6-7"
           style="font-style:normal;font-variant:normal;font-weight:bold;font-stretch:normal;font-size:9.87777805px;font-family:Berylium;-inkscape-font-specification:'Berylium, Bold';font-variant-ligatures:normal;font-variant-caps:normal;font-variant-numeric:normal;font-feature-settings:normal;text-align:end;writing-mode:lr-tb;text-anchor:end;stroke-width:0.26458332px"
           y="362.61026"
           x="36.766003"
           sodipodi:role="line">12:15 –</tspan></text>
      <text
         id="text6907-6-3-9"
         y="362.62015"
         x="39.604889"
         style="font-style:normal;font-weight:normal;font-size:7.76111126px;line-height:6.61458349px;font-family:Sans;letter-spacing:0px;word-spacing:0px;fill:#000000;fill-opacity:1;stroke:none;stroke-width:0.26458332px;stroke-linecap:butt;stroke-linejoin:miter;stroke-opacity:1;enable-background:new"
         xml:space="preserve"><tspan
           id="tspan6594-4"
           style="font-style:normal;font-variant:normal;font-weight:bold;font-stretch:normal;font-size:9.87777805px;font-family:Berylium;-inkscape-font-specification:'Berylium, Bold';font-variant-ligatures:normal;font-variant-caps:normal;font-variant-numeric:normal;font-feature-settings:normal;text-align:start;writing-mode:lr-tb;text-anchor:start;stroke-width:0.26458332px"
           y="362.62015"
           x="39.604889"
           sodipodi:role="line">Vegetarian lunch at the bar</tspan></text>
    </g>
  </g>
</svg>
