{
    "author": "OpenStack Contributors",
    "dependencies": [
        {
            "name": "puppetlabs/inifile",
            "version_requirement": ">=2.0.0 <3.0.0"
        },
        {
            "name": "puppetlabs/stdlib",
            "version_requirement": ">=5.0.0 <7.0.0"
        },
        {
            "name": "puppet/rabbitmq",
            "version_requirement": ">=8.4.0 <9.0.0"
        },
        {
            "name": "puppetlabs/mysql",
            "version_requirement": ">=6.0.0 <11.0.0"
        },
        {
            "name": "openstack/openstacklib",
            "version_requirement": ">=16.3.0 <17.0.0"
        },
        {
            "name": "openstack/oslo",
            "version_requirement": ">=16.3.0 <17.0.0"
        },
        {
            "name": "openstack/keystone",
            "version_requirement": ">=16.3.0 <17.0.0"
        }
    ],
    "description": "Installs and configures OpenStack Congress.",
    "issues_url": "https://bugs.launchpad.net/puppet-congress",
    "license": "Apache-2.0",
    "name": "openstack-congress",
    "operatingsystem_support": [
        {
            "operatingsystem": "Debian",
            "operatingsystemrelease": [
                "9"
            ]
        },
        {
            "operatingsystem": "Fedora",
            "operatingsystemrelease": [
                "24"
            ]
        },
        {
            "operatingsystem": "RedHat",
            "operatingsystemrelease": [
                "8"
            ]
        },
        {
            "operatingsystem": "CentOS",
            "operatingsystemrelease": [
                "8"
            ]
        },
        {
            "operatingsystem": "Ubuntu",
            "operatingsystemrelease": [
                "18.04"
            ]
        }
    ],
    "project_page": "https://launchpad.net/puppet-congress",
    "requirements": [
        {
            "name": "puppet",
            "version_requirement": ">= 5.0.0 < 7.0.0"
        }
    ],
    "source": "git://github.com/openstack/puppet-congress.git",
    "summary": "Puppet module for OpenStack Congress",
    "version": "16.3.0"
}
