{
  "name": "deric-zookeeper",
  "version": "0.8.4",
  "author": "Tomas Barton",
  "summary": "Module for managing Apache Zookeeper",
  "license": "Apache-2.0",
  "source": "https://github.com/deric/puppet-zookeeper",
  "project_page": "https://github.com/deric/puppet-zookeeper",
  "issues_url": "https://github.com/deric/puppet-zookeeper/issues",
  "description": "ZooKeeper is a centralized service for maintaining configuration information, naming, providing distributed synchronization, and providing group services.",
  "dependencies": [
    {
      "name": "puppetlabs/stdlib",
      "version_requirement": ">= 2.3.3 < 6.0.0"
    },
    {
      "name": "puppet/archive",
      "version_requirement": ">= 0.4.4 < 4.0.0"
    }
  ],
  "operatingsystem_support": [
    {
      "operatingsystem": "RedHat",
      "operatingsystemrelease": [
        "6",
        "7"
      ]
    },
    {
      "operatingsystem": "CentOS",
      "operatingsystemrelease": [
        "6",
        "7"
      ]
    },
    {
      "operatingsystem": "Debian",
      "operatingsystemrelease": [
        "6",
        "7",
        "8",
        "9"
      ]
    },
    {
      "operatingsystem": "Ubuntu",
      "operatingsystemrelease": [
        "10.04",
        "12.04",
        "14.04",
        "16.04",
        "18.04"
      ]
    }
  ],
  "requirements": [
    {
      "name": "puppet",
      "version_requirement": ">= 3.8.0 < 6.0.0"
    }
  ]
}
