{
  "author": "Frank Wall",
  "dependencies": [
    {
      "name": "puppetlabs/stdlib",
      "version_requirement": ">= 4.1.0"
    },
    {
      "name": "puppetlabs/apt",
      "version_requirement": ">= 2.0.0 < 3.0.0"
    },
    {
      "name": "puppetlabs/mysql",
      "version_requirement": ">=3.8.0"
    },
    {
      "name": "puppetlabs/firewall",
      "version_requirement": ">=1.0.0"
    },
    {
      "name": "puppetlabs/xinetd",
      "version_requirement": ">=1.3.0"
    }
  ],
  "description": "Install/configure MySQL with Galera/XtraDB cluster support",
  "license": "Apache-2.0",
  "name": "fraenki-galera",
  "operatingsystem_support": [
    {
    "operatingsystem":"Debian"
    },
    {
    "operatingsystem":"Ubuntu",
    "operatingsystemrelease": ["12.04", "14.04", "16.04"]
    },
    {
    "operatingsystem":"RedHat",
    "operatingsystemrelease": ["6.0", "7.0"]
    },
    {
    "operatingsystem":"CentOS",
    "operatingsystemrelease": ["6.0", "7.0"]
    },
    {
    "operatingsystem":"Scientific"
    },
    {
    "operatingsystem":"OracleLinux"
    }
  ],
  "project_page": "https://github.com/fraenki/puppet-galera",
  "issues_url": "https://github.com/fraenki/puppet-galera/issues",
  "requirements": [],
  "source": "https://github.com/fraenki/puppet-galera",
  "summary": "Install/configure MySQL with Galera",
  "tags": ["mysql", "percona", "mariadb", "galera", "database", "codership", "cluster", "wsrep", "xtradb"],
  "version": "0.7.1"
}

