{
   "abstract" : "Framework for writing test tools that all work together.",
   "author" : [
      "Chad Granum <exodist@cpan.org>"
   ],
   "dynamic_config" : 0,
   "generated_by" : "Dist::Zilla version 5.047, CPAN::Meta::Converter version 2.150005",
   "license" : [
      "perl_5"
   ],
   "meta-spec" : {
      "url" : "http://search.cpan.org/perldoc?CPAN::Meta::Spec",
      "version" : 2
   },
   "name" : "Test2",
   "prereqs" : {
      "configure" : {
         "requires" : {
            "ExtUtils::MakeMaker" : "0"
         }
      },
      "develop" : {
         "requires" : {
            "Test::Pod" : "1.41"
         }
      },
      "runtime" : {
         "requires" : {
            "Carp" : "0",
            "File::Spec" : "0",
            "File::Temp" : "0",
            "PerlIO" : "0",
            "Scalar::Util" : "0",
            "Storable" : "0",
            "perl" : "5.008001",
            "utf8" : "0"
         }
      }
   },
   "release_status" : "stable",
   "resources" : {
      "bugtracker" : {
         "web" : "http://github.com/Test-More/Test2/issues"
      },
      "repository" : {
         "type" : "git",
         "url" : "http://github.com/Test-More/Test2/"
      }
   },
   "version" : "0.000044",
   "x_breaks" : {
      "Net::BitTorrent" : "<= 0.052",
      "Test::Aggregate" : "<= 0.373",
      "Test::Builder::Clutch" : "<= 0.07",
      "Test::Clustericious::Cluster" : "<= 0.31",
      "Test::Dist::VersionSync" : "<= v1.1.4",
      "Test::Exception" : "<= 0.42",
      "Test::Flatten" : "<= 0.11",
      "Test::Group" : "<= 0.20",
      "Test::Modern" : "<= 0.012",
      "Test::More::Prefix" : "<= 0.005",
      "Test::ParallelSubtest" : "<= 0.05",
      "Test::Pretty" : "<= 0.32",
      "Test::SharedFork" : "<= 0.35",
      "Test::Wrapper" : "<= v0.3.0"
   }
}

