{
   "abstract" : "check format is recognized",
   "author" : [
      "Nicholas Bamber <nicholas@periapt.co.uk>"
   ],
   "dynamic_config" : 1,
   "generated_by" : "Module::Build version 0.4, CPAN::Meta::Converter version 2.110440",
   "license" : [
      "perl_5"
   ],
   "meta-spec" : {
      "url" : "http://search.cpan.org/perldoc?CPAN::Meta::Spec",
      "version" : "2"
   },
   "name" : "Debian-LicenseReconcile",
   "prereqs" : {
      "build" : {
         "requires" : {
            "Test::Compile" : 0,
            "Test::More" : 0
         }
      },
      "configure" : {
         "requires" : {
            "Module::Build" : "0.4"
         }
      },
      "runtime" : {
         "requires" : {
            "Debian::Copyright" : "0.2",
            "File::Slurp" : 0,
            "Tree::RedBlack" : 0,
            "perl" : "5.006"
         }
      }
   },
   "release_status" : "stable",
   "resources" : {
      "license" : [
         "http://dev.perl.org/licenses/"
      ]
   },
   "version" : "0.01"
}
