{
   "abstract" : "unknown",
   "author" : [
      "unknown"
   ],
   "dynamic_config" : 1,
   "generated_by" : "ExtUtils::MakeMaker version 7.70, CPAN::Meta::Converter version 2.143240",
   "license" : [
      "artistic_2"
   ],
   "meta-spec" : {
      "url" : "http://search.cpan.org/perldoc?CPAN::Meta::Spec",
      "version" : 2
   },
   "name" : "Carp-Assert-More",
   "no_index" : {
      "directory" : [
         "t",
         "inc"
      ]
   },
   "prereqs" : {
      "build" : {
         "requires" : {
            "ExtUtils::MakeMaker" : "6.64"
         }
      },
      "configure" : {
         "requires" : {
            "ExtUtils::MakeMaker" : "0"
         }
      },
      "runtime" : {
         "requires" : {
            "Carp" : "0",
            "Scalar::Util" : "0",
            "perl" : "5.010001"
         }
      },
      "test" : {
         "requires" : {
            "Test::Exception" : "0",
            "Test::More" : "0.72"
         }
      }
   },
   "release_status" : "stable",
   "resources" : {
      "bugtracker" : {
         "web" : "https://github.com/petdance/carp-assert-more/issues"
      },
      "homepage" : "https://github.com/petdance/carp-assert-more",
      "license" : [
         "https://opensource.org/licenses/artistic-license-2.0.php"
      ]
   },
   "version" : "v2.8.0"
}
