Files: *
Copyright: 2018, Dominique Dumont.
License: Artistic-1.0 or GPL-1+

Files: lib/Software/LicenseMoreUtils/debian-summaries.yml
Copyright: no-info-found
License: Apache-2.0 or Artistic-1.0 or GFDL-1.2+ or GFDL-1.3+ or GPL-1 or GPL-2
