{
   "abstract" : "JSON Web Token",
   "author" : [
      "Karel Miko"
   ],
   "dynamic_config" : 1,
   "generated_by" : "ExtUtils::MakeMaker version 7.64, CPAN::Meta::Converter version 2.150010",
   "license" : [
      "perl_5"
   ],
   "meta-spec" : {
      "url" : "http://search.cpan.org/perldoc?CPAN::Meta::Spec",
      "version" : 2
   },
   "name" : "Crypt-JWT",
   "no_index" : {
      "directory" : [
         "t",
         "inc"
      ]
   },
   "prereqs" : {
      "build" : {
         "requires" : {
            "ExtUtils::MakeMaker" : "0"
         }
      },
      "configure" : {
         "requires" : {
            "ExtUtils::MakeMaker" : "0"
         }
      },
      "runtime" : {
         "requires" : {
            "Compress::Raw::Zlib" : "0",
            "CryptX" : "0.067",
            "Exporter" : "5.57",
            "JSON" : "0",
            "Scalar::Util" : "0",
            "Test::More" : "0.88",
            "perl" : "5.006"
         }
      }
   },
   "release_status" : "stable",
   "resources" : {
      "bugtracker" : {
         "web" : "https://github.com/DCIT/perl-Crypt-JWT/issues"
      },
      "repository" : {
         "url" : "https://github.com/DCIT/perl-Crypt-JWT"
      }
   },
   "version" : "0.036",
   "x_serialization_backend" : "JSON::PP version 4.16"
}
