{
   "abstract" : "Perl extension for Generating 24 bit Images",
   "author" : [
      "Tony Cook <tonyc@cpan.org>, Arnar M. Hrafnkelsson"
   ],
   "dynamic_config" : 0,
   "generated_by" : "ExtUtils::MakeMaker version 7.64, CPAN::Meta::Converter version 2.150010",
   "license" : [
      "perl_5"
   ],
   "meta-spec" : {
      "url" : "http://search.cpan.org/perldoc?CPAN::Meta::Spec",
      "version" : 2
   },
   "name" : "Imager",
   "no_index" : {
      "directory" : [
         "t",
         "inc",
         "PNG",
         "GIF",
         "TIFF",
         "JPEG",
         "W32",
         "FT2",
         "T1"
      ]
   },
   "prereqs" : {
      "build" : {
         "requires" : {
            "Exporter" : "5.57",
            "ExtUtils::MakeMaker" : "0",
            "XSLoader" : "0"
         }
      },
      "configure" : {
         "requires" : {
            "ExtUtils::MakeMaker" : "0"
         }
      },
      "runtime" : {
         "recommends" : {
            "Parse::RecDescent" : "0"
         },
         "requires" : {
            "Exporter" : "5.57",
            "Scalar::Util" : "1.00",
            "Test::More" : "0.99",
            "XSLoader" : "0"
         }
      },
      "test" : {
         "requires" : {
            "Test::More" : "0.99"
         }
      }
   },
   "release_status" : "stable",
   "resources" : {
      "bugtracker" : {
         "web" : "https://github.com/tonycoz/imager/issues"
      },
      "homepage" : "http://imager.perl.org/",
      "repository" : {
         "type" : "git",
         "url" : "git://github.com/tonycoz/imager.git",
         "web" : "https://github.com/tonycoz/imager.git"
      }
   },
   "version" : "1.025",
   "x_serialization_backend" : "JSON::PP version 4.07"
}
