{
   "abstract" : "unknown",
   "author" : [
      "Peter John Acklam <pjacklam@gmail.com>"
   ],
   "dynamic_config" : 1,
   "generated_by" : "ExtUtils::MakeMaker version 7.70, CPAN::Meta::Converter version 2.150010",
   "license" : [
      "perl_5"
   ],
   "meta-spec" : {
      "url" : "http://search.cpan.org/perldoc?CPAN::Meta::Spec",
      "version" : 2
   },
   "name" : "Math-BigInt",
   "no_index" : {
      "directory" : [
         "t",
         "inc"
      ]
   },
   "prereqs" : {
      "build" : {
         "requires" : {}
      },
      "configure" : {
         "requires" : {
            "ExtUtils::MakeMaker" : "6.58"
         }
      },
      "runtime" : {
         "requires" : {
            "Carp" : "1.22",
            "Math::Complex" : "1.36",
            "Scalar::Util" : "0",
            "perl" : "5.006001"
         }
      },
      "test" : {
         "requires" : {
            "Test::More" : "0.94"
         }
      }
   },
   "release_status" : "stable",
   "resources" : {
      "repository" : {
         "type" : "git",
         "url" : "https://github.com/pjacklam/p5-Math-BigInt.git",
         "web" : "https://github.com/pjacklam/p5-Math-BigInt"
      }
   },
   "version" : "2.004001",
   "x_serialization_backend" : "JSON::PP version 4.16"
}
