{
   "abstract" : "Choose items from a list interactively.",
   "author" : [
      "Matthaeus Kiem <cuer2s@gmail.com>"
   ],
   "dynamic_config" : 1,
   "generated_by" : "ExtUtils::MakeMaker version 7.70, CPAN::Meta::Converter version 2.150010",
   "license" : [
      "perl_5"
   ],
   "meta-spec" : {
      "url" : "http://search.cpan.org/perldoc?CPAN::Meta::Spec",
      "version" : 2
   },
   "name" : "Term-Choose",
   "no_index" : {
      "directory" : [
         "t",
         "inc"
      ]
   },
   "prereqs" : {
      "build" : {
         "requires" : {
            "File::Spec::Functions" : "0",
            "FindBin" : "0",
            "Test::Fatal" : "0",
            "Test::More" : "0",
            "lib" : "0"
         }
      },
      "configure" : {
         "requires" : {
            "ExtUtils::MakeMaker" : "0"
         }
      },
      "runtime" : {
         "requires" : {
            "Carp" : "0",
            "Exporter" : "0",
            "constant" : "0",
            "perl" : "5.010000",
            "strict" : "0",
            "warnings" : "0"
         }
      }
   },
   "release_status" : "stable",
   "resources" : {
      "bugtracker" : {
         "web" : "https://github.com/kuerbis/Term-Choose/issues"
      },
      "repository" : {
         "type" : "git",
         "url" : "https://github.com/kuerbis/Term-Choose.git",
         "web" : "https://github.com/kuerbis/Term-Choose"
      }
   },
   "version" : "1.767",
   "x_serialization_backend" : "JSON::PP version 4.16"
}
