{
   "abstract" : "Use REAL UUIDs in Test2",
   "author" : [
      "Chad Granum <exodist@cpan.org>"
   ],
   "dynamic_config" : 0,
   "generated_by" : "Dist::Zilla version 6.032, CPAN::Meta::Converter version 2.150010",
   "license" : [
      "perl_5"
   ],
   "meta-spec" : {
      "url" : "http://search.cpan.org/perldoc?CPAN::Meta::Spec",
      "version" : 2
   },
   "name" : "Test2-Plugin-UUID",
   "prereqs" : {
      "configure" : {
         "requires" : {
            "ExtUtils::MakeMaker" : "0"
         }
      },
      "develop" : {
         "requires" : {
            "Atomic::Pipe" : "0.022",
            "Data::UUID" : "1.227",
            "Data::UUID::MT" : "1.001",
            "Test::Pod" : "1.41",
            "Test::Spelling" : "0.12",
            "UUID" : "0.35"
         }
      },
      "runtime" : {
         "recommends" : {
            "Data::UUID" : "1.227",
            "Data::UUID::MT" : "1.001",
            "UUID" : "0.35"
         },
         "requires" : {
            "Test2::API" : "1.302165",
            "UUID::Tiny" : "1.04",
            "perl" : "5.010000"
         },
         "suggests" : {
            "Data::UUID" : "1.227",
            "Data::UUID::MT" : "1.001",
            "UUID" : "0.35"
         }
      },
      "test" : {
         "requires" : {
            "Test2::Require::Module" : "0.000162",
            "Test2::Util::Table" : "0.000162",
            "Test2::V0" : "0.000162"
         }
      }
   },
   "release_status" : "stable",
   "resources" : {
      "bugtracker" : {
         "web" : "http://github.com/Test-More/Test2-Plugin-UUID/issues"
      },
      "repository" : {
         "type" : "git",
         "url" : "http://github.com/Test-More/Test2-Plugin-UUID/"
      }
   },
   "version" : "0.002009",
   "x_generated_by_perl" : "v5.40.0",
   "x_serialization_backend" : "Cpanel::JSON::XS version 4.38",
   "x_spdx_expression" : "Artistic-1.0-Perl OR GPL-1.0-or-later"
}

