{
   "abstract" : "Pango style markup formatting",
   "author" : [
      "Johan Vromans <jv@cpan.org>"
   ],
   "dynamic_config" : 1,
   "generated_by" : "ExtUtils::MakeMaker version 7.70, CPAN::Meta::Converter version 2.150010",
   "license" : [
      "perl_5"
   ],
   "meta-spec" : {
      "url" : "http://search.cpan.org/perldoc?CPAN::Meta::Spec",
      "version" : 2
   },
   "name" : "Text-Layout",
   "no_index" : {
      "directory" : [
         "t",
         "inc",
         "lib/Text/Layout/PDFAPI2",
         "tests"
      ],
      "file" : [
         "lib/Text/Layout/Cairo.pm",
         "lib/Text/Layout/ElementRole.pm",
         "lib/Text/Layout/Markdown.pm",
         "lib/Text/Layout/Pango.pm",
         "lib/Text/Layout/PDFAPI2.pm"
      ]
   },
   "prereqs" : {
      "build" : {
         "requires" : {
            "ExtUtils::MakeMaker" : "0"
         }
      },
      "configure" : {
         "requires" : {
            "ExtUtils::MakeMaker" : "0"
         }
      },
      "runtime" : {
         "requires" : {
            "Object::Pad" : "0.78",
            "Test::More" : "0",
            "Text::ParseWords" : "0",
            "perl" : "5.026000"
         }
      },
      "test" : {
         "requires" : {
            "Object::Pad" : "0.78",
            "PDF::API2" : "2.036",
            "Text::ParseWords" : "0"
         }
      }
   },
   "provides" : {
      "Text::Layout" : {
         "file" : "lib/Text/Layout.pm",
         "version" : "0.038"
      },
      "Text::Layout::FontConfig" : {
         "file" : "lib/Text/Layout/FontConfig.pm",
         "version" : "0.038"
      },
      "Text::Layout::FontDescriptor" : {
         "file" : "lib/Text/Layout/FontDescriptor.pm",
         "version" : "0.038"
      }
   },
   "release_status" : "stable",
   "resources" : {
      "bugtracker" : {
         "web" : "https://github.com/sciurius/perl-Text-Layout/issues"
      },
      "repository" : {
         "type" : "git",
         "url" : "https://github.com/sciurius/perl-Text-Layout.git",
         "web" : "https://github.com/sciurius/perl-Text-Layout"
      }
   },
   "version" : "0.038",
   "x_serialization_backend" : "JSON::PP version 4.16"
}
