{
  "api": "0",
  "auth": "cpan:TYIL",
  "authors": [
    "Patrick Spek <p.spek@tyil.nl>"
  ],
  "description": "An interface for logging mechanisms to adhere to",
  "license": "LGPL-3.0-only",
  "name": "Log",
  "perl": "6.d",
  "provides": {
    "Log": "lib/Log.rakumod",
    "Log::Implementation": "lib/Log/Implementation.rakumod",
    "Log::Level": "lib/Log/Level.rakumod"
  },
  "source-url": "https://home.tyil.nl/git/raku/Log/",
  "version": "0.3.1"
}
