plain,
"DATE \a\t TIME",
"FIELD	FIELD",
"text concatenated with 'comments'",
"Stop at the variable",
"No comments",
"All comments",
"i18n Tagged comment",
"i18n Tagged comment inside",
"One comment",
"i18n tagged %s",
foo,
bar,
"foo bar",
World,
"No comment",
"Within printf: %s",
placeholder,
"After printf",
