Release to unstable

2 jobs for master in 7 minutes (queued for 3 seconds)
Status Job ID Name Coverage
  Build
failed #352268
build-autotools

00:07:00

failed #352269
build-meson

00:04:50

 
Name Stage Failure
failed
build-autotools Build
make[1]: Entering directory '/builds/pulseaudio-team/pulseaudio/build/src'
PATH=.:/usr/local/sbin:/usr/local/bin:/usr/sbin:/usr/bin:/sbin:/bin ../../src/tests/test-daemon.sh extended-test passthrough-test sync-playback
/bin/bash: ../../src/tests/test-daemon.sh: No such file or directory
Makefile:11704: recipe for target 'check-daemon' failed
make[1]: *** [check-daemon] Error 127
make[1]: Leaving directory '/builds/pulseaudio-team/pulseaudio/build/src'
Makefile:1298: recipe for target 'check-daemon' failed
make: *** [check-daemon] Error 2
ERROR: Job failed: exit code 1
failed
build-meson Build

Full log written to /builds/pulseaudio-team/pulseaudio/build/meson-logs/testlog.txt
$ ninja test-daemon
[0/1] Running external command test-daemon.
/builds/pulseaudio-team/pulseaudio/src/tests/test-daemon.meson.sh: 9: /builds/pulseaudio-team/pulseaudio/src/tests/test-daemon.meson.sh: /builds/pulseaudio-team/pulseaudio/src/tests/test-daemon.sh: not found
FAILED: meson-test-daemon
/usr/local/bin/meson --internal commandrunner /builds/pulseaudio-team/pulseaudio /builds/pulseaudio-team/pulseaudio/build src/tests /usr/local/bin/meson /bin/sh /builds/pulseaudio-team/pulseaudio/src/tests/test-daemon.meson.sh extended-test sync-playback
ninja: build stopped: subcommand failed.
ERROR: Job failed: exit code 1