<?xml version="1.0" encoding="UTF-8" standalone="no"?>
<svg
   viewBox="0 0 48 48"
   version="1.1"
   id="svg6"
   sodipodi:docname="sbLogViewer48.svg"
   width="48"
   height="48"
   inkscape:version="1.1.1 (3bf5ae0d25, 2021-09-20)"
   xmlns:inkscape="http://www.inkscape.org/namespaces/inkscape"
   xmlns:sodipodi="http://sodipodi.sourceforge.net/DTD/sodipodi-0.dtd"
   xmlns="http://www.w3.org/2000/svg"
   xmlns:svg="http://www.w3.org/2000/svg">
  <sodipodi:namedview
     id="namedview8"
     pagecolor="#ffffff"
     bordercolor="#666666"
     borderopacity="1.0"
     inkscape:pageshadow="2"
     inkscape:pageopacity="0.0"
     inkscape:pagecheckerboard="0"
     showgrid="false"
     inkscape:zoom="14.318182"
     inkscape:cx="29.053968"
     inkscape:cy="28.565079"
     inkscape:window-width="2580"
     inkscape:window-height="1080"
     inkscape:window-x="856"
     inkscape:window-y="0"
     inkscape:window-maximized="0"
     inkscape:current-layer="svg6" />
  <defs
     id="defs3051">
    <style
       type="text/css"
       id="current-color-scheme">
      .ColorScheme-Text {
        color:#eff0f1;
      }
      </style>
  </defs>
  <path
     style="fill:currentColor;fill-opacity:1;stroke:none;stroke-width:2.5"
     d="M 4,4 V 6.5 H 44 V 4 Z m 0,5 v 2.5 H 26.5 V 9 Z m 0,10 v 2.5 H 44 V 19 Z m 0,5 v 2.5 H 29 V 24 Z m 0,10 v 2.5 H 44 V 34 Z m 0,5 v 2.5 H 36.5 V 39 Z m 35,2.5 V 44 h 5 v -2.5 z"
     class="ColorScheme-Text"
     id="path4" />
</svg>
