<?xml version="1.0" encoding="UTF-8" standalone="no"?>
<svg
   viewBox="0 0 22 22"
   version="1.1"
   id="svg6"
   sodipodi:docname="unlocked.svg"
   inkscape:version="1.2.2 (b0a8486541, 2022-12-01)"
   xmlns:inkscape="http://www.inkscape.org/namespaces/inkscape"
   xmlns:sodipodi="http://sodipodi.sourceforge.net/DTD/sodipodi-0.dtd"
   xmlns="http://www.w3.org/2000/svg"
   xmlns:svg="http://www.w3.org/2000/svg">
  <sodipodi:namedview
     id="namedview8"
     pagecolor="#ffffff"
     bordercolor="#000000"
     borderopacity="0.25"
     inkscape:showpageshadow="2"
     inkscape:pageopacity="0.0"
     inkscape:pagecheckerboard="0"
     inkscape:deskcolor="#d1d1d1"
     showgrid="false"
     inkscape:zoom="46.681818"
     inkscape:cx="11.492697"
     inkscape:cy="11.26777"
     inkscape:window-width="2580"
     inkscape:window-height="1321"
     inkscape:window-x="861"
     inkscape:window-y="60"
     inkscape:window-maximized="0"
     inkscape:current-layer="svg6" />
  <defs
     id="defs3051">
    <style
       type="text/css"
       id="current-color-scheme">
      .ColorScheme-Text {
        color:#232629;
      }
      </style>
  </defs>
  <path
     style="fill:currentColor;fill-opacity:1;stroke:none;stroke-width:1.29099"
     d="M 11,1 C 8.0453333,1 5.6666667,3.23 5.6666667,6 V 7.25 H 7 V 6.625 C 7,4.20125 8.784,2.25 11,2.25 c 2.216,0 4,1.95125 4,4.375 V 11 H 8.3333333 7 5.6666667 4.3333333 3 V 12.25 21 H 4.3333333 17.666667 19 V 11 H 17.666667 16.333333 V 6 C 16.333333,3.23 13.954667,1 11,1 M 4.3333333,12.25 H 17.666667 v 7.5 H 4.3333333 v -7.5"
     class="ColorScheme-Text"
     id="path4" />
</svg>
