<?xml version="1.0" encoding="UTF-8" standalone="no"?>
<!-- Created with Inkscape (http://www.inkscape.org/) -->

<svg
   width="22"
   height="22"
   viewBox="0 0 5.8208332 5.8208333"
   version="1.1"
   id="svg5"
   inkscape:version="1.2.2 (b0a8486541, 2022-12-01)"
   sodipodi:docname="esc-code.svg"
   xmlns:inkscape="http://www.inkscape.org/namespaces/inkscape"
   xmlns:sodipodi="http://sodipodi.sourceforge.net/DTD/sodipodi-0.dtd"
   xmlns="http://www.w3.org/2000/svg"
   xmlns:svg="http://www.w3.org/2000/svg">
  <sodipodi:namedview
     id="namedview7"
     pagecolor="#ffffff"
     bordercolor="#000000"
     borderopacity="0.25"
     inkscape:showpageshadow="2"
     inkscape:pageopacity="0.0"
     inkscape:pagecheckerboard="0"
     inkscape:deskcolor="#d1d1d1"
     inkscape:document-units="px"
     showgrid="false"
     inkscape:zoom="20.70196"
     inkscape:cx="14.732905"
     inkscape:cy="18.090075"
     inkscape:window-width="1455"
     inkscape:window-height="1236"
     inkscape:window-x="1985"
     inkscape:window-y="144"
     inkscape:window-maximized="0"
     inkscape:current-layer="layer1" />
  <defs
     id="defs2" />
  <g
     inkscape:label="Ebene 1"
     inkscape:groupmode="layer"
     id="layer1">
    <text
       xml:space="preserve"
       style="font-size:4.35523px;fill:#eff0f1;stroke:#eff0f1;stroke-width:0;stroke-linecap:square;stroke-opacity:1;fill-opacity:1"
       x="-0.072079234"
       y="3.7525752"
       id="text2242"
       transform="scale(0.75513551,1.3242656)"><tspan
         sodipodi:role="line"
         id="tspan2240"
         style="stroke:#eff0f1;stroke-width:0;stroke-opacity:1;fill:#eff0f1;fill-opacity:1"
         x="-0.072079234"
         y="3.7525752">ESC</tspan></text>
  </g>
</svg>
