<?xml version="1.0" encoding="UTF-8" standalone="no"?>
<!-- Created with Inkscape (http://www.inkscape.org/) -->
<svg
   xmlns:a="http://ns.adobe.com/AdobeSVGViewerExtensions/3.0/"
   xmlns:dc="http://purl.org/dc/elements/1.1/"
   xmlns:cc="http://web.resource.org/cc/"
   xmlns:rdf="http://www.w3.org/1999/02/22-rdf-syntax-ns#"
   xmlns:svg="http://www.w3.org/2000/svg"
   xmlns="http://www.w3.org/2000/svg"
   xmlns:xlink="http://www.w3.org/1999/xlink"
   xmlns:sodipodi="http://inkscape.sourceforge.net/DTD/sodipodi-0.dtd"
   xmlns:inkscape="http://www.inkscape.org/namespaces/inkscape"
   width="128.00000px"
   height="128.00000px"
   id="svg2"
   sodipodi:version="0.32"
   inkscape:version="0.42"
   sodipodi:docbase="/home/silvestre/nuevos"
   sodipodi:docname="gnome-mime-application-pdf.svg">
  <defs
     id="defs4"><linearGradient
   inkscape:collect="always"
   id="linearGradient3908">
  <stop
     style="stop-color:#000000;stop-opacity:0.59036142"
     offset="0"
     id="stop3910" />
  <stop
     style="stop-color:#000000;stop-opacity:0;"
     offset="1"
     id="stop3912" />
</linearGradient>
<linearGradient
   inkscape:collect="always"
   id="linearGradient3684">
  <stop
     style="stop-color:#000000;stop-opacity:0.34400001"
     offset="0"
     id="stop3686" />
  <stop
     style="stop-color:#000000;stop-opacity:0;"
     offset="1"
     id="stop3688" />
</linearGradient>
<linearGradient
   id="linearGradient3666">
  <stop
     style="stop-color:#ffffff;stop-opacity:0.61016947;"
     offset="0.0000000"
     id="stop3668" />
  <stop
     style="stop-color:#ffffff;stop-opacity:0;"
     offset="1"
     id="stop3670" />
</linearGradient>
<linearGradient
   id="linearGradient3660">
  <stop
     id="stop3662"
     offset="0.0000000"
     style="stop-color:#ffffff;stop-opacity:0.61016947;" />
  <stop
     id="stop3664"
     offset="1"
     style="stop-color:#ffffff;stop-opacity:0;" />
</linearGradient>
<linearGradient
   id="linearGradient3654">
  <stop
     style="stop-color:#ffffff;stop-opacity:0.61016947;"
     offset="0.0000000"
     id="stop3656" />
  <stop
     style="stop-color:#ffffff;stop-opacity:0;"
     offset="1"
     id="stop3658" />
</linearGradient>
<linearGradient
   id="linearGradient3648">
  <stop
     id="stop3650"
     offset="0.0000000"
     style="stop-color:#ffffff;stop-opacity:0.61016947;" />
  <stop
     id="stop3652"
     offset="1"
     style="stop-color:#ffffff;stop-opacity:0;" />
</linearGradient>
<linearGradient
   id="linearGradient3642"
   inkscape:collect="always">
  <stop
     id="stop3644"
     offset="0"
     style="stop-color:#000000;stop-opacity:0.56000000" />
  <stop
     id="stop3646"
     offset="1"
     style="stop-color:#000000;stop-opacity:0;" />
</linearGradient>
<linearGradient
   id="linearGradient3618"
   inkscape:collect="always">
  <stop
     id="stop3620"
     offset="0"
     style="stop-color:#ffffff;stop-opacity:1;" />
  <stop
     id="stop3622"
     offset="1"
     style="stop-color:#ffffff;stop-opacity:0;" />
</linearGradient>
<linearGradient
   inkscape:collect="always"
   id="linearGradient2536">
  <stop
     style="stop-color:#000000;stop-opacity:0.73600000"
     offset="0"
     id="stop2538" />
  <stop
     style="stop-color:#000000;stop-opacity:0;"
     offset="1"
     id="stop2540" />
</linearGradient>
<linearGradient
   id="linearGradient2518">
  <stop
     style="stop-color:#000000;stop-opacity:0.15000001;"
     offset="0.0000000"
     id="stop2520" />
  <stop
     style="stop-color:#000000;stop-opacity:0;"
     offset="1"
     id="stop2522" />
</linearGradient>
<linearGradient
   id="linearGradient2512">
  <stop
     id="stop2514"
     offset="0.0000000"
     style="stop-color:#000000;stop-opacity:0.15000001;" />
  <stop
     id="stop2516"
     offset="1"
     style="stop-color:#000000;stop-opacity:0;" />
</linearGradient>
<linearGradient
   id="linearGradient2506">
  <stop
     style="stop-color:#000000;stop-opacity:0.15000001;"
     offset="0.0000000"
     id="stop2508" />
  <stop
     style="stop-color:#000000;stop-opacity:0;"
     offset="1"
     id="stop2510" />
</linearGradient>
<linearGradient
   id="linearGradient2500">
  <stop
     style="stop-color:#9ed3f7;stop-opacity:1;"
     offset="0"
     id="stop2502" />
  <stop
     style="stop-color:#85b1cf;stop-opacity:1.0000000;"
     offset="1.0000000"
     id="stop2504" />
</linearGradient>
<linearGradient
   id="linearGradient2494">
  <stop
     id="stop2496"
     offset="0"
     style="stop-color:#9ed3f7;stop-opacity:1;" />
  <stop
     id="stop2498"
     offset="1.0000000"
     style="stop-color:#85b1cf;stop-opacity:1.0000000;" />
</linearGradient>
<linearGradient
   id="linearGradient2488">
  <stop
     style="stop-color:#9ed3f7;stop-opacity:1;"
     offset="0"
     id="stop2490" />
  <stop
     style="stop-color:#85b1cf;stop-opacity:1.0000000;"
     offset="1.0000000"
     id="stop2492" />
</linearGradient>
<linearGradient
   id="linearGradient2482">
  <stop
     style="stop-color:#d9d9d9;stop-opacity:1;"
     offset="0"
     id="stop2484" />
  <stop
     style="stop-color:#c2c2c2;stop-opacity:1.0000000;"
     offset="1.0000000"
     id="stop2486" />
</linearGradient>
<linearGradient
   id="linearGradient2476">
  <stop
     id="stop2478"
     offset="0"
     style="stop-color:#d9d9d9;stop-opacity:1;" />
  <stop
     id="stop2480"
     offset="1.0000000"
     style="stop-color:#c2c2c2;stop-opacity:1.0000000;" />
</linearGradient>
<linearGradient
   id="linearGradient2470">
  <stop
     style="stop-color:#d9d9d9;stop-opacity:1;"
     offset="0"
     id="stop2472" />
  <stop
     style="stop-color:#c2c2c2;stop-opacity:1.0000000;"
     offset="1.0000000"
     id="stop2474" />
</linearGradient>
<linearGradient
   inkscape:collect="always"
   id="linearGradient2464">
  <stop
     style="stop-color:#ffffff;stop-opacity:1;"
     offset="0"
     id="stop2466" />
  <stop
     style="stop-color:#ffffff;stop-opacity:0;"
     offset="1"
     id="stop2468" />
</linearGradient>
<linearGradient
   id="linearGradient2446">
  <stop
     id="stop2448"
     offset="0"
     style="stop-color:#ffffff;stop-opacity:1;" />
  <stop
     id="stop2450"
     offset="1.0000000"
     style="stop-color:#dadada;stop-opacity:1.0000000;" />
</linearGradient>
<linearGradient
   id="linearGradient2440">
  <stop
     style="stop-color:#ffffff;stop-opacity:1;"
     offset="0"
     id="stop2442" />
  <stop
     style="stop-color:#dadada;stop-opacity:1.0000000;"
     offset="1.0000000"
     id="stop2444" />
</linearGradient>
<linearGradient
   id="linearGradient6859">
  <stop
     style="stop-color:#000000;stop-opacity:0.68750000;"
     offset="0.0000000"
     id="stop6861" />
  <stop
     style="stop-color:#000000;stop-opacity:0;"
     offset="1"
     id="stop6863" />
</linearGradient>
<linearGradient
   id="linearGradient6853">
  <stop
     id="stop6855"
     offset="0.0000000"
     style="stop-color:#000000;stop-opacity:0.68750000;" />
  <stop
     id="stop6857"
     offset="1"
     style="stop-color:#000000;stop-opacity:0;" />
</linearGradient>
<linearGradient
   id="linearGradient6847">
  <stop
     style="stop-color:#000000;stop-opacity:0.68750000;"
     offset="0.0000000"
     id="stop6849" />
  <stop
     style="stop-color:#000000;stop-opacity:0;"
     offset="1"
     id="stop6851" />
</linearGradient>
<linearGradient
   id="linearGradient6841">
  <stop
     id="stop6843"
     offset="0.0000000"
     style="stop-color:#000000;stop-opacity:0.68750000;" />
  <stop
     id="stop6845"
     offset="1"
     style="stop-color:#000000;stop-opacity:0;" />
</linearGradient>
<linearGradient
   id="linearGradient6835">
  <stop
     style="stop-color:#000000;stop-opacity:0.68750000;"
     offset="0.0000000"
     id="stop6837" />
  <stop
     style="stop-color:#000000;stop-opacity:0;"
     offset="1"
     id="stop6839" />
</linearGradient>
<linearGradient
   id="linearGradient6829">
  <stop
     id="stop6831"
     offset="0.0000000"
     style="stop-color:#000000;stop-opacity:0.68750000;" />
  <stop
     id="stop6833"
     offset="1"
     style="stop-color:#000000;stop-opacity:0;" />
</linearGradient>
<linearGradient
   id="linearGradient6823">
  <stop
     style="stop-color:#ff003c;stop-opacity:1;"
     offset="0"
     id="stop6825" />
  <stop
     style="stop-color:#aa0028;stop-opacity:1.0000000;"
     offset="1.0000000"
     id="stop6827" />
</linearGradient>
<linearGradient
   id="linearGradient6817">
  <stop
     id="stop6819"
     offset="0"
     style="stop-color:#ff003c;stop-opacity:1;" />
  <stop
     id="stop6821"
     offset="1.0000000"
     style="stop-color:#aa0028;stop-opacity:1.0000000;" />
</linearGradient>
<linearGradient
   id="linearGradient6811">
  <stop
     style="stop-color:#ff003c;stop-opacity:1;"
     offset="0"
     id="stop6813" />
  <stop
     style="stop-color:#aa0028;stop-opacity:1.0000000;"
     offset="1.0000000"
     id="stop6815" />
</linearGradient>
<linearGradient
   id="linearGradient6805">
  <stop
     id="stop6807"
     offset="0"
     style="stop-color:#ff003c;stop-opacity:1;" />
  <stop
     id="stop6809"
     offset="1.0000000"
     style="stop-color:#aa0028;stop-opacity:1.0000000;" />
</linearGradient>
<linearGradient
   id="linearGradient6799">
  <stop
     style="stop-color:#ff003c;stop-opacity:1;"
     offset="0"
     id="stop6801" />
  <stop
     style="stop-color:#aa0028;stop-opacity:1.0000000;"
     offset="1.0000000"
     id="stop6803" />
</linearGradient>
<linearGradient
   id="linearGradient6793">
  <stop
     id="stop6795"
     offset="0"
     style="stop-color:#ff003c;stop-opacity:1;" />
  <stop
     id="stop6797"
     offset="1.0000000"
     style="stop-color:#aa0028;stop-opacity:1.0000000;" />
</linearGradient>
<linearGradient
   id="linearGradient6787">
  <stop
     style="stop-color:#ff003c;stop-opacity:1;"
     offset="0"
     id="stop6789" />
  <stop
     style="stop-color:#aa0028;stop-opacity:1.0000000;"
     offset="1.0000000"
     id="stop6791" />
</linearGradient>
<linearGradient
   id="linearGradient6781">
  <stop
     id="stop6783"
     offset="0"
     style="stop-color:#ff003c;stop-opacity:1;" />
  <stop
     id="stop6785"
     offset="1.0000000"
     style="stop-color:#aa0028;stop-opacity:1.0000000;" />
</linearGradient>
<linearGradient
   id="linearGradient6775">
  <stop
     style="stop-color:#e2e2e2;stop-opacity:1;"
     offset="0"
     id="stop6777" />
  <stop
     style="stop-color:#979797;stop-opacity:1.0000000;"
     offset="1.0000000"
     id="stop6779" />
</linearGradient>
<linearGradient
   id="linearGradient6769">
  <stop
     id="stop6771"
     offset="0"
     style="stop-color:#e2e2e2;stop-opacity:1;" />
  <stop
     id="stop6773"
     offset="1.0000000"
     style="stop-color:#979797;stop-opacity:1.0000000;" />
</linearGradient>
<linearGradient
   id="linearGradient6763">
  <stop
     style="stop-color:#e2e2e2;stop-opacity:1;"
     offset="0"
     id="stop6765" />
  <stop
     style="stop-color:#979797;stop-opacity:1.0000000;"
     offset="1.0000000"
     id="stop6767" />
</linearGradient>
<linearGradient
   id="linearGradient6757">
  <stop
     id="stop6759"
     offset="0"
     style="stop-color:#e2e2e2;stop-opacity:1;" />
  <stop
     id="stop6761"
     offset="1.0000000"
     style="stop-color:#979797;stop-opacity:1.0000000;" />
</linearGradient>
<linearGradient
   id="linearGradient6751">
  <stop
     style="stop-color:#e2e2e2;stop-opacity:1;"
     offset="0"
     id="stop6753" />
  <stop
     style="stop-color:#979797;stop-opacity:1.0000000;"
     offset="1.0000000"
     id="stop6755" />
</linearGradient>
<linearGradient
   id="linearGradient6745">
  <stop
     id="stop6747"
     offset="0"
     style="stop-color:#e2e2e2;stop-opacity:1;" />
  <stop
     id="stop6749"
     offset="1.0000000"
     style="stop-color:#979797;stop-opacity:1.0000000;" />
</linearGradient>
<linearGradient
   id="linearGradient6739">
  <stop
     id="stop6741"
     offset="0"
     style="stop-color:#ffe000;stop-opacity:1;" />
  <stop
     id="stop6743"
     offset="1.0000000"
     style="stop-color:#ff9500;stop-opacity:1.0000000;" />
</linearGradient>
<linearGradient
   id="linearGradient6733">
  <stop
     style="stop-color:#ffe000;stop-opacity:1;"
     offset="0"
     id="stop6735" />
  <stop
     style="stop-color:#ff9500;stop-opacity:1.0000000;"
     offset="1.0000000"
     id="stop6737" />
</linearGradient>
<linearGradient
   id="linearGradient6727">
  <stop
     id="stop6729"
     offset="0"
     style="stop-color:#ffe000;stop-opacity:1;" />
  <stop
     id="stop6731"
     offset="1.0000000"
     style="stop-color:#ff9500;stop-opacity:1.0000000;" />
</linearGradient>
<linearGradient
   id="linearGradient6721">
  <stop
     style="stop-color:#ffe000;stop-opacity:1;"
     offset="0"
     id="stop6723" />
  <stop
     style="stop-color:#ff9500;stop-opacity:1.0000000;"
     offset="1.0000000"
     id="stop6725" />
</linearGradient>
<linearGradient
   id="linearGradient6715">
  <stop
     id="stop6717"
     offset="0"
     style="stop-color:#ffe000;stop-opacity:1;" />
  <stop
     id="stop6719"
     offset="1.0000000"
     style="stop-color:#ff9500;stop-opacity:1.0000000;" />
</linearGradient>
<linearGradient
   id="linearGradient6709">
  <stop
     style="stop-color:#ffe000;stop-opacity:1;"
     offset="0"
     id="stop6711" />
  <stop
     style="stop-color:#ff9500;stop-opacity:1.0000000;"
     offset="1.0000000"
     id="stop6713" />
</linearGradient>
<linearGradient
   id="linearGradient6703">
  <stop
     id="stop6705"
     offset="0"
     style="stop-color:#ffe000;stop-opacity:1;" />
  <stop
     id="stop6707"
     offset="1.0000000"
     style="stop-color:#ff9500;stop-opacity:1.0000000;" />
</linearGradient>
<linearGradient
   inkscape:collect="always"
   id="linearGradient6697">
  <stop
     style="stop-color:#ffffff;stop-opacity:1;"
     offset="0"
     id="stop6699" />
  <stop
     style="stop-color:#ffffff;stop-opacity:0;"
     offset="1"
     id="stop6701" />
</linearGradient>
<linearGradient
   id="linearGradient5922">
  <stop
     style="stop-color:#000000;stop-opacity:0.57291669;"
     offset="0.0000000"
     id="stop5924" />
  <stop
     style="stop-color:#000000;stop-opacity:0;"
     offset="1"
     id="stop5926" />
</linearGradient>
<linearGradient
   inkscape:collect="always"
   id="linearGradient5912">
  <stop
     style="stop-color:#000000;stop-opacity:1;"
     offset="0"
     id="stop5914" />
  <stop
     style="stop-color:#000000;stop-opacity:0;"
     offset="1"
     id="stop5916" />
</linearGradient>
<linearGradient
   id="linearGradient5904">
  <stop
     id="stop5906"
     offset="0.0000000"
     style="stop-color:#000000;stop-opacity:0.19791669;" />
  <stop
     id="stop5908"
     offset="1"
     style="stop-color:#000000;stop-opacity:0;" />
</linearGradient>
<linearGradient
   inkscape:collect="always"
   id="linearGradient5856">
  <stop
     style="stop-color:#ffffff;stop-opacity:1;"
     offset="0"
     id="stop5858" />
  <stop
     style="stop-color:#ffffff;stop-opacity:0;"
     offset="1"
     id="stop5860" />
</linearGradient>
<linearGradient
   id="linearGradient5846">
  <stop
     style="stop-color:#e2e2e2;stop-opacity:1;"
     offset="0"
     id="stop5848" />
  <stop
     style="stop-color:#979797;stop-opacity:1.0000000;"
     offset="1.0000000"
     id="stop5850" />
</linearGradient>
<linearGradient
   id="linearGradient5836">
  <stop
     style="stop-color:#ff003c;stop-opacity:1;"
     offset="0"
     id="stop5838" />
  <stop
     style="stop-color:#aa0028;stop-opacity:1.0000000;"
     offset="1.0000000"
     id="stop5840" />
</linearGradient>
<linearGradient
   id="linearGradient5100">
  <stop
     style="stop-color:#000000;stop-opacity:0.68750000;"
     offset="0.0000000"
     id="stop5102" />
  <stop
     style="stop-color:#000000;stop-opacity:0;"
     offset="1"
     id="stop5104" />
</linearGradient>
<linearGradient
   id="linearGradient2906">
  <stop
     style="stop-color:#ffe000;stop-opacity:1;"
     offset="0"
     id="stop2908" />
  <stop
     style="stop-color:#ff9500;stop-opacity:1.0000000;"
     offset="1.0000000"
     id="stop2910" />
</linearGradient>
<linearGradient
   id="linearGradient2065">
  <stop
     style="stop-color:#ffffff;stop-opacity:1;"
     offset="0"
     id="stop2067" />
  <stop
     style="stop-color:#bfbfbf;stop-opacity:1.0000000;"
     offset="1.0000000"
     id="stop2069" />
</linearGradient>
<linearGradient
   id="linearGradient2057">
  <stop
     style="stop-color:#f0f0f0;stop-opacity:1;"
     offset="0"
     id="stop2059" />
  <stop
     style="stop-color:#dddddd;stop-opacity:1.0000000;"
     offset="1.0000000"
     id="stop2061" />
</linearGradient>
<linearGradient
   inkscape:collect="always"
   id="linearGradient2049">
  <stop
     style="stop-color:#0a0a0a;stop-opacity:1;"
     offset="0"
     id="stop2051" />
  <stop
     style="stop-color:#0a0a0a;stop-opacity:0;"
     offset="1"
     id="stop2053" />
</linearGradient>
<linearGradient
   inkscape:collect="always"
   xlink:href="#linearGradient2049"
   id="linearGradient2055"
   x1="69.606209"
   y1="-2.7867124"
   x2="82.630730"
   y2="34.129730"
   gradientUnits="userSpaceOnUse"
   gradientTransform="translate(0.975845,-1.951691)" />
<linearGradient
   inkscape:collect="always"
   xlink:href="#linearGradient2057"
   id="linearGradient2063"
   x1="57.903072"
   y1="65.225105"
   x2="85.999580"
   y2="114.99323"
   gradientUnits="userSpaceOnUse" />
<linearGradient
   inkscape:collect="always"
   xlink:href="#linearGradient2065"
   id="linearGradient2071"
   x1="80.507256"
   y1="19.193230"
   x2="84.654594"
   y2="10.410620"
   gradientUnits="userSpaceOnUse" />
<linearGradient
   inkscape:collect="always"
   xlink:href="#linearGradient2906"
   id="linearGradient2912"
   x1="-47.589424"
   y1="58.896137"
   x2="-63.938179"
   y2="76.461357"
   gradientUnits="userSpaceOnUse" />
<linearGradient
   inkscape:collect="always"
   xlink:href="#linearGradient5100"
   id="linearGradient5106"
   x1="-20.528118"
   y1="107.24106"
   x2="-8.1039801"
   y2="92.060463"
   gradientUnits="userSpaceOnUse"
   gradientTransform="translate(-20.00000,0.000000)" />
<linearGradient
   inkscape:collect="always"
   xlink:href="#linearGradient5836"
   id="linearGradient5842"
   x1="-85.481979"
   y1="27.451311"
   x2="-94.657013"
   y2="43.796722"
   gradientUnits="userSpaceOnUse" />
<linearGradient
   inkscape:collect="always"
   xlink:href="#linearGradient5846"
   id="linearGradient5852"
   x1="-80.819405"
   y1="33.768192"
   x2="-90.566032"
   y2="44.636120"
   gradientUnits="userSpaceOnUse" />
<linearGradient
   inkscape:collect="always"
   xlink:href="#linearGradient5856"
   id="linearGradient5862"
   x1="-54.719166"
   y1="44.506268"
   x2="-69.467331"
   y2="60.721901"
   gradientUnits="userSpaceOnUse" />
<linearGradient
   inkscape:collect="always"
   xlink:href="#linearGradient2906"
   id="linearGradient5873"
   gradientUnits="userSpaceOnUse"
   x1="-47.589424"
   y1="58.896137"
   x2="-63.938179"
   y2="76.461357" />
<linearGradient
   inkscape:collect="always"
   xlink:href="#linearGradient5100"
   id="linearGradient5875"
   gradientUnits="userSpaceOnUse"
   gradientTransform="translate(-20.00000,2.685789e-14)"
   x1="-20.528118"
   y1="107.24106"
   x2="-8.1039801"
   y2="92.060463" />
<linearGradient
   inkscape:collect="always"
   xlink:href="#linearGradient5836"
   id="linearGradient5877"
   gradientUnits="userSpaceOnUse"
   x1="-85.481979"
   y1="27.451311"
   x2="-94.657013"
   y2="43.796722" />
<linearGradient
   inkscape:collect="always"
   xlink:href="#linearGradient5846"
   id="linearGradient5879"
   gradientUnits="userSpaceOnUse"
   x1="-80.819405"
   y1="33.768192"
   x2="-90.566032"
   y2="44.636120" />
<linearGradient
   inkscape:collect="always"
   xlink:href="#linearGradient5856"
   id="linearGradient5881"
   gradientUnits="userSpaceOnUse"
   x1="-54.719166"
   y1="44.506268"
   x2="-69.467331"
   y2="60.721901" />
<linearGradient
   inkscape:collect="always"
   xlink:href="#linearGradient2057"
   id="linearGradient5888"
   gradientUnits="userSpaceOnUse"
   x1="57.903072"
   y1="65.225105"
   x2="85.999580"
   y2="114.99323" />
<linearGradient
   inkscape:collect="always"
   xlink:href="#linearGradient2049"
   id="linearGradient5890"
   gradientUnits="userSpaceOnUse"
   gradientTransform="translate(0.975845,-1.951691)"
   x1="69.606209"
   y1="-2.7867124"
   x2="82.630730"
   y2="34.129730" />
<linearGradient
   inkscape:collect="always"
   xlink:href="#linearGradient2065"
   id="linearGradient5892"
   gradientUnits="userSpaceOnUse"
   x1="80.507256"
   y1="19.193230"
   x2="84.654594"
   y2="10.410620" />
<radialGradient
   inkscape:collect="always"
   xlink:href="#linearGradient5904"
   id="radialGradient5902"
   cx="60.502419"
   cy="115.07005"
   fx="60.502419"
   fy="115.07005"
   r="56.111115"
   gradientTransform="matrix(1.000000,0.000000,0.000000,0.213043,0.000000,90.55513)"
   gradientUnits="userSpaceOnUse" />
<linearGradient
   inkscape:collect="always"
   xlink:href="#linearGradient5912"
   id="linearGradient5918"
   x1="71.236717"
   y1="152.15218"
   x2="88.314011"
   y2="99.212555"
   gradientUnits="userSpaceOnUse" />
<linearGradient
   inkscape:collect="always"
   xlink:href="#linearGradient5922"
   id="linearGradient5928"
   x1="-2.4150949"
   y1="148.70081"
   x2="95.913750"
   y2="93.498650"
   gradientUnits="userSpaceOnUse" />
<linearGradient
   inkscape:collect="always"
   xlink:href="#linearGradient6697"
   id="linearGradient5937"
   gradientUnits="userSpaceOnUse"
   x1="-54.719166"
   y1="44.506268"
   x2="-69.467331"
   y2="60.721901"
   gradientTransform="matrix(-0.940957,0.000000,0.000000,0.940957,96.92630,28.53497)" />
<linearGradient
   inkscape:collect="always"
   xlink:href="#linearGradient6775"
   id="linearGradient5940"
   gradientUnits="userSpaceOnUse"
   x1="-80.819405"
   y1="33.768192"
   x2="-90.566032"
   y2="44.636120"
   gradientTransform="matrix(-0.940957,0.000000,0.000000,0.940957,96.92630,28.53497)" />
<linearGradient
   inkscape:collect="always"
   xlink:href="#linearGradient6823"
   id="linearGradient5943"
   gradientUnits="userSpaceOnUse"
   x1="-85.481979"
   y1="27.451311"
   x2="-94.657013"
   y2="43.796722"
   gradientTransform="matrix(-0.940957,0.000000,0.000000,0.940957,96.92630,28.53497)" />
<linearGradient
   inkscape:collect="always"
   xlink:href="#linearGradient6859"
   id="linearGradient5946"
   gradientUnits="userSpaceOnUse"
   gradientTransform="matrix(-0.940957,0.000000,0.000000,0.940957,115.7454,28.53497)"
   x1="-20.528118"
   y1="107.24106"
   x2="-8.1039801"
   y2="92.060463" />
<linearGradient
   inkscape:collect="always"
   xlink:href="#linearGradient6739"
   id="linearGradient5951"
   gradientUnits="userSpaceOnUse"
   x1="-47.589424"
   y1="58.896137"
   x2="-63.938179"
   y2="76.461357"
   gradientTransform="matrix(-0.940957,0.000000,0.000000,0.940957,96.92630,28.53497)" />
<linearGradient
   inkscape:collect="always"
   xlink:href="#linearGradient6739"
   id="linearGradient6874"
   gradientUnits="userSpaceOnUse"
   gradientTransform="matrix(-0.940957,0.000000,0.000000,0.940957,96.92630,28.53497)"
   x1="-47.589424"
   y1="58.896137"
   x2="-63.938179"
   y2="76.461357" />
<linearGradient
   inkscape:collect="always"
   xlink:href="#linearGradient6859"
   id="linearGradient6876"
   gradientUnits="userSpaceOnUse"
   gradientTransform="matrix(-0.940957,0.000000,0.000000,0.940957,115.7454,28.53497)"
   x1="-20.528118"
   y1="107.24106"
   x2="-8.1039801"
   y2="92.060463" />
<linearGradient
   inkscape:collect="always"
   xlink:href="#linearGradient6823"
   id="linearGradient6878"
   gradientUnits="userSpaceOnUse"
   gradientTransform="matrix(-0.940957,0.000000,0.000000,0.940957,96.92630,28.53497)"
   x1="-85.481979"
   y1="27.451311"
   x2="-94.657013"
   y2="43.796722" />
<linearGradient
   inkscape:collect="always"
   xlink:href="#linearGradient6775"
   id="linearGradient6880"
   gradientUnits="userSpaceOnUse"
   gradientTransform="matrix(-0.940957,0.000000,0.000000,0.940957,96.92630,28.53497)"
   x1="-80.819405"
   y1="33.768192"
   x2="-90.566032"
   y2="44.636120" />
<linearGradient
   inkscape:collect="always"
   xlink:href="#linearGradient6697"
   id="linearGradient6882"
   gradientUnits="userSpaceOnUse"
   gradientTransform="matrix(-0.940957,0.000000,0.000000,0.940957,96.92630,28.53497)"
   x1="-54.719166"
   y1="44.506268"
   x2="-69.467331"
   y2="60.721901" />
<linearGradient
   y2="23.957935"
   x2="20.388556"
   y1="10.036770"
   x1="14.223336"
   gradientUnits="userSpaceOnUse"
   id="linearGradient2953"
   xlink:href="#linearGradient2446"
   inkscape:collect="always" />
<linearGradient
   y2="33.283340"
   x2="18.163805"
   y1="-12.059881"
   x1="16.175068"
   gradientUnits="userSpaceOnUse"
   id="linearGradient2951"
   xlink:href="#linearGradient2464"
   inkscape:collect="always" />
<linearGradient
   y2="40.188671"
   x2="18.876925"
   y1="30.251171"
   x1="18.876925"
   gradientUnits="userSpaceOnUse"
   id="linearGradient2949"
   xlink:href="#linearGradient2482"
   inkscape:collect="always" />
<linearGradient
   y2="39.217525"
   x2="16.321091"
   y1="11.373777"
   x1="16.448235"
   gradientUnits="userSpaceOnUse"
   id="linearGradient2947"
   xlink:href="#linearGradient2500"
   inkscape:collect="always" />
<radialGradient
   r="20.351416"
   fy="41.636040"
   fx="20.749165"
   cy="41.636040"
   cx="20.749165"
   gradientTransform="matrix(1.000000,0.000000,0.000000,0.228013,2.597922e-14,32.14248)"
   gradientUnits="userSpaceOnUse"
   id="radialGradient2945"
   xlink:href="#linearGradient2518"
   inkscape:collect="always" />
<radialGradient
   r="20.351416"
   fy="41.636040"
   fx="20.749165"
   cy="41.636040"
   cx="20.749165"
   gradientTransform="matrix(1.000000,0.000000,0.000000,0.228013,4.675351e-14,32.14248)"
   gradientUnits="userSpaceOnUse"
   id="radialGradient2943"
   xlink:href="#linearGradient2175"
   inkscape:collect="always" />
<linearGradient
   y2="33.562500"
   x2="33.187500"
   y1="57.609375"
   x1="25.124998"
   gradientUnits="userSpaceOnUse"
   id="linearGradient2941"
   xlink:href="#linearGradient2536"
   inkscape:collect="always" />
<linearGradient
   gradientUnits="userSpaceOnUse"
   y2="33.562500"
   x2="33.187500"
   y1="57.609375"
   x1="25.124998"
   id="linearGradient2927"
   xlink:href="#linearGradient2921"
   inkscape:collect="always" />
<radialGradient
   r="20.351416"
   fy="41.636040"
   fx="20.749165"
   cy="41.636040"
   cx="20.749165"
   gradientTransform="matrix(1.000000,0.000000,0.000000,0.228013,0.000000,32.14248)"
   gradientUnits="userSpaceOnUse"
   id="radialGradient2189"
   xlink:href="#linearGradient2175"
   inkscape:collect="always" />
<radialGradient
   gradientUnits="userSpaceOnUse"
   gradientTransform="matrix(1.000000,0.000000,0.000000,0.228013,0.000000,32.14248)"
   r="20.351416"
   fy="41.636040"
   fx="20.749165"
   cy="41.636040"
   cx="20.749165"
   id="radialGradient2181"
   xlink:href="#linearGradient2175"
   inkscape:collect="always" />
<linearGradient
   y2="23.957935"
   x2="20.388556"
   y1="10.036770"
   x1="14.223336"
   gradientUnits="userSpaceOnUse"
   id="linearGradient1445"
   xlink:href="#linearGradient16670"
   inkscape:collect="always" />
<linearGradient
   y2="33.283340"
   x2="18.163805"
   y1="-12.059881"
   x1="16.175068"
   gradientUnits="userSpaceOnUse"
   id="linearGradient1443"
   xlink:href="#linearGradient16680"
   inkscape:collect="always" />
<linearGradient
   y2="40.188671"
   x2="18.876925"
   y1="30.251171"
   x1="18.876925"
   gradientUnits="userSpaceOnUse"
   id="linearGradient1441"
   xlink:href="#linearGradient16644"
   inkscape:collect="always" />
<linearGradient
   y2="39.217525"
   x2="16.321091"
   y1="11.373777"
   x1="16.448235"
   gradientUnits="userSpaceOnUse"
   id="linearGradient1439"
   xlink:href="#linearGradient16652"
   inkscape:collect="always" />



<linearGradient
   x1="43.083366"
   y1="25.440874"
   x2="21.061981"
   y2="42.374111"
   id="linearGradient279"
   xlink:href="#MaterialSteel"
   gradientUnits="userSpaceOnUse"
   gradientTransform="matrix(0.973418,0.000000,0.000000,1.007738,43.48896,-63.24181)" />



<linearGradient
   x1="82.964867"
   y1="55.504787"
   x2="61.721325"
   y2="71.093834"
   id="linearGradient278"
   xlink:href="#linearGradient5269"
   gradientUnits="userSpaceOnUse"
   gradientTransform="matrix(0.867675,0.000000,0.000000,1.130548,42.89480,-63.84459)" />



<linearGradient
   x1="494.23230"
   y1="630.91229"
   x2="719.47803"
   y2="630.30804"
   id="linearGradient277"
   xlink:href="#Basic3DHighlightGradient"
   gradientUnits="userSpaceOnUse"
   gradientTransform="matrix(-0.100395,8.883153e-2,0.124061,0.173815,113.1156,-127.6620)" />



<linearGradient
   x1="656.15356"
   y1="646.98370"
   x2="861.65375"
   y2="668.75720"
   id="linearGradient276"
   xlink:href="#TransparentBlack"
   gradientUnits="userSpaceOnUse"
   gradientTransform="matrix(-9.984941e-2,8.834906e-2,0.124739,0.174765,113.1156,-127.6620)" />



<linearGradient
   x1="352.15469"
   y1="639.38995"
   x2="617.12445"
   y2="567.66602"
   id="linearGradient275"
   xlink:href="#BlackTransparent"
   gradientUnits="userSpaceOnUse"
   gradientTransform="matrix(-9.984941e-2,8.834906e-2,0.124739,0.174765,113.1156,-127.6620)" />



<linearGradient
   x1="518.87408"
   y1="639.22778"
   x2="677.33002"
   y2="639.38995"
   id="linearGradient274"
   xlink:href="#WhiteTransparent"
   gradientUnits="userSpaceOnUse"
   gradientTransform="matrix(-9.984941e-2,8.834906e-2,0.124739,0.174765,113.1156,-127.6620)" />



<linearGradient
   x1="840.09131"
   y1="24.071342"
   x2="887.12701"
   y2="24.071342"
   id="linearGradient273"
   xlink:href="#TransparentBlack"
   gradientUnits="userSpaceOnUse"
   gradientTransform="matrix(0.294119,-6.413711e-17,-1.710169e-14,3.052589,-320.3860,-4.629176)" />



<linearGradient
   x1="-47.835106"
   y1="26.569469"
   x2="-26.328552"
   y2="26.569469"
   id="linearGradient272"
   xlink:href="#linearGradient5269"
   gradientUnits="userSpaceOnUse"
   gradientTransform="matrix(0.307585,1.512870e-16,-4.133730e-15,3.193557,-78.51376,-15.98778)" />



<linearGradient
   x1="85.031898"
   y1="48.064293"
   x2="88.841141"
   y2="64.932793"
   id="linearGradient271"
   xlink:href="#linearGradient3970"
   gradientUnits="userSpaceOnUse"
   gradientTransform="matrix(-1.453927,-0.534801,-0.463052,1.295711,227.5255,-75.39977)" />



<radialGradient
   cx="-289.09140"
   cy="598.36652"
   r="125.20509"
   fx="-197.27432"
   fy="572.00757"
   id="radialGradient270"
   xlink:href="#MaterialSoftShadow"
   gradientUnits="userSpaceOnUse" />



<radialGradient
   cx="-289.09140"
   cy="598.36652"
   r="125.20509"
   fx="-197.27432"
   fy="572.00757"
   id="radialGradient269"
   xlink:href="#MaterialSoftShadow"
   gradientUnits="userSpaceOnUse" />



<radialGradient
   cx="-289.09140"
   cy="598.36652"
   r="125.20509"
   fx="-197.27432"
   fy="572.00757"
   id="radialGradient268"
   xlink:href="#MaterialSoftShadow"
   gradientUnits="userSpaceOnUse" />



<linearGradient
   id="linearGradient95">
  <stop
   style="stop-color:#000000;stop-opacity:1.0000000;"
   offset="0.0000000"
   id="stop96" />



  <stop
   style="stop-color:#000000;stop-opacity:0.93220341;"
   offset="1.0000000"
   id="stop97" />



</linearGradient>



<linearGradient
   id="linearGradient3970">
  <stop
   style="stop-color:#ffffff;stop-opacity:1.0000000;"
   offset="0.0000000"
   id="stop3971" />



  <stop
   style="stop-color:#ffffff;stop-opacity:0.0000000;"
   offset="1.0000000"
   id="stop3972" />



</linearGradient>



<linearGradient
   id="MaterialSteel">
  <stop
   style="stop-color:#807d74;stop-opacity:1.0000000;"
   offset="0.0000000"
   id="stop1499" />



  <stop
   style="stop-color:#f2f0eb;stop-opacity:1.0000000;"
   offset="0.38708624"
   id="stop1501" />



  <stop
   style="stop-color:#565248;stop-opacity:1.0000000;"
   offset="0.80849576"
   id="stop1502" />



  <stop
   style="stop-color:#eae8e3;stop-opacity:1.0000000;"
   offset="1.0000000"
   id="stop1500" />



</linearGradient>



<linearGradient
   id="WhiteTransparent">
  <stop
   style="stop-color:#ffffff;stop-opacity:1.0000000;"
   offset="0.0000000"
   id="stopWhiteFull" />



  <stop
   style="stop-color:#ffffff;stop-opacity:0.0000000;"
   offset="1.0000000"
   id="stopWhiteTransparent" />



</linearGradient>



<linearGradient
   id="BlackTransparent">
  <stop
   style="stop-color:#000000;stop-opacity:1.0000000;"
   offset="0.0000000"
   id="stopBlackFull" />



  <stop
   style="stop-color:#000000;stop-opacity:0.0000000;"
   offset="1.0000000"
   id="stopBlackTransparent" />



</linearGradient>



<linearGradient
   id="TransparentBlack">
  <stop
   style="stop-color:#000000;stop-opacity:0.0000000;"
   offset="0.0000000"
   id="stopBlackTransparent1" />



  <stop
   style="stop-color:#000000;stop-opacity:1.0000000;"
   offset="1.0000000"
   id="stopBlackFull1" />



</linearGradient>



<linearGradient
   id="Basic3DHighlightGradient">
  <stop
   style="stop-color:#eae8e3;stop-opacity:1.0000000;"
   offset="0.0000000"
   id="stop3921" />



  <stop
   style="stop-color:#eae8e3;stop-opacity:0.0000000;"
   offset="1.0000000"
   id="stop3922" />



</linearGradient>



<linearGradient
   id="linearGradient5269">
  <stop
   style="stop-color:#ffffff;stop-opacity:1.0000000;"
   offset="0.0000000"
   id="stop5270" />



  <stop
   style="stop-color:#ffffff;stop-opacity:0.0000000;"
   offset="1.0000000"
   id="stop5271" />



</linearGradient>



<linearGradient
   id="MaterialSoftShadow">
  <stop
   style="stop-color:#000000;stop-opacity:0.21500000;"
   offset="0.0000000"
   id="stop2619" />



  <stop
   style="stop-color:#000000;stop-opacity:0.097999997;"
   offset="0.50000000"
   id="stop2621" />



  <stop
   style="stop-color:#000000;stop-opacity:0.0000000;"
   offset="1.0000000"
   id="stop2620" />



</linearGradient>



<linearGradient
   x1="17.647800"
   y1="77.102303"
   x2="13.356017"
   y2="59.885593"
   id="linearGradient235"
   xlink:href="#linearGradient232"
   gradientUnits="userSpaceOnUse"
   gradientTransform="scale(1.694702,0.590074)" />



<linearGradient
   x1="-149.04640"
   y1="251.14360"
   x2="-149.04640"
   y2="436.30301"
   id="linearGradient48"
   xlink:href="#path166_2_"
   gradientUnits="userSpaceOnUse"
   gradientTransform="matrix(0.187500,0.000000,0.000000,-0.187500,51.50000,83.75000)" />



<linearGradient
   x1="7.3056998"
   y1="7.2558999"
   x2="50.772800"
   y2="50.723099"
   id="linearGradient47"
   xlink:href="#XMLID_1_"
   gradientUnits="userSpaceOnUse" />



<linearGradient
   x1="23.503901"
   y1="2.1870000"
   x2="23.503901"
   y2="34.436798"
   id="linearGradient46"
   xlink:href="#XMLID_2_"
   gradientUnits="userSpaceOnUse" />



<linearGradient
   x1="34.596699"
   y1="3.5967000"
   x2="18.408701"
   y2="19.784700"
   id="linearGradient45"
   xlink:href="#XMLID_3_"
   gradientUnits="userSpaceOnUse" />



<linearGradient
   x1="21.868700"
   y1="25.187500"
   x2="21.868700"
   y2="44.625099"
   id="linearGradient43"
   xlink:href="#XMLID_4_"
   gradientUnits="userSpaceOnUse" />




    
    
  <linearGradient
   x1="-68.149399"
   y1="388.45609"
   x2="-68.149399"
   y2="404.66931"
   id="path228_1_"
   gradientUnits="userSpaceOnUse"
   gradientTransform="matrix(0.187500,0.000000,0.000000,-0.187500,51.50000,83.75000)">
      <stop
   style="stop-color:#3399ff;stop-opacity:1.0000000;"
   offset="0.0000000"
   id="stop669" />




      <stop
   style="stop-color:#000000;stop-opacity:1.0000000;"
   offset="1.0000000"
   id="stop670" />




      <a:midPointStop
   id="midPointStop671"
   style="stop-color:#3399FF"
   offset="0" />




      <a:midPointStop
   id="midPointStop672"
   style="stop-color:#3399FF"
   offset="0.5" />




      <a:midPointStop
   id="midPointStop673"
   style="stop-color:#000000"
   offset="1" />




    </linearGradient>




    
    <linearGradient
   x1="-158.03371"
   y1="288.06839"
   x2="-158.03371"
   y2="231.32190"
   id="XMLID_5_"
   gradientUnits="userSpaceOnUse"
   gradientTransform="matrix(0.187500,0.000000,0.000000,-0.187500,51.50000,83.75000)">
      <stop
   style="stop-color:#f0f0f0;stop-opacity:1.0000000;"
   offset="0.0000000"
   id="stop656" />




      <stop
   style="stop-color:#cecedb;stop-opacity:1.0000000;"
   offset="0.63480002"
   id="stop657" />




      <stop
   style="stop-color:#b1b1c5;stop-opacity:1.0000000;"
   offset="0.85949999"
   id="stop658" />




      <stop
   style="stop-color:#ffffff;stop-opacity:1.0000000;"
   offset="1.0000000"
   id="stop659" />




      <a:midPointStop
   id="midPointStop660"
   style="stop-color:#F0F0F0"
   offset="0" />




      <a:midPointStop
   id="midPointStop661"
   style="stop-color:#F0F0F0"
   offset="0.5" />




      <a:midPointStop
   id="midPointStop662"
   style="stop-color:#CECEDB"
   offset="0.6348" />




      <a:midPointStop
   id="midPointStop663"
   style="stop-color:#CECEDB"
   offset="0.5" />




      <a:midPointStop
   id="midPointStop664"
   style="stop-color:#B1B1C5"
   offset="0.8595" />




      <a:midPointStop
   id="midPointStop665"
   style="stop-color:#B1B1C5"
   offset="0.5" />




      <a:midPointStop
   id="midPointStop666"
   style="stop-color:#FFFFFF"
   offset="1" />




    </linearGradient>




    
    <linearGradient
   x1="21.868700"
   y1="25.187500"
   x2="21.868700"
   y2="44.625099"
   id="XMLID_4_"
   gradientUnits="userSpaceOnUse">
      <stop
   style="stop-color:#dfdfdf;stop-opacity:1.0000000;"
   offset="0.0000000"
   id="stop649" />




      <stop
   style="stop-color:#7d7d99;stop-opacity:1.0000000;"
   offset="1.0000000"
   id="stop650" />




      <a:midPointStop
   id="midPointStop651"
   style="stop-color:#DFDFDF"
   offset="0" />




      <a:midPointStop
   id="midPointStop652"
   style="stop-color:#DFDFDF"
   offset="0.5" />




      <a:midPointStop
   id="midPointStop653"
   style="stop-color:#7D7D99"
   offset="1" />




    </linearGradient>




    
    <linearGradient
   x1="-174.44090"
   y1="300.09079"
   x2="-108.87870"
   y2="210.20740"
   id="path205_1_"
   gradientUnits="userSpaceOnUse"
   gradientTransform="matrix(0.187500,0.000000,0.000000,-0.187500,51.50000,83.75000)">
      <stop
   style="stop-color:#005dba;stop-opacity:1.0000000;"
   offset="0.0000000"
   id="stop639" />




      <stop
   style="stop-color:#0035ed;stop-opacity:1.0000000;"
   offset="0.26969999"
   id="stop640" />




      <stop
   style="stop-color:#57adff;stop-opacity:1.0000000;"
   offset="1.0000000"
   id="stop641" />




      <a:midPointStop
   id="midPointStop642"
   style="stop-color:#003399"
   offset="0" />




      <a:midPointStop
   id="midPointStop643"
   style="stop-color:#003399"
   offset="0.5" />




      <a:midPointStop
   id="midPointStop644"
   style="stop-color:#0035ED"
   offset="0.2697" />




      <a:midPointStop
   id="midPointStop645"
   style="stop-color:#0035ED"
   offset="0.5" />




      <a:midPointStop
   id="midPointStop646"
   style="stop-color:#57ADFF"
   offset="1" />




    </linearGradient>




    
    <linearGradient
   x1="34.596699"
   y1="3.5967000"
   x2="18.408701"
   y2="19.784700"
   id="XMLID_3_"
   gradientUnits="userSpaceOnUse">
      <stop
   style="stop-color:#ffffff;stop-opacity:1.0000000;"
   offset="0.0000000"
   id="stop629" />




      <stop
   style="stop-color:#e6edff;stop-opacity:1.0000000;"
   offset="0.55059999"
   id="stop630" />




      <stop
   style="stop-color:#ffffff;stop-opacity:1.0000000;"
   offset="1.0000000"
   id="stop631" />




      <a:midPointStop
   id="midPointStop632"
   style="stop-color:#FFFFFF"
   offset="0" />




      <a:midPointStop
   id="midPointStop633"
   style="stop-color:#FFFFFF"
   offset="0.5" />




      <a:midPointStop
   id="midPointStop634"
   style="stop-color:#E6EDFF"
   offset="0.5506" />




      <a:midPointStop
   id="midPointStop635"
   style="stop-color:#E6EDFF"
   offset="0.5" />




      <a:midPointStop
   id="midPointStop636"
   style="stop-color:#FFFFFF"
   offset="1" />




    </linearGradient>




    
    
    <linearGradient
   x1="-104.59330"
   y1="411.66989"
   x2="-206.81500"
   y2="309.44821"
   id="path186_2_"
   gradientUnits="userSpaceOnUse"
   gradientTransform="matrix(0.187500,0.000000,0.000000,-0.187500,51.50000,83.75000)">
      <stop
   style="stop-color:#cccccc;stop-opacity:1.0000000;"
   offset="0.0000000"
   id="stop621" />




      <stop
   style="stop-color:#f0f0f0;stop-opacity:1.0000000;"
   offset="1.0000000"
   id="stop622" />




      <a:midPointStop
   id="midPointStop623"
   style="stop-color:#CCCCCC"
   offset="0" />




      <a:midPointStop
   id="midPointStop624"
   style="stop-color:#CCCCCC"
   offset="0.5" />




      <a:midPointStop
   id="midPointStop625"
   style="stop-color:#F0F0F0"
   offset="1" />




    </linearGradient>




    
    
    <linearGradient
   x1="23.503901"
   y1="2.1870000"
   x2="23.503901"
   y2="34.436798"
   id="XMLID_2_"
   gradientUnits="userSpaceOnUse">
      <stop
   style="stop-color:#428aff;stop-opacity:1.0000000;"
   offset="0.0000000"
   id="stop613" />




      <stop
   style="stop-color:#c9e6ff;stop-opacity:1.0000000;"
   offset="1.0000000"
   id="stop614" />




      <a:midPointStop
   id="midPointStop615"
   style="stop-color:#428AFF"
   offset="0" />




      <a:midPointStop
   id="midPointStop616"
   style="stop-color:#428AFF"
   offset="0.5" />




      <a:midPointStop
   id="midPointStop617"
   style="stop-color:#C9E6FF"
   offset="1" />




    </linearGradient>




    
    <linearGradient
   x1="7.3056998"
   y1="7.2558999"
   x2="50.772800"
   y2="50.723099"
   id="XMLID_1_"
   gradientUnits="userSpaceOnUse">
      <stop
   style="stop-color:#89bbd2;stop-opacity:1.0000000;"
   offset="0.0000000"
   id="stop606" />




      <stop
   style="stop-color:#007ac1;stop-opacity:1.0000000;"
   offset="1.0000000"
   id="stop607" />




      <a:midPointStop
   id="midPointStop608"
   style="stop-color:#94CAFF"
   offset="0" />




      <a:midPointStop
   id="midPointStop609"
   style="stop-color:#94CAFF"
   offset="0.5" />




      <a:midPointStop
   id="midPointStop610"
   style="stop-color:#006DFF"
   offset="1" />




    </linearGradient>




    
    
    <linearGradient
   x1="-149.04640"
   y1="251.14360"
   x2="-149.04640"
   y2="436.30301"
   id="path166_2_"
   gradientUnits="userSpaceOnUse"
   gradientTransform="matrix(0.187500,0.000000,0.000000,-0.187500,51.50000,83.75000)">
      <stop
   style="stop-color:#b4e2ff;stop-opacity:1.0000000;"
   offset="0.0000000"
   id="stop598" />




      <stop
   style="stop-color:#006dff;stop-opacity:1.0000000;"
   offset="1.0000000"
   id="stop599" />




      <a:midPointStop
   id="midPointStop600"
   style="stop-color:#B4E2FF"
   offset="0" />




      <a:midPointStop
   id="midPointStop601"
   style="stop-color:#B4E2FF"
   offset="0.5" />




      <a:midPointStop
   id="midPointStop602"
   style="stop-color:#006DFF"
   offset="1" />




    </linearGradient>




    
    
    
    
    
    <linearGradient
   id="linearGradient232">
  <stop
   style="stop-color:#000000;stop-opacity:0.53389829;"
   offset="0.0000000"
   id="stop233" />



  <stop
   style="stop-color:#000000;stop-opacity:0.0000000;"
   offset="1.0000000"
   id="stop234" />



</linearGradient>
<linearGradient
   id="linearGradient16644">
  <stop
     id="stop16646"
     offset="0"
     style="stop-color:#d9d9d9;stop-opacity:1;" />
  <stop
     id="stop16648"
     offset="1.0000000"
     style="stop-color:#c2c2c2;stop-opacity:1.0000000;" />
</linearGradient>
<linearGradient
   id="linearGradient16652">
  <stop
     id="stop16654"
     offset="0"
     style="stop-color:#9ed3f7;stop-opacity:1;" />
  <stop
     id="stop16656"
     offset="1.0000000"
     style="stop-color:#85b1cf;stop-opacity:1.0000000;" />
</linearGradient>
<linearGradient
   id="linearGradient16670">
  <stop
     id="stop16672"
     offset="0"
     style="stop-color:#ffffff;stop-opacity:1;" />
  <stop
     id="stop16674"
     offset="1.0000000"
     style="stop-color:#dadada;stop-opacity:1.0000000;" />
</linearGradient>
<linearGradient
   id="linearGradient16680"
   inkscape:collect="always">
  <stop
     id="stop16682"
     offset="0"
     style="stop-color:#ffffff;stop-opacity:1;" />
  <stop
     id="stop16684"
     offset="1"
     style="stop-color:#ffffff;stop-opacity:0;" />
</linearGradient>
<linearGradient
   id="linearGradient2175">
  <stop
     id="stop2177"
     offset="0.0000000"
     style="stop-color:#000000;stop-opacity:0.15000001;" />
  <stop
     id="stop2179"
     offset="1"
     style="stop-color:#000000;stop-opacity:0;" />
</linearGradient>
<linearGradient
   id="linearGradient2921"
   inkscape:collect="always">
  <stop
     id="stop2923"
     offset="0"
     style="stop-color:#000000;stop-opacity:0.73600000" />
  <stop
     id="stop2925"
     offset="1"
     style="stop-color:#000000;stop-opacity:0;" />
</linearGradient>
<radialGradient
   gradientUnits="userSpaceOnUse"
   gradientTransform="matrix(1.000000,0.000000,0.000000,0.144000,-1.303818e-14,99.67119)"
   r="36.130306"
   fy="116.43830"
   fx="58.675617"
   cy="116.43830"
   cx="58.675617"
   id="radialGradient2204"
   xlink:href="#linearGradient3684"
   inkscape:collect="always" />
<linearGradient
   gradientUnits="userSpaceOnUse"
   y2="99.381737"
   x2="54.918064"
   y1="163.26318"
   x1="52.605728"
   id="linearGradient2193"
   xlink:href="#linearGradient3642"
   inkscape:collect="always" />
<linearGradient
   inkscape:collect="always"
   xlink:href="#linearGradient3618"
   id="linearGradient2214"
   gradientUnits="userSpaceOnUse"
   gradientTransform="matrix(1.033641,0.000000,0.000000,0.782655,-3.223697,5.802196)"
   x1="58.306610"
   y1="5.4680767"
   x2="58.113045"
   y2="83.246063" />
<linearGradient
   inkscape:collect="always"
   xlink:href="#linearGradient2208"
   id="linearGradient2206"
   gradientUnits="userSpaceOnUse"
   gradientTransform="matrix(0.744369,0.000000,0.000000,-0.486515,17.79406,49.06001)"
   x1="52.896687"
   y1="-149.29340"
   x2="52.315933"
   y2="-83.768036" />
<linearGradient
   inkscape:collect="always"
   xlink:href="#linearGradient2195"
   id="linearGradient2201"
   gradientTransform="scale(1.171163,0.853852)"
   x1="58.306610"
   y1="5.4680767"
   x2="58.113045"
   y2="83.246063"
   gradientUnits="userSpaceOnUse" />
<radialGradient
   inkscape:collect="always"
   xlink:href="#linearGradient3666"
   id="radialGradient1829"
   gradientTransform="matrix(0.882570,0.000000,0.000000,0.916623,32.49805,-12.71535)"
   cx="27.144922"
   cy="87.825180"
   fx="27.144922"
   fy="87.825180"
   r="52.854481"
   gradientUnits="userSpaceOnUse" />
<linearGradient
   x1="85.759804"
   y1="12.790000"
   x2="85.759804"
   y2="44.681999"
   id="XMLID_22_"
   gradientUnits="userSpaceOnUse"
   spreadMethod="pad">
  <stop
     style="stop-color:#ffffff;stop-opacity:0.0000000;"
     offset="0.0000000"
     id="stop729" />
  <stop
     style="stop-color:#ffffff;stop-opacity:1.0000000;"
     offset="1.0000000"
     id="stop730" />
  <midPointStop
     offset="0"
     style="stop-color:#FFFFFF"
     id="midPointStop731" />
  <midPointStop
     offset="0.5"
     style="stop-color:#FFFFFF"
     id="midPointStop732" />
  <midPointStop
     offset="1"
     style="stop-color:#0D3692"
     id="midPointStop733" />
</linearGradient>
<radialGradient
   cx="66.706100"
   cy="22.941900"
   fx="66.706100"
   fy="22.941900"
   r="59.340599"
   id="XMLID_21_"
   gradientUnits="userSpaceOnUse"
   spreadMethod="pad">
  <stop
     style="stop-color:#0098cc;stop-opacity:1.0000000;"
     offset="0.0000000"
     id="stop721" />
  <stop
     style="stop-color:#0060c1;stop-opacity:1.0000000;"
     offset="1.0000000"
     id="stop722" />
  <midPointStop
     offset="0"
     style="stop-color:#0066CC"
     id="midPointStop723" />
  <midPointStop
     offset="0.5"
     style="stop-color:#0066CC"
     id="midPointStop724" />
  <midPointStop
     offset="1"
     style="stop-color:#003399"
     id="midPointStop725" />
</radialGradient>
<linearGradient
   x1="204.799805"
   y1="221.579102"
   x2="204.799805"
   y2="138.947998"
   id="XMLID_20_"
   gradientUnits="userSpaceOnUse"
   gradientTransform="translate(-196.1279,-102.2637)"
   spreadMethod="pad">
  <stop
     style="stop-color:#cecedb;stop-opacity:1;"
     offset="0.00000000"
     id="stop710" />
  <stop
     style="stop-color:#ffffff;stop-opacity:1;"
     offset="1.00000000"
     id="stop711" />
  <midPointStop
     offset="0"
     style="stop-color:#CECEDB"
     id="midPointStop712" />
  <midPointStop
     offset="0.5"
     style="stop-color:#CECEDB"
     id="midPointStop713" />
  <midPointStop
     offset="1"
     style="stop-color:#FFFFFF"
     id="midPointStop714" />
</linearGradient>
<linearGradient
   x1="204.800797"
   y1="221.578094"
   x2="204.800797"
   y2="138.949203"
   id="XMLID_19_"
   gradientUnits="userSpaceOnUse"
   gradientTransform="translate(-196.1279,-102.2637)"
   spreadMethod="pad">
  <stop
     style="stop-color:#cecedb;stop-opacity:1;"
     offset="0.00000000"
     id="stop703" />
  <stop
     style="stop-color:#bdbdcf;stop-opacity:1;"
     offset="1.00000000"
     id="stop704" />
  <midPointStop
     offset="0"
     style="stop-color:#CECEDB"
     id="midPointStop705" />
  <midPointStop
     offset="0.5"
     style="stop-color:#CECEDB"
     id="midPointStop706" />
  <midPointStop
     offset="1"
     style="stop-color:#BDBDCF"
     id="midPointStop707" />
</linearGradient>
<linearGradient
   x1="204.800797"
   y1="222.811493"
   x2="204.800797"
   y2="137.715805"
   id="XMLID_18_"
   gradientUnits="userSpaceOnUse"
   gradientTransform="translate(-196.1279,-102.2637)"
   spreadMethod="pad">
  <stop
     style="stop-color:#828282;stop-opacity:1;"
     offset="0.00000000"
     id="stop696" />
  <stop
     style="stop-color:#616161;stop-opacity:1;"
     offset="1.00000000"
     id="stop697" />
  <midPointStop
     offset="0"
     style="stop-color:#828282"
     id="midPointStop698" />
  <midPointStop
     offset="0.5"
     style="stop-color:#828282"
     id="midPointStop699" />
  <midPointStop
     offset="1"
     style="stop-color:#616161"
     id="midPointStop700" />
</linearGradient>
<linearGradient
   x1="18.5088005"
   y1="234.453094"
   x2="18.5088005"
   y2="149.360306"
   id="XMLID_17_"
   gradientUnits="userSpaceOnUse"
   gradientTransform="matrix(0.707100,-0.707100,0.707100,0.707100,-28.28530,64.54490)"
   spreadMethod="pad">
  <stop
     style="stop-color:#828282;stop-opacity:1;"
     offset="0.00000000"
     id="stop689" />
  <stop
     style="stop-color:#616161;stop-opacity:1;"
     offset="1.00000000"
     id="stop690" />
  <midPointStop
     offset="0"
     style="stop-color:#828282"
     id="midPointStop691" />
  <midPointStop
     offset="0.5"
     style="stop-color:#828282"
     id="midPointStop692" />
  <midPointStop
     offset="1"
     style="stop-color:#616161"
     id="midPointStop693" />
</linearGradient>
<radialGradient
   cx="241.056595"
   cy="335.484406"
   fx="241.056595"
   fy="335.484406"
   r="16.5615005"
   id="XMLID_16_"
   gradientUnits="userSpaceOnUse"
   gradientTransform="matrix(1.000000,0.000000,0.000000,0.514300,-196.1279,-102.4500)"
   spreadMethod="pad">
  <stop
     style="stop-color:#cccccc;stop-opacity:1;"
     offset="0.00000000"
     id="stop682" />
  <stop
     style="stop-color:#494949;stop-opacity:1;"
     offset="1.00000000"
     id="stop683" />
  <midPointStop
     offset="0"
     style="stop-color:#CCCCCC"
     id="midPointStop684" />
  <midPointStop
     offset="0.5"
     style="stop-color:#CCCCCC"
     id="midPointStop685" />
  <midPointStop
     offset="1"
     style="stop-color:#494949"
     id="midPointStop686" />
</radialGradient>
<radialGradient
   cx="293.091797"
   cy="181.062500"
   fx="293.091797"
   fy="181.062500"
   r="16.5622005"
   id="XMLID_15_"
   gradientUnits="userSpaceOnUse"
   gradientTransform="translate(-196.1279,-102.2637)"
   spreadMethod="pad">
  <stop
     style="stop-color:#cccccc;stop-opacity:1;"
     offset="0.00000000"
     id="stop675" />
  <stop
     style="stop-color:#494949;stop-opacity:1;"
     offset="1.00000000"
     id="stop676" />
  <midPointStop
     offset="0"
     style="stop-color:#CCCCCC"
     id="midPointStop677" />
  <midPointStop
     offset="0.5"
     style="stop-color:#CCCCCC"
     id="midPointStop678" />
  <midPointStop
     offset="1"
     style="stop-color:#494949"
     id="midPointStop679" />
</radialGradient>
<radialGradient
   cx="271.713898"
   cy="195.030304"
   fx="271.713898"
   fy="195.030304"
   r="9.43599987"
   id="XMLID_14_"
   gradientUnits="userSpaceOnUse"
   gradientTransform="translate(-196.1279,-102.2637)"
   spreadMethod="pad">
  <stop
     style="stop-color:#57adff;stop-opacity:1;"
     offset="0.00000000"
     id="stop668" />
  <stop
     style="stop-color:#0053bd;stop-opacity:1;"
     offset="1.00000000"
     id="stop2810" />
  <midPointStop
     offset="0"
     style="stop-color:#57ADFF"
     id="midPointStop670" />
  <midPointStop
     offset="0.5"
     style="stop-color:#57ADFF"
     id="midPointStop671" />
  <midPointStop
     offset="1"
     style="stop-color:#0053BD"
     id="midPointStop672" />
</radialGradient>
<radialGradient
   cx="291.106415"
   cy="266.429687"
   fx="291.106415"
   fy="266.429687"
   r="23.3383007"
   id="XMLID_13_"
   gradientUnits="userSpaceOnUse"
   gradientTransform="matrix(1.000000,0.000000,0.000000,0.628600,-196.1279,-113.8702)"
   spreadMethod="pad">
  <stop
     style="stop-color:#cccccc;stop-opacity:1;"
     offset="0.00000000"
     id="stop661" />
  <stop
     style="stop-color:#494949;stop-opacity:1;"
     offset="1.00000000"
     id="stop662" />
  <midPointStop
     offset="0"
     style="stop-color:#CCCCCC"
     id="midPointStop663" />
  <midPointStop
     offset="0.5"
     style="stop-color:#CCCCCC"
     id="midPointStop664" />
  <midPointStop
     offset="1"
     style="stop-color:#494949"
     id="midPointStop665" />
</radialGradient>
<radialGradient
   cx="389.175812"
   cy="323.525391"
   fx="389.175812"
   fy="323.525391"
   r="9.43599987"
   id="XMLID_12_"
   gradientUnits="userSpaceOnUse"
   gradientTransform="matrix(2.404000,0.000000,0.000000,0.649000,-871.0667,-155.8388)"
   spreadMethod="pad">
  <stop
     style="stop-color:#cccccc;stop-opacity:1;"
     offset="0.00000000"
     id="stop654" />
  <stop
     style="stop-color:#616161;stop-opacity:1;"
     offset="1.00000000"
     id="stop655" />
  <midPointStop
     offset="0"
     style="stop-color:#CCCCCC"
     id="midPointStop656" />
  <midPointStop
     offset="0.5"
     style="stop-color:#CCCCCC"
     id="midPointStop657" />
  <midPointStop
     offset="1"
     style="stop-color:#616161"
     id="midPointStop658" />
</radialGradient>
<radialGradient
   cx="234.960007"
   cy="-138.835007"
   fx="234.960007"
   fy="-138.835007"
   r="9.43599987"
   id="XMLID_11_"
   gradientUnits="userSpaceOnUse"
   gradientTransform="matrix(0.000000,-2.404000,0.649000,0.000000,116.6299,663.6741)"
   spreadMethod="pad">
  <stop
     style="stop-color:#cccccc;stop-opacity:1;"
     offset="0.00000000"
     id="stop647" />
  <stop
     style="stop-color:#616161;stop-opacity:1;"
     offset="1.00000000"
     id="stop648" />
  <midPointStop
     offset="0"
     style="stop-color:#CCCCCC"
     id="midPointStop649" />
  <midPointStop
     offset="0.5"
     style="stop-color:#CCCCCC"
     id="midPointStop650" />
  <midPointStop
     offset="1"
     style="stop-color:#616161"
     id="midPointStop651" />
</radialGradient>
<radialGradient
   cx="240.049805"
   cy="155.553696"
   fx="240.049805"
   fy="155.553696"
   r="9.43680000"
   id="XMLID_10_"
   gradientUnits="userSpaceOnUse"
   gradientTransform="translate(-196.1279,-102.2637)"
   spreadMethod="pad">
  <stop
     style="stop-color:#cccccc;stop-opacity:1;"
     offset="0.00000000"
     id="stop2783" />
  <stop
     style="stop-color:#494949;stop-opacity:1;"
     offset="1.00000000"
     id="stop2785" />
  <midPointStop
     offset="0"
     style="stop-color:#CCCCCC"
     id="midPointStop642" />
  <midPointStop
     offset="0.5"
     style="stop-color:#CCCCCC"
     id="midPointStop643" />
  <midPointStop
     offset="1"
     style="stop-color:#494949"
     id="midPointStop644" />
</radialGradient>
<linearGradient
   x1="267.902313"
   y1="140.181595"
   x2="267.902313"
   y2="183.757095"
   id="XMLID_9_"
   gradientUnits="userSpaceOnUse"
   gradientTransform="translate(-196.1279,-102.2637)"
   spreadMethod="pad">
  <stop
     style="stop-color:#ffffff;stop-opacity:1;"
     offset="0.00000000"
     id="stop617" />
  <stop
     style="stop-color:#ffe091;stop-opacity:1;"
     offset="1.00000000"
     id="stop618" />
  <midPointStop
     offset="0"
     style="stop-color:#FFFFFF"
     id="midPointStop619" />
  <midPointStop
     offset="0.5"
     style="stop-color:#FFFFFF"
     id="midPointStop620" />
  <midPointStop
     offset="1"
     style="stop-color:#FFE091"
     id="midPointStop621" />
</linearGradient>
<linearGradient
   x1="236.280304"
   y1="156.928696"
   x2="304.521790"
   y2="198.860107"
   id="XMLID_8_"
   gradientUnits="userSpaceOnUse"
   gradientTransform="translate(-196.1279,-102.2637)"
   spreadMethod="pad">
  <stop
     style="stop-color:#ffe091;stop-opacity:1;"
     offset="0.00000000"
     id="stop610" />
  <stop
     style="stop-color:#d6a84a;stop-opacity:1;"
     offset="1.00000000"
     id="stop611" />
  <midPointStop
     offset="0"
     style="stop-color:#FFE091"
     id="midPointStop612" />
  <midPointStop
     offset="0.5"
     style="stop-color:#FFE091"
     id="midPointStop613" />
  <midPointStop
     offset="1"
     style="stop-color:#D6A84A"
     id="midPointStop614" />
</linearGradient>
<linearGradient
   x1="236.280304"
   y1="156.928696"
   x2="304.521790"
   y2="198.860107"
   id="XMLID_7_"
   gradientUnits="userSpaceOnUse"
   gradientTransform="translate(-196.1279,-102.2637)"
   spreadMethod="pad">
  <stop
     style="stop-color:#cdcabd;stop-opacity:1;"
     offset="0.00000000"
     id="stop603" />
  <stop
     style="stop-color:#ab9366;stop-opacity:1;"
     offset="1.00000000"
     id="stop604" />
  <midPointStop
     offset="0"
     style="stop-color:#CDCABD"
     id="midPointStop605" />
  <midPointStop
     offset="0.5"
     style="stop-color:#CDCABD"
     id="midPointStop606" />
  <midPointStop
     offset="1"
     style="stop-color:#AB9366"
     id="midPointStop607" />
</linearGradient>
<linearGradient
   x1="218.571304"
   y1="209.451202"
   x2="268.313507"
   y2="209.451202"
   id="XMLID_6_"
   gradientUnits="userSpaceOnUse"
   gradientTransform="translate(-196.1279,-102.2637)"
   spreadMethod="pad">
  <stop
     style="stop-color:#fff030;stop-opacity:1;"
     offset="0.00000000"
     id="stop589" />
  <stop
     style="stop-color:#ffff99;stop-opacity:1;"
     offset="1.00000000"
     id="stop590" />
  <midPointStop
     offset="0"
     style="stop-color:#FFF030"
     id="midPointStop591" />
  <midPointStop
     offset="0.5"
     style="stop-color:#FFF030"
     id="midPointStop592" />
  <midPointStop
     offset="1"
     style="stop-color:#FFFF99"
     id="midPointStop593" />
</linearGradient>
<linearGradient
   x1="218.571304"
   y1="209.451202"
   x2="268.313507"
   y2="209.451202"
   id="linearGradient2751"
   gradientUnits="userSpaceOnUse"
   gradientTransform="translate(-196.1279,-102.2637)"
   spreadMethod="pad">
  <stop
     style="stop-color:#fff030;stop-opacity:1;"
     offset="0.00000000"
     id="stop582" />
  <stop
     style="stop-color:#ffae00;stop-opacity:1;"
     offset="1.00000000"
     id="stop583" />
  <midPointStop
     offset="0"
     style="stop-color:#FFF030"
     id="midPointStop584" />
  <midPointStop
     offset="0.5"
     style="stop-color:#FFF030"
     id="midPointStop585" />
  <midPointStop
     offset="1"
     style="stop-color:#FFAE00"
     id="midPointStop586" />
</linearGradient>
<linearGradient
   x1="234.541000"
   y1="159.765594"
   x2="302.778503"
   y2="201.694595"
   id="linearGradient2744"
   gradientUnits="userSpaceOnUse"
   gradientTransform="translate(-196.1279,-102.2637)"
   spreadMethod="pad">
  <stop
     style="stop-color:#616161;stop-opacity:1;"
     offset="0.00000000"
     id="stop575" />
  <stop
     style="stop-color:#494949;stop-opacity:1;"
     offset="1.00000000"
     id="stop576" />
  <midPointStop
     offset="0"
     style="stop-color:#616161"
     id="midPointStop577" />
  <midPointStop
     offset="0.5"
     style="stop-color:#616161"
     id="midPointStop578" />
  <midPointStop
     offset="1"
     style="stop-color:#494949"
     id="midPointStop579" />
</linearGradient>
<linearGradient
   x1="234.537094"
   y1="159.762695"
   x2="302.775085"
   y2="201.692001"
   id="linearGradient2737"
   gradientUnits="userSpaceOnUse"
   gradientTransform="translate(-196.1279,-102.2637)"
   spreadMethod="pad">
  <stop
     style="stop-color:#828282;stop-opacity:1;"
     offset="0.00000000"
     id="stop568" />
  <stop
     style="stop-color:#616161;stop-opacity:1;"
     offset="1.00000000"
     id="stop569" />
  <midPointStop
     offset="0"
     style="stop-color:#828282"
     id="midPointStop570" />
  <midPointStop
     offset="0.5"
     style="stop-color:#828282"
     id="midPointStop571" />
  <midPointStop
     offset="1"
     style="stop-color:#616161"
     id="midPointStop572" />
</linearGradient>
<linearGradient
   x1="217.337906"
   y1="214.331100"
   x2="217.337906"
   y2="149.072601"
   id="linearGradient2730"
   gradientUnits="userSpaceOnUse"
   gradientTransform="translate(-196.1279,-102.2637)"
   spreadMethod="pad">
  <stop
     style="stop-color:#cecedb;stop-opacity:1;"
     offset="0.00000000"
     id="stop561" />
  <stop
     style="stop-color:#ffffff;stop-opacity:1;"
     offset="1.00000000"
     id="stop562" />
  <midPointStop
     offset="0"
     style="stop-color:#CECEDB"
     id="midPointStop563" />
  <midPointStop
     offset="0.5"
     style="stop-color:#CECEDB"
     id="midPointStop564" />
  <midPointStop
     offset="1"
     style="stop-color:#FFFFFF"
     id="midPointStop565" />
</linearGradient>
<linearGradient
   x1="217.337906"
   y1="214.332993"
   x2="217.337906"
   y2="149.078201"
   id="linearGradient2723"
   gradientUnits="userSpaceOnUse"
   gradientTransform="translate(-196.1279,-102.2637)"
   spreadMethod="pad">
  <stop
     style="stop-color:#949494;stop-opacity:1;"
     offset="0.00000000"
     id="stop554" />
  <stop
     style="stop-color:#828282;stop-opacity:1;"
     offset="1.00000000"
     id="stop555" />
  <midPointStop
     offset="0"
     style="stop-color:#949494"
     id="midPointStop556" />
  <midPointStop
     offset="0.5"
     style="stop-color:#949494"
     id="midPointStop557" />
  <midPointStop
     offset="1"
     style="stop-color:#828282"
     id="midPointStop558" />
</linearGradient>
<linearGradient
   id="linearGradient1826">
  <stop
     style="stop-color:#ffffff;stop-opacity:0.61016947;"
     offset="0.0000000"
     id="stop1827" />
  <stop
     style="stop-color:#ffffff;stop-opacity:0;"
     offset="1"
     id="stop1828" />
</linearGradient>
<linearGradient
   inkscape:collect="always"
   id="linearGradient2195">
  <stop
     style="stop-color:#ffffff;stop-opacity:1;"
     offset="0"
     id="stop2197" />
  <stop
     style="stop-color:#ffffff;stop-opacity:0;"
     offset="1"
     id="stop2199" />
</linearGradient>
<linearGradient
   id="linearGradient2208">
  <stop
     style="stop-color:#ffffff;stop-opacity:0.60714287;"
     offset="0.0000000"
     id="stop2210" />
  <stop
     style="stop-color:#ffffff;stop-opacity:0;"
     offset="1"
     id="stop2212" />
</linearGradient>
<linearGradient
   y2="88.712013"
   x2="58.739265"
   y1="48.915756"
   x1="58.739265"
   gradientTransform="matrix(1.132728,0.000000,0.000000,0.276427,6.307819,40.90012)"
   gradientUnits="userSpaceOnUse"
   id="linearGradient94"
   xlink:href="#linearGradient2541"
   inkscape:collect="always" />
<linearGradient
   y2="88.712013"
   x2="58.739265"
   y1="48.915756"
   x1="58.739265"
   gradientTransform="matrix(1.094341,0.000000,0.000000,0.695206,8.878984,7.098934)"
   gradientUnits="userSpaceOnUse"
   id="linearGradient92"
   xlink:href="#linearGradient2541"
   inkscape:collect="always" />
<linearGradient
   gradientUnits="userSpaceOnUse"
   y2="26.201656"
   x2="47.048145"
   y1="73.211411"
   x1="49.776852"
   gradientTransform="matrix(1.212121,0.000000,0.000000,0.770030,2.784929,1.161147)"
   id="linearGradient88"
   xlink:href="#linearGradient1492"
   inkscape:collect="always" />
<linearGradient
   y2="10.392305"
   x2="155.88457"
   y1="10.392305"
   x1="138.56406"
   gradientTransform="matrix(-0.557677,0.149429,-0.448288,-1.673033,176.7624,13.38705)"
   gradientUnits="userSpaceOnUse"
   id="linearGradient132"
   xlink:href="#MaterialSoftShadow"
   inkscape:collect="always" />
<linearGradient
   y2="10.392305"
   x2="155.88457"
   y1="10.392305"
   x1="138.56406"
   gradientTransform="matrix(-0.149429,0.557677,1.673033,0.448288,109.6129,-53.76240)"
   gradientUnits="userSpaceOnUse"
   id="linearGradient131"
   xlink:href="#MaterialSoftShadow"
   inkscape:collect="always" />
<linearGradient
   y2="30.723587"
   x2="61.080898"
   y1="68.733429"
   x1="61.080898"
   gradientTransform="matrix(1.404740,0.000000,0.000000,0.643993,-4.241857,-1.404757)"
   gradientUnits="userSpaceOnUse"
   id="linearGradient532"
   xlink:href="#TransparentWhite"
   inkscape:collect="always" />
<linearGradient
   gradientUnits="userSpaceOnUse"
   y2="3.9652903"
   x2="123.05903"
   y1="241.99133"
   x1="-216.37779"
   gradientTransform="scale(0.962223,1.039260)"
   id="linearGradient489"
   xlink:href="#linearGradient486"
   inkscape:collect="always" />
<linearGradient
   gradientUnits="userSpaceOnUse"
   y2="22.218750"
   x2="101.95312"
   y1="17.296875"
   x1="106.87500"
   id="linearGradient443"
   xlink:href="#MaterialSoftShadow"
   inkscape:collect="always" />
<linearGradient
   y2="66.194740"
   x2="76.516380"
   y1="197.54245"
   x1="-59.549145"
   gradientTransform="scale(0.960547,1.041074)"
   gradientUnits="userSpaceOnUse"
   id="linearGradient439"
   xlink:href="#MaterialSoftShadow"
   inkscape:collect="always" />
<linearGradient
   gradientUnits="userSpaceOnUse"
   y2="51.599213"
   x2="74.861580"
   y1="11.005426"
   x1="118.16164"
   gradientTransform="scale(0.962223,1.039260)"
   id="linearGradient437"
   xlink:href="#MaterialSoftShadow"
   inkscape:collect="always" />
<linearGradient
   y2="84.253471"
   x2="77.756599"
   y1="156.12636"
   x1="31.319887"
   gradientTransform="matrix(0.952353,0.000000,0.000000,1.050031,-2.249373,-2.499997)"
   gradientUnits="userSpaceOnUse"
   id="linearGradient105"
   xlink:href="#MaterialSoftShadow"
   inkscape:collect="always" />
<linearGradient
   id="linearGradient3824">
  <stop
     id="stop3826"
     offset="0"
     style="stop-color:#000000;stop-opacity:0.215;" />
  <stop
     id="stop3828"
     offset="0.50000000"
     style="stop-color:#000000;stop-opacity:0.098;" />
  <stop
     id="stop3830"
     offset="1"
     style="stop-color:#000000;stop-opacity:0;" />
</linearGradient>
<linearGradient
   id="linearGradient486"
   inkscape:collect="always">
  <stop
     id="stop487"
     offset="0"
     style="stop-color:#000000;stop-opacity:1;" />
  <stop
     id="stop488"
     offset="1"
     style="stop-color:#000000;stop-opacity:0;" />
</linearGradient>
<linearGradient
   id="TransparentWhite">
  <stop
     id="stopwhitefull"
     offset="0"
     style="stop-color:#ffffff;stop-opacity:0;" />
  <stop
     id="stopwhitetransparent"
     offset="1"
     style="stop-color:#ffffff;stop-opacity:1;" />
</linearGradient>
<linearGradient
   gradientUnits="userSpaceOnUse"
   y2="137.31894"
   x2="51.600609"
   y1="94.483551"
   x1="51.600609"
   gradientTransform="matrix(1.404740,0.000000,0.000000,0.643993,1.253127,0.619053)"
   id="linearGradient2344"
   xlink:href="#GreenHilightGradient"
   inkscape:collect="always" />
<linearGradient
   id="GreenHilightGradient">
  <stop
     id="stop3885"
     offset="0"
     style="stop-color:#c5d2c8;stop-opacity:1;" />
  <stop
     id="stop3886"
     offset="1"
     style="stop-color:#c5d2c8;stop-opacity:0;" />
</linearGradient>
<linearGradient
   gradientTransform="matrix(0.947368,0.000000,0.000000,0.952380,1.303257,0.619053)"
   y2="83.758545"
   x2="75.544380"
   y1="115.33696"
   x1="75.544342"
   gradientUnits="userSpaceOnUse"
   id="linearGradient2329"
   xlink:href="#AccentGreenDarkGradient"
   inkscape:collect="always" />
<linearGradient
   id="AccentGreenDarkGradient">
  <stop
     id="stop3860"
     offset="0"
     style="stop-color:#267726;stop-opacity:1;" />
  <stop
     id="stop3861"
     offset="1"
     style="stop-color:#267726;stop-opacity:0;" />
</linearGradient>
<linearGradient
   gradientTransform="matrix(0.949874,0.000000,0.000000,0.952380,1.253127,0.619053)"
   y2="56.974136"
   x2="74.097221"
   y1="19.640625"
   x1="74.097221"
   gradientUnits="userSpaceOnUse"
   id="linearGradient2364"
   xlink:href="#BlueMediumGradient"
   inkscape:collect="always" />
<linearGradient
   id="BlueMediumGradient">
  <stop
     id="stop3844"
     offset="0"
     style="stop-color:#7590ae;stop-opacity:1;" />
  <stop
     id="stop3845"
     offset="1"
     style="stop-color:#7590ae;stop-opacity:0;" />
</linearGradient>
<linearGradient
   gradientUnits="userSpaceOnUse"
   gradientTransform="matrix(1.637843,0.000000,0.000000,0.205559,17.47468,22.55407)"
   y2="305.55167"
   x2="32.802035"
   y1="321.54959"
   x1="32.802035"
   id="linearGradient7984"
   xlink:href="#linearGradient2541"
   inkscape:collect="always" />
<linearGradient
   id="linearGradient2541"
   inkscape:collect="always">
  <stop
     id="stop2542"
     offset="0.0000000"
     style="stop-color:#000000;stop-opacity:0.0000000;" />
  <stop
     id="stop2543"
     offset="1.0000000"
     style="stop-color:#000000;stop-opacity:1.0000000;" />
</linearGradient>
<linearGradient
   gradientUnits="userSpaceOnUse"
   y2="263.54617"
   x2="49.343483"
   y1="228.23079"
   x1="48.756077"
   gradientTransform="matrix(1.221007,0.000000,0.000000,0.320926,13.70950,17.21696)"
   id="linearGradient1743"
   xlink:href="#linearGradient1492"
   inkscape:collect="always" />
<linearGradient
   id="linearGradient1492">
  <stop
     id="stop1493"
     offset="0.0000000"
     style="stop-color:#dadada;stop-opacity:1.0000000;" />
  <stop
     id="stop1496"
     offset="0.34923077"
     style="stop-color:#f1f1f1;stop-opacity:1.0000000;" />
  <stop
     id="stop1494"
     offset="1.0000000"
     style="stop-color:#f0f0f0;stop-opacity:1.0000000;" />
</linearGradient>
<linearGradient
   gradientUnits="userSpaceOnUse"
   gradientTransform="matrix(1.341838,0.000000,0.000000,0.250905,17.47468,22.55407)"
   y2="121.15584"
   x2="33.681586"
   y1="174.26285"
   x1="33.681586"
   id="linearGradient7987"
   xlink:href="#linearGradient2529"
   inkscape:collect="always" />
<linearGradient
   id="linearGradient2529"
   inkscape:collect="always">
  <stop
     id="stop2530"
     offset="0.0000000"
     style="stop-color:#ffffff;stop-opacity:0.0000000;" />
  <stop
     id="stop2532"
     offset="1"
     style="stop-color:#fff;stop-opacity:1;" />
</linearGradient>
<linearGradient
   gradientUnits="userSpaceOnUse"
   gradientTransform="matrix(1.637843,0.000000,0.000000,0.205559,17.47468,22.55407)"
   y2="286.77129"
   x2="31.503284"
   y1="330.08147"
   x1="31.095658"
   id="linearGradient7975"
   xlink:href="#linearGradient2541"
   inkscape:collect="always" />
<linearGradient
   gradientUnits="userSpaceOnUse"
   gradientTransform="matrix(1.447015,0.000000,0.000000,0.645031,-0.257060,-2.543704)"
   y2="173.14235"
   x2="51.103638"
   y1="101.98699"
   x1="51.103638"
   id="linearGradient1495"
   xlink:href="#linearGradient1568" />
<linearGradient
   id="linearGradient1568">
  <stop
     id="stop1569"
     offset="0.0000000"
     style="stop-color:#dedede;stop-opacity:1.0000000;" />
  <stop
     id="stop1574"
     offset="0.42928788"
     style="stop-color:#b7dbdb;stop-opacity:1.0000000;" />
  <stop
     id="stop3320"
     offset="0.58570588"
     style="stop-color:#e3e3e3;stop-opacity:1.0000000;" />
  <stop
     id="stop1570"
     offset="1.0000000"
     style="stop-color:#ffffff;stop-opacity:1.0000000;" />
</linearGradient>
<radialGradient
   gradientUnits="userSpaceOnUse"
   fy="137.43433"
   fx="27.010122"
   r="51.667703"
   cy="176.56437"
   cx="24.825565"
   id="radialGradient1505"
   xlink:href="#linearGradient1806" />
<linearGradient
   id="linearGradient1806">
  <stop
     id="stop1807"
     offset="0.0000000"
     style="stop-color:#000000;stop-opacity:0.53103447;" />
  <stop
     id="stop3276"
     offset="0.64777780"
     style="stop-color:#000000;stop-opacity:0.073446326;" />
  <stop
     id="stop1808"
     offset="1.0000000"
     style="stop-color:#000000;stop-opacity:0.0000000;" />
</linearGradient>
<radialGradient
   gradientUnits="userSpaceOnUse"
   r="51.667703"
   fy="137.43433"
   fx="27.010122"
   cy="176.56437"
   cx="24.825565"
   id="radialGradient1752"
   xlink:href="#linearGradient1806"
   inkscape:collect="always" />
<linearGradient
   gradientTransform="matrix(-1.732052,0.000000,0.000000,-0.577350,-3.148701,-3.834810)"
   y2="-71.385284"
   x2="-58.386848"
   y1="-64.786987"
   x1="-63.834415"
   gradientUnits="userSpaceOnUse"
   id="linearGradient6826"
   xlink:href="#MaterialSoftShadow"
   inkscape:collect="always" />
<linearGradient
   y2="30.723587"
   x2="61.080898"
   y1="68.733429"
   x1="61.080898"
   gradientTransform="matrix(1.404740,0.000000,0.000000,0.643993,-1.246873,-1.642847)"
   gradientUnits="userSpaceOnUse"
   id="linearGradient2"
   xlink:href="#TransparentWhite"
   inkscape:collect="always" />
<linearGradient
   id="linearGradient3">
  <stop
     id="stop4"
     offset="0"
     style="stop-color:#ffffff;stop-opacity:0;" />
  <stop
     id="stop5"
     offset="1"
     style="stop-color:#ffffff;stop-opacity:1;" />
</linearGradient>
<linearGradient
   inkscape:collect="always"
   xlink:href="#MaterialSoftShadow"
   id="linearGradient3872"
   gradientUnits="userSpaceOnUse"
   gradientTransform="matrix(-0.149429,0.557677,1.673033,0.448288,-24.73660,-57.55951)"
   x1="138.56406"
   y1="10.392305"
   x2="155.88457"
   y2="10.392305" />
<linearGradient
   inkscape:collect="always"
   xlink:href="#MaterialSoftShadow"
   id="linearGradient3875"
   gradientUnits="userSpaceOnUse"
   gradientTransform="matrix(-0.557677,0.149429,-0.448288,-1.673033,42.41290,9.589943)"
   x1="138.56406"
   y1="10.392305"
   x2="155.88457"
   y2="10.392305" />
<linearGradient
   inkscape:collect="always"
   xlink:href="#MaterialSoftShadow"
   id="linearGradient3878"
   gradientUnits="userSpaceOnUse"
   x1="106.87500"
   y1="17.296875"
   x2="101.95312"
   y2="22.218750"
   gradientTransform="translate(-134.3495,-3.797107)" />
<linearGradient
   inkscape:collect="always"
   xlink:href="#TransparentWhite"
   id="linearGradient3882"
   gradientUnits="userSpaceOnUse"
   gradientTransform="matrix(1.404740,0.000000,0.000000,0.643993,-138.5914,-5.201864)"
   x1="61.080898"
   y1="68.733429"
   x2="61.080898"
   y2="30.723587" />
<linearGradient
   inkscape:collect="always"
   xlink:href="#MaterialSoftShadow"
   id="linearGradient3885"
   gradientUnits="userSpaceOnUse"
   gradientTransform="matrix(0.960547,0.000000,0.000000,1.041074,-134.3495,-3.797107)"
   x1="-59.549145"
   y1="197.54245"
   x2="76.516380"
   y2="66.194740" />
<linearGradient
   inkscape:collect="always"
   xlink:href="#MaterialSoftShadow"
   id="linearGradient3890"
   gradientUnits="userSpaceOnUse"
   gradientTransform="matrix(0.962223,0.000000,0.000000,1.039260,-134.3495,-3.797107)"
   x1="118.16164"
   y1="11.005426"
   x2="74.861580"
   y2="51.599213" />
<linearGradient
   inkscape:collect="always"
   xlink:href="#linearGradient486"
   id="linearGradient3892"
   gradientUnits="userSpaceOnUse"
   gradientTransform="matrix(0.962223,0.000000,0.000000,1.039260,-134.3495,-3.797107)"
   x1="-216.37779"
   y1="241.99133"
   x2="123.05903"
   y2="3.9652903" />
<linearGradient
   inkscape:collect="always"
   xlink:href="#linearGradient3908"
   id="linearGradient3914"
   x1="109.50127"
   y1="180.39227"
   x2="52.623596"
   y2="10.852942"
   gradientUnits="userSpaceOnUse" />
<linearGradient
   inkscape:collect="always"
   xlink:href="#linearGradient3908"
   id="linearGradient3916"
   gradientUnits="userSpaceOnUse"
   x1="109.50127"
   y1="180.39227"
   x2="52.623596"
   y2="10.852942" />
<linearGradient
   inkscape:collect="always"
   xlink:href="#linearGradient3908"
   id="linearGradient3918"
   gradientUnits="userSpaceOnUse"
   x1="109.50127"
   y1="180.39227"
   x2="52.623596"
   y2="10.852942" />
<linearGradient
   inkscape:collect="always"
   xlink:href="#linearGradient3908"
   id="linearGradient3920"
   gradientUnits="userSpaceOnUse"
   x1="109.50127"
   y1="180.39227"
   x2="52.623596"
   y2="10.852942" />
<linearGradient
   inkscape:collect="always"
   xlink:href="#linearGradient3908"
   id="linearGradient3922"
   gradientUnits="userSpaceOnUse"
   x1="109.50127"
   y1="180.39227"
   x2="52.623596"
   y2="10.852942" />
<linearGradient
   inkscape:collect="always"
   xlink:href="#linearGradient3908"
   id="linearGradient3924"
   gradientUnits="userSpaceOnUse"
   x1="109.50127"
   y1="180.39227"
   x2="52.623596"
   y2="10.852942" />
<linearGradient
   inkscape:collect="always"
   xlink:href="#linearGradient3908"
   id="linearGradient3926"
   gradientUnits="userSpaceOnUse"
   x1="109.50127"
   y1="180.39227"
   x2="52.623596"
   y2="10.852942" />
</defs>
  <sodipodi:namedview
     id="base"
     pagecolor="#ffffff"
     bordercolor="#666666"
     borderopacity="1.0"
     inkscape:pageopacity="0.0"
     inkscape:pageshadow="2"
     inkscape:zoom="2.0495048"
     inkscape:cx="89.208545"
     inkscape:cy="40.601337"
     inkscape:document-units="px"
     inkscape:current-layer="layer1"
     inkscape:window-width="844"
     inkscape:window-height="548"
     inkscape:window-x="0"
     inkscape:window-y="25"
     showguides="true"
     inkscape:guide-bbox="true" />
  <metadata
     id="metadata7">
    <rdf:RDF>
      <cc:Work
         rdf:about="">
        <dc:format>image/svg+xml</dc:format>
        <dc:type
           rdf:resource="http://purl.org/dc/dcmitype/StillImage" />
      </cc:Work>
    </rdf:RDF>
  </metadata>
  <g
     inkscape:label="Layer 1"
     inkscape:groupmode="layer"
     id="layer1">
    <path
       style="fill:url(#linearGradient5918);fill-opacity:1.0;fill-rule:evenodd;stroke:none;stroke-width:0.25000000pt;stroke-linecap:butt;stroke-linejoin:miter;stroke-opacity:1.0000000"
       d="M 96.120779,122.14493 L 127.34783,104.57971 L 78.555561,95.309177 L 96.120779,122.14493 z "
       id="path5910" />
    <path
       sodipodi:type="arc"
       style="opacity:1.0000000;color:#000000;fill:url(#radialGradient5902);fill-opacity:1.0000000;fill-rule:evenodd;stroke:none;stroke-width:2.0000000;stroke-linecap:round;stroke-linejoin:round;marker:none;marker-start:none;marker-mid:none;marker-end:none;stroke-miterlimit:4.0000000;stroke-dasharray:none;stroke-dashoffset:0.0000000;stroke-opacity:1.0000000;visibility:visible;display:inline;overflow:visible"
       id="path5894"
       sodipodi:cx="60.502419"
       sodipodi:cy="115.07005"
       sodipodi:rx="56.111115"
       sodipodi:ry="11.954107"
       d="M 116.61353 115.07005 A 56.111115 11.954107 0 1 1  4.3913040,115.07005 A 56.111115 11.954107 0 1 1  116.61353 115.07005 z"
       transform="translate(-4.879227,0.487923)" />
    <g
       id="g5883"
       transform="matrix(0.983988,0.000000,0.000000,0.983988,-4.195292,-0.907282)">
      <path
         sodipodi:nodetypes="cccccc"
         id="path1306"
         d="M 14.086358,113.28281 C 16.041434,83.381642 17.996510,46.580205 13.741344,11.158821 L 66.183392,5.8111122 C 75.383751,5.1785874 102.06480,14.953971 102.06480,23.579308 C 105.97495,60.035733 105.05491,93.732050 101.37477,124.66826 L 14.086358,113.28281 z "
         style="fill:url(#linearGradient5888);fill-opacity:1.0000000;fill-rule:evenodd;stroke:#bababa;stroke-width:3.0000000;stroke-linecap:round;stroke-linejoin:round;stroke-miterlimit:4.0000000;stroke-dasharray:none;stroke-opacity:1.0000000" />
      <path
         sodipodi:nodetypes="cccc"
         id="path2039"
         d="M 70.410069,10.112239 C 64.487338,19.025088 66.327409,32.423111 72.307643,37.195798 C 82.313033,26.730389 89.040795,21.267676 100.42624,23.222752 C 94.359754,14.942429 81.091111,8.6890580 70.410069,10.112239 z "
         style="fill:url(#linearGradient5890);fill-opacity:1.0000000;fill-rule:evenodd;stroke:none;stroke-width:0.25000000pt;stroke-linecap:butt;stroke-linejoin:miter;stroke-opacity:1.0000000" />
      <path
         sodipodi:nodetypes="cccc"
         id="path2037"
         d="M 63.940805,7.5361796 C 58.018074,16.449028 59.858145,29.847051 65.838379,34.619738 C 75.843769,24.154329 89.126787,21.106710 100.51223,23.061786 C 97.895880,15.126477 74.621847,6.1129987 63.940805,7.5361796 z "
         style="fill:url(#linearGradient5892);fill-opacity:1.0000000;fill-rule:evenodd;stroke:#bababa;stroke-width:1.0000000;stroke-linecap:butt;stroke-linejoin:miter;stroke-miterlimit:4.0000000;stroke-dasharray:none;stroke-opacity:1.0000000" />
    </g>
    <g
       inkscape:label="Layer 1"
       id="g3854"
       transform="matrix(0.851959,0.146229,-0.125935,0.989251,11.93222,15.52067)">
      <g
         id="g1841"
         transform="translate(-2.099737,7.895395)">
        <g
           id="g1832"
           transform="matrix(0.826334,0.000000,0.000000,0.826334,-68.80604,16.93519)">
          <path
             style="font-size:12.000000px;fill:#000000;fill-opacity:1.0000000;fill-rule:evenodd;stroke:none;stroke-width:0.87190402"
             d="M 16.224390,67.774690 C 19.839270,67.787080 21.242130,67.962390 26.099790,65.207090 C 27.680080,63.250750 32.585850,58.874860 34.838540,59.266440 C 37.776070,58.380960 49.346170,57.695730 49.599900,58.123090 C 49.853530,58.550440 57.405950,63.736710 58.851860,63.741740 C 60.297880,63.746710 67.152060,61.680570 64.619830,55.957050 C 62.757620,53.306500 57.658730,52.009580 55.667170,49.870380 C 53.675600,47.731180 49.113760,38.588870 49.978450,34.455030 C 50.843130,30.321280 55.859980,18.354600 50.167330,16.543810 C 44.474680,14.733040 42.001370,16.643750 40.839850,20.520680 C 39.678310,24.397600 40.414720,32.929540 39.430650,34.674710 C 38.446510,36.419870 29.974870,51.317340 27.674110,52.546290 C 25.373360,53.775150 11.325070,57.820890 10.594730,59.993430 C 9.8643000,62.165940 8.8701900,66.811110 16.224390,67.774690 z "
             id="path1833"
             sodipodi:nodetypes="cccccccccccccc"
             transform="matrix(1.617655,0.000000,0.000000,1.617655,104.6032,-17.61614)" />
          <g
             id="g1834"
             transform="matrix(3.369189,0.856964,-0.795794,3.146192,111.9534,-38.13339)"
             style="font-size:12.000000px;stroke:#000000">
            <path
               style="fill:none;stroke:none"
               d="M 22.600000,10.700000 C 20.100000,12.900000 31.000000,32.600000 33.600000,27.600000 C 36.500000,21.900000 7.5000000,33.900000 13.800000,35.600000 C 21.100000,37.500000 27.300000,6.6000000 22.600000,10.800000 L 22.600000,10.700000 z "
               id="path1835" />
            <path
               style="fill:#f8310e;stroke:none"
               d="M 21.900000,10.600000 C 18.900000,14.500000 29.000000,32.500000 33.700000,28.300000 C 36.300000,26.000000 32.600000,25.300000 30.800000,25.600000 C 25.800000,26.500000 20.700000,28.600000 16.300000,31.100000 C 15.400000,31.600000 9.9000000,34.600000 12.600000,36.100000 C 15.700000,37.800000 18.700000,33.300000 19.800000,31.300000 C 22.700000,26.300000 24.200000,20.000000 24.700000,14.200000 C 24.900000,12.400000 24.800000,8.2000000 22.000000,10.300000 C 21.100000,11.000000 21.700000,11.900000 22.600000,11.200000 C 23.000000,10.900000 22.900000,16.200000 22.800000,16.700000 C 22.300000,20.100000 21.400000,23.400000 20.300000,26.700000 C 19.300000,29.400000 17.900000,33.500000 15.200000,34.900000 C 13.100000,36.000000 13.700000,34.100000 14.700000,33.400000 C 15.900000,32.500000 17.300000,31.800000 18.600000,31.200000 C 21.400000,29.800000 24.300000,28.700000 27.300000,27.800000 C 28.400000,27.400000 29.600000,27.200000 30.800000,27.000000 C 32.700000,26.700000 32.800000,28.300000 31.500000,27.500000 C 28.900000,26.000000 27.100000,22.400000 25.700000,19.900000 C 24.800000,18.300000 21.500000,12.900000 22.900000,11.000000 C 23.600000,10.100000 22.100000,10.100000 21.600000,10.700000 L 21.900000,10.600000 z "
               id="path1836" />
          </g>
        </g>
      </g>
    </g>
    <g
       inkscape:label="Layer 1"
       id="g3894"
       transform="matrix(0.797828,4.771020e-2,-0.492137,0.322763,51.03289,88.94786)"
       style="fill:url(#linearGradient3914);fill-opacity:1.0000000;stroke:none">
      <g
         id="g3896"
         transform="translate(-2.099737,7.895395)"
         style="fill:url(#linearGradient3916);fill-opacity:1.0000000;stroke:none">
        <g
           id="g3898"
           transform="matrix(0.826334,0.000000,0.000000,0.826334,-68.80604,16.93519)"
           style="fill:url(#linearGradient3918);fill-opacity:1.0000000;stroke:none">
          <path
             style="font-size:12.000000px;fill:url(#linearGradient3920);fill-opacity:1.0000000;fill-rule:evenodd;stroke:none;stroke-width:0.87190402"
             d="M 16.224390,67.774690 C 19.839270,67.787080 21.242130,67.962390 26.099790,65.207090 C 27.680080,63.250750 32.585850,58.874860 34.838540,59.266440 C 37.776070,58.380960 49.346170,57.695730 49.599900,58.123090 C 49.853530,58.550440 57.405950,63.736710 58.851860,63.741740 C 60.297880,63.746710 67.152060,61.680570 64.619830,55.957050 C 62.757620,53.306500 57.658730,52.009580 55.667170,49.870380 C 53.675600,47.731180 49.113760,38.588870 49.978450,34.455030 C 50.843130,30.321280 55.859980,18.354600 50.167330,16.543810 C 44.474680,14.733040 42.001370,16.643750 40.839850,20.520680 C 39.678310,24.397600 40.414720,32.929540 39.430650,34.674710 C 38.446510,36.419870 29.974870,51.317340 27.674110,52.546290 C 25.373360,53.775150 11.325070,57.820890 10.594730,59.993430 C 9.8643000,62.165940 8.8701900,66.811110 16.224390,67.774690 z "
             id="path3900"
             sodipodi:nodetypes="cccccccccccccc"
             transform="matrix(1.617655,0.000000,0.000000,1.617655,104.6032,-17.61614)" />
          <g
             id="g3902"
             transform="matrix(3.369189,0.856964,-0.795794,3.146192,111.9534,-38.13339)"
             style="font-size:12.000000px;fill:url(#linearGradient3922);fill-opacity:1.0000000;stroke:none">
            <path
               style="fill:url(#linearGradient3924);fill-opacity:1.0000000;stroke:none"
               d="M 22.600000,10.700000 C 20.100000,12.900000 31.000000,32.600000 33.600000,27.600000 C 36.500000,21.900000 7.5000000,33.900000 13.800000,35.600000 C 21.100000,37.500000 27.300000,6.6000000 22.600000,10.800000 L 22.600000,10.700000 z "
               id="path3904" />
            <path
               style="fill:url(#linearGradient3926);fill-opacity:1.0000000;stroke:none"
               d="M 21.900000,10.600000 C 18.900000,14.500000 29.000000,32.500000 33.700000,28.300000 C 36.300000,26.000000 32.600000,25.300000 30.800000,25.600000 C 25.800000,26.500000 20.700000,28.600000 16.300000,31.100000 C 15.400000,31.600000 9.9000000,34.600000 12.600000,36.100000 C 15.700000,37.800000 18.700000,33.300000 19.800000,31.300000 C 22.700000,26.300000 24.200000,20.000000 24.700000,14.200000 C 24.900000,12.400000 24.800000,8.2000000 22.000000,10.300000 C 21.100000,11.000000 21.700000,11.900000 22.600000,11.200000 C 23.000000,10.900000 22.900000,16.200000 22.800000,16.700000 C 22.300000,20.100000 21.400000,23.400000 20.300000,26.700000 C 19.300000,29.400000 17.900000,33.500000 15.200000,34.900000 C 13.100000,36.000000 13.700000,34.100000 14.700000,33.400000 C 15.900000,32.500000 17.300000,31.800000 18.600000,31.200000 C 21.400000,29.800000 24.300000,28.700000 27.300000,27.800000 C 28.400000,27.400000 29.600000,27.200000 30.800000,27.000000 C 32.700000,26.700000 32.800000,28.300000 31.500000,27.500000 C 28.900000,26.000000 27.100000,22.400000 25.700000,19.900000 C 24.800000,18.300000 21.500000,12.900000 22.900000,11.000000 C 23.600000,10.100000 22.100000,10.100000 21.600000,10.700000 L 21.900000,10.600000 z "
               id="path3906" />
          </g>
        </g>
      </g>
    </g>
  </g>
</svg>
