\BOOKMARK [0][-]{chapter.1}{\376\377\000S\0003\000Q\000L}{}% 1
\BOOKMARK [1][-]{section.1.1}{\376\377\000F\000e\000a\000t\000u\000r\000e\000s}{chapter.1}% 2
\BOOKMARK [1][-]{section.1.2}{\376\377\000D\000e\000v\000e\000l\000o\000p\000m\000e\000n\000t\000\040\000S\000t\000a\000t\000u\000s}{chapter.1}% 3
\BOOKMARK [1][-]{section.1.3}{\376\377\000S\000u\000p\000p\000o\000r\000t\000e\000d\000\040\000P\000l\000a\000t\000f\000o\000r\000m\000s}{chapter.1}% 4
\BOOKMARK [1][-]{section.1.4}{\376\377\000C\000o\000n\000t\000r\000i\000b\000u\000t\000i\000n\000g}{chapter.1}% 5
\BOOKMARK [0][-]{chapter.2}{\376\377\000I\000n\000s\000t\000a\000l\000l\000a\000t\000i\000o\000n}{}% 6
\BOOKMARK [1][-]{section.2.1}{\376\377\000D\000e\000p\000e\000n\000d\000e\000n\000c\000i\000e\000s}{chapter.2}% 7
\BOOKMARK [1][-]{section.2.2}{\376\377\000I\000n\000s\000t\000a\000l\000l\000i\000n\000g\000\040\000S\0003\000Q\000L}{chapter.2}% 8
\BOOKMARK [1][-]{section.2.3}{\376\377\000D\000e\000v\000e\000l\000o\000p\000m\000e\000n\000t\000\040\000V\000e\000r\000s\000i\000o\000n}{chapter.2}% 9
\BOOKMARK [1][-]{section.2.4}{\376\377\000R\000u\000n\000n\000i\000n\000g\000\040\000t\000e\000s\000t\000s\000\040\000r\000e\000q\000u\000i\000r\000i\000n\000g\000\040\000r\000e\000m\000o\000t\000e\000\040\000s\000e\000r\000v\000e\000r\000s}{chapter.2}% 10
\BOOKMARK [0][-]{chapter.3}{\376\377\000S\000t\000o\000r\000a\000g\000e\000\040\000B\000a\000c\000k\000e\000n\000d\000s}{}% 11
\BOOKMARK [1][-]{section.3.1}{\376\377\000G\000o\000o\000g\000l\000e\000\040\000S\000t\000o\000r\000a\000g\000e}{chapter.3}% 12
\BOOKMARK [1][-]{section.3.2}{\376\377\000A\000m\000a\000z\000o\000n\000\040\000S\0003}{chapter.3}% 13
\BOOKMARK [1][-]{section.3.3}{\376\377\000O\000p\000e\000n\000S\000t\000a\000c\000k\000/\000S\000w\000i\000f\000t}{chapter.3}% 14
\BOOKMARK [1][-]{section.3.4}{\376\377\000R\000a\000c\000k\000s\000p\000a\000c\000e\000\040\000C\000l\000o\000u\000d\000F\000i\000l\000e\000s}{chapter.3}% 15
\BOOKMARK [1][-]{section.3.5}{\376\377\000S\0003\000\040\000c\000o\000m\000p\000a\000t\000i\000b\000l\000e}{chapter.3}% 16
\BOOKMARK [1][-]{section.3.6}{\376\377\000B\000a\000c\000k\000b\000l\000a\000z\000e\000\040\000B\0002}{chapter.3}% 17
\BOOKMARK [1][-]{section.3.7}{\376\377\000L\000o\000c\000a\000l}{chapter.3}% 18
\BOOKMARK [0][-]{chapter.4}{\376\377\000I\000m\000p\000o\000r\000t\000a\000n\000t\000\040\000R\000u\000l\000e\000s\000\040\000t\000o\000\040\000A\000v\000o\000i\000d\000\040\000L\000o\000s\000i\000n\000g\000\040\000D\000a\000t\000a}{}% 19
\BOOKMARK [1][-]{section.4.1}{\376\377\000R\000u\000l\000e\000s\000\040\000i\000n\000\040\000a\000\040\000N\000u\000t\000s\000h\000e\000l\000l}{chapter.4}% 20
\BOOKMARK [1][-]{section.4.2}{\376\377\000C\000o\000n\000s\000i\000s\000t\000e\000n\000c\000y\000\040\000W\000i\000n\000d\000o\000w\000\040\000L\000i\000s\000t}{chapter.4}% 21
\BOOKMARK [1][-]{section.4.3}{\376\377\000D\000a\000t\000a\000\040\000C\000o\000n\000s\000i\000s\000t\000e\000n\000c\000y}{chapter.4}% 22
\BOOKMARK [1][-]{section.4.4}{\376\377\000D\000a\000t\000a\000\040\000D\000u\000r\000a\000b\000i\000l\000i\000t\000y}{chapter.4}% 23
\BOOKMARK [0][-]{chapter.5}{\376\377\000F\000i\000l\000e\000\040\000S\000y\000s\000t\000e\000m\000\040\000C\000r\000e\000a\000t\000i\000o\000n}{}% 24
\BOOKMARK [0][-]{chapter.6}{\376\377\000M\000a\000n\000a\000g\000i\000n\000g\000\040\000F\000i\000l\000e\000\040\000S\000y\000s\000t\000e\000m\000s}{}% 25
\BOOKMARK [1][-]{section.6.1}{\376\377\000C\000h\000a\000n\000g\000i\000n\000g\000\040\000t\000h\000e\000\040\000P\000a\000s\000s\000p\000h\000r\000a\000s\000e}{chapter.6}% 26
\BOOKMARK [1][-]{section.6.2}{\376\377\000U\000p\000g\000r\000a\000d\000i\000n\000g\000\040\000t\000h\000e\000\040\000f\000i\000l\000e\000\040\000s\000y\000s\000t\000e\000m}{chapter.6}% 27
\BOOKMARK [1][-]{section.6.3}{\376\377\000D\000e\000l\000e\000t\000i\000n\000g\000\040\000a\000\040\000f\000i\000l\000e\000\040\000s\000y\000s\000t\000e\000m}{chapter.6}% 28
\BOOKMARK [1][-]{section.6.4}{\376\377\000R\000e\000s\000t\000o\000r\000i\000n\000g\000\040\000M\000e\000t\000a\000d\000a\000t\000a\000\040\000B\000a\000c\000k\000u\000p\000s}{chapter.6}% 29
\BOOKMARK [0][-]{chapter.7}{\376\377\000M\000o\000u\000n\000t\000i\000n\000g}{}% 30
\BOOKMARK [1][-]{section.7.1}{\376\377\000P\000e\000r\000m\000i\000s\000s\000i\000o\000n\000\040\000C\000h\000e\000c\000k\000i\000n\000g}{chapter.7}% 31
\BOOKMARK [1][-]{section.7.2}{\376\377\000C\000o\000m\000p\000r\000e\000s\000s\000i\000o\000n\000\040\000A\000l\000g\000o\000r\000i\000t\000h\000m\000s}{chapter.7}% 32
\BOOKMARK [1][-]{section.7.3}{\376\377\000N\000o\000t\000e\000s\000\040\000a\000b\000o\000u\000t\000\040\000C\000a\000c\000h\000i\000n\000g}{chapter.7}% 33
\BOOKMARK [1][-]{section.7.4}{\376\377\000N\000F\000S\000\040\000S\000u\000p\000p\000o\000r\000t}{chapter.7}% 34
\BOOKMARK [1][-]{section.7.5}{\376\377\000F\000a\000i\000l\000u\000r\000e\000\040\000M\000o\000d\000e\000s}{chapter.7}% 35
\BOOKMARK [1][-]{section.7.6}{\376\377\000A\000u\000t\000o\000m\000a\000t\000i\000c\000\040\000M\000o\000u\000n\000t\000i\000n\000g}{chapter.7}% 36
\BOOKMARK [0][-]{chapter.8}{\376\377\000A\000d\000v\000a\000n\000c\000e\000d\000\040\000S\0003\000Q\000L\000\040\000F\000e\000a\000t\000u\000r\000e\000s}{}% 37
\BOOKMARK [1][-]{section.8.1}{\376\377\000S\000n\000a\000p\000s\000h\000o\000t\000t\000i\000n\000g\000\040\000a\000n\000d\000\040\000C\000o\000p\000y\000-\000o\000n\000-\000W\000r\000i\000t\000e}{chapter.8}% 38
\BOOKMARK [1][-]{section.8.2}{\376\377\000G\000e\000t\000t\000i\000n\000g\000\040\000S\000t\000a\000t\000i\000s\000t\000i\000c\000s}{chapter.8}% 39
\BOOKMARK [1][-]{section.8.3}{\376\377\000I\000m\000m\000u\000t\000a\000b\000l\000e\000\040\000T\000r\000e\000e\000s}{chapter.8}% 40
\BOOKMARK [1][-]{section.8.4}{\376\377\000F\000a\000s\000t\000\040\000R\000e\000c\000u\000r\000s\000i\000v\000e\000\040\000R\000e\000m\000o\000v\000a\000l}{chapter.8}% 41
\BOOKMARK [1][-]{section.8.5}{\376\377\000R\000u\000n\000t\000i\000m\000e\000\040\000C\000o\000n\000f\000i\000g\000u\000r\000a\000t\000i\000o\000n}{chapter.8}% 42
\BOOKMARK [0][-]{chapter.9}{\376\377\000U\000n\000m\000o\000u\000n\000t\000i\000n\000g}{}% 43
\BOOKMARK [0][-]{chapter.10}{\376\377\000C\000h\000e\000c\000k\000i\000n\000g\000\040\000f\000o\000r\000\040\000E\000r\000r\000o\000r\000s}{}% 44
\BOOKMARK [1][-]{section.10.1}{\376\377\000C\000h\000e\000c\000k\000i\000n\000g\000\040\000a\000n\000d\000\040\000r\000e\000p\000a\000i\000r\000i\000n\000g\000\040\000i\000n\000t\000e\000r\000n\000a\000l\000\040\000f\000i\000l\000e\000\040\000s\000y\000s\000t\000e\000m\000\040\000e\000r\000r\000o\000r\000s}{chapter.10}% 45
\BOOKMARK [1][-]{section.10.2}{\376\377\000D\000e\000t\000e\000c\000t\000i\000n\000g\000\040\000a\000n\000d\000\040\000h\000a\000n\000d\000l\000i\000n\000g\000\040\000b\000a\000c\000k\000e\000n\000d\000\040\000d\000a\000t\000a\000\040\000c\000o\000r\000r\000u\000p\000t\000i\000o\000n}{chapter.10}% 46
\BOOKMARK [0][-]{chapter.11}{\376\377\000S\000t\000o\000r\000i\000n\000g\000\040\000B\000a\000c\000k\000e\000n\000d\000\040\000I\000n\000f\000o\000r\000m\000a\000t\000i\000o\000n\000\040\000a\000n\000d\000\040\000C\000r\000e\000d\000e\000n\000t\000i\000a\000l\000s}{}% 47
\BOOKMARK [0][-]{chapter.12}{\376\377\000C\000o\000n\000t\000r\000i\000b\000u\000t\000e\000d\000\040\000P\000r\000o\000g\000r\000a\000m\000s}{}% 48
\BOOKMARK [1][-]{section.12.1}{\376\377\000b\000e\000n\000c\000h\000m\000a\000r\000k\000.\000p\000y}{chapter.12}% 49
\BOOKMARK [1][-]{section.12.2}{\376\377\000c\000l\000o\000n\000e\000\137\000f\000s\000.\000p\000y}{chapter.12}% 50
\BOOKMARK [1][-]{section.12.3}{\376\377\000p\000c\000p\000.\000p\000y}{chapter.12}% 51
\BOOKMARK [1][-]{section.12.4}{\376\377\000s\0003\000q\000l\000\137\000b\000a\000c\000k\000u\000p\000.\000s\000h}{chapter.12}% 52
\BOOKMARK [1][-]{section.12.5}{\376\377\000e\000x\000p\000i\000r\000e\000\137\000b\000a\000c\000k\000u\000p\000s\000.\000p\000y}{chapter.12}% 53
\BOOKMARK [1][-]{section.12.6}{\376\377\000r\000e\000m\000o\000v\000e\000\137\000o\000b\000j\000e\000c\000t\000s\000.\000p\000y}{chapter.12}% 54
\BOOKMARK [0][-]{chapter.13}{\376\377\000T\000i\000p\000s\000\040\000\046\000\040\000T\000r\000i\000c\000k\000s}{}% 55
\BOOKMARK [1][-]{section.13.1}{\376\377\000S\000S\000H\000\040\000B\000a\000c\000k\000e\000n\000d}{chapter.13}% 56
\BOOKMARK [1][-]{section.13.2}{\376\377\000P\000e\000r\000m\000a\000n\000e\000n\000t\000l\000y\000\040\000m\000o\000u\000n\000t\000e\000d\000\040\000b\000a\000c\000k\000u\000p\000\040\000f\000i\000l\000e\000\040\000s\000y\000s\000t\000e\000m}{chapter.13}% 57
\BOOKMARK [1][-]{section.13.3}{\376\377\000I\000m\000p\000r\000o\000v\000i\000n\000g\000\040\000c\000o\000p\000y\000\040\000p\000e\000r\000f\000o\000r\000m\000a\000n\000c\000e}{chapter.13}% 58
\BOOKMARK [0][-]{chapter.14}{\376\377\000F\000r\000e\000q\000u\000e\000n\000t\000l\000y\000\040\000A\000s\000k\000e\000d\000\040\000Q\000u\000e\000s\000t\000i\000o\000n\000s}{}% 59
\BOOKMARK [1][-]{section.14.1}{\376\377\000W\000h\000a\000t\000\040\000d\000o\000e\000s\000\040\040\034\000p\000y\000t\000h\000o\000n\000-\000a\000p\000s\000w\000\040\000m\000u\000s\000t\000\040\000b\000e\000\040\000l\000i\000n\000k\000e\000d\000\040\000d\000y\000n\000a\000m\000i\000c\000a\000l\000l\000y\000\040\000t\000o\000\040\000s\000q\000l\000i\000t\000e\0003\040\035\000\040\000m\000e\000a\000n\000?}{chapter.14}% 60
\BOOKMARK [1][-]{section.14.2}{\376\377\000H\000o\000w\000\040\000c\000a\000n\000\040\000I\000\040\000i\000m\000p\000r\000o\000v\000e\000\040\000t\000h\000e\000\040\000f\000i\000l\000e\000\040\000s\000y\000s\000t\000e\000m\000\040\000t\000h\000r\000o\000u\000g\000h\000p\000u\000t\000?}{chapter.14}% 61
\BOOKMARK [1][-]{section.14.3}{\376\377\000W\000h\000y\000\040\000d\000o\000e\000s\000\040\000d\000f\000\040\000s\000h\000o\000w\000\040\0001\000\040\000T\000B\000\040\000o\000f\000\040\000f\000r\000e\000e\000\040\000s\000p\000a\000c\000e\000?}{chapter.14}% 62
\BOOKMARK [1][-]{section.14.4}{\376\377\000W\000h\000i\000c\000h\000\040\000o\000p\000e\000r\000a\000t\000i\000n\000g\000\040\000s\000y\000s\000t\000e\000m\000s\000\040\000a\000r\000e\000\040\000s\000u\000p\000p\000o\000r\000t\000e\000d\000?}{chapter.14}% 63
\BOOKMARK [1][-]{section.14.5}{\376\377\000I\000s\000\040\000t\000h\000e\000r\000e\000\040\000a\000\040\000f\000i\000l\000e\000\040\000s\000i\000z\000e\000\040\000l\000i\000m\000i\000t\000?}{chapter.14}% 64
\BOOKMARK [1][-]{section.14.6}{\376\377\000S\000u\000p\000p\000o\000s\000e\000\040\000I\000\040\000w\000a\000n\000t\000\040\000t\000o\000\040\000m\000a\000k\000e\000\040\000a\000\040\000s\000m\000a\000l\000l\000\040\000c\000h\000a\000n\000g\000e\000\040\000i\000n\000\040\000a\000\040\000v\000e\000r\000y\000\040\000l\000a\000r\000g\000e\000\040\000f\000i\000l\000e\000.\000\040\000W\000i\000l\000l\000\040\000S\0003\000Q\000L\000\040\000d\000o\000w\000n\000l\000o\000a\000d\000\040\000a\000n\000d\000\040\000r\000e\000-\000u\000p\000l\000o\000a\000d\000\040\000t\000h\000e\000\040\000e\000n\000t\000i\000r\000e\000\040\000f\000i\000l\000e\000?}{chapter.14}% 65
\BOOKMARK [1][-]{section.14.7}{\376\377\000I\000\040\000d\000o\000n\040\031\000t\000\040\000q\000u\000i\000t\000e\000\040\000u\000n\000d\000e\000r\000s\000t\000a\000n\000d\000\040\000t\000h\000i\000s\000\040\000d\000e\000-\000d\000u\000p\000l\000i\000c\000a\000t\000i\000o\000n\000\040\000f\000e\000a\000t\000u\000r\000e\040\046}{chapter.14}% 66
\BOOKMARK [1][-]{section.14.8}{\376\377\000W\000h\000a\000t\000\040\000d\000o\000e\000s\000\040\000t\000h\000e\000\040\040\034\000T\000r\000a\000n\000s\000p\000o\000r\000t\000\040\000e\000n\000d\000p\000o\000i\000n\000t\000\040\000n\000o\000t\000\040\000c\000o\000n\000n\000e\000c\000t\000e\000d\040\035\000\040\000e\000r\000r\000o\000r\000\040\000m\000e\000a\000n\000?}{chapter.14}% 67
\BOOKMARK [1][-]{section.14.9}{\376\377\000W\000h\000a\000t\000\040\000d\000o\000e\000s\000\040\040\034\000B\000a\000c\000k\000e\000n\000d\000\040\000r\000e\000p\000o\000r\000t\000s\000\040\000t\000h\000a\000t\000\040\000f\000s\000\040\000i\000s\000\040\000s\000t\000i\000l\000l\000\040\000m\000o\000u\000n\000t\000e\000d\000\040\000e\000l\000s\000e\000w\000h\000e\000r\000e\000,\000\040\000a\000b\000o\000r\000t\000i\000n\000g\040\035\000\040\000m\000e\000a\000n\000?}{chapter.14}% 68
\BOOKMARK [1][-]{section.14.10}{\376\377\000C\000a\000n\000\040\000I\000\040\000a\000c\000c\000e\000s\000s\000\040\000a\000n\000\040\000S\0003\000Q\000L\000\040\000f\000i\000l\000e\000\040\000s\000y\000s\000t\000e\000m\000\040\000o\000n\000\040\000m\000u\000l\000t\000i\000p\000l\000e\000\040\000c\000o\000m\000p\000u\000t\000e\000r\000s\000\040\000s\000i\000m\000u\000l\000t\000a\000n\000e\000o\000u\000s\000l\000y\000?}{chapter.14}% 69
\BOOKMARK [1][-]{section.14.11}{\376\377\000W\000h\000a\000t\000\040\000m\000a\000x\000i\000m\000u\000m\000\040\000o\000b\000j\000e\000c\000t\000\040\000s\000i\000z\000e\000\040\000s\000h\000o\000u\000l\000d\000\040\000I\000\040\000u\000s\000e\000?}{chapter.14}% 70
\BOOKMARK [1][-]{section.14.12}{\376\377\000I\000s\000\040\000t\000h\000e\000r\000e\000\040\000a\000\040\000w\000a\000y\000\040\000t\000o\000\040\000m\000a\000k\000e\000\040\000t\000h\000e\000\040\000c\000a\000c\000h\000e\000\040\000p\000e\000r\000s\000i\000s\000t\000e\000n\000t\000\040\000/\000\040\000a\000c\000c\000e\000s\000s\000\040\000t\000h\000e\000\040\000f\000i\000l\000e\000\040\000s\000y\000s\000t\000e\000m\000\040\000o\000f\000f\000l\000i\000n\000e\000?}{chapter.14}% 71
\BOOKMARK [1][-]{section.14.13}{\376\377\000I\000\040\000w\000o\000u\000l\000d\000\040\000l\000i\000k\000e\000\040\000t\000o\000\040\000u\000s\000e\000\040\000S\0003\000Q\000L\000\040\000w\000i\000t\000h\000\040\000H\000u\000b\000i\000c\000,\000\040\000b\000u\000t\040\046}{chapter.14}% 72
\BOOKMARK [1][-]{section.14.14}{\376\377\000W\000h\000a\000t\040\031\000s\000\040\000a\000\040\000r\000e\000a\000s\000o\000n\000a\000b\000l\000e\000\040\000m\000e\000t\000a\000d\000a\000t\000a\000\040\000u\000p\000l\000o\000a\000d\000\040\000i\000n\000t\000e\000r\000v\000a\000l\000?}{chapter.14}% 73
\BOOKMARK [0][-]{chapter.15}{\376\377\000K\000n\000o\000w\000n\000\040\000I\000s\000s\000u\000e\000s}{}% 74
\BOOKMARK [0][-]{chapter.16}{\376\377\000M\000a\000n\000p\000a\000g\000e\000s}{}% 75
\BOOKMARK [1][-]{section.16.1}{\376\377\000T\000h\000e\000\040\000m\000k\000f\000s\000.\000s\0003\000q\000l\000\040\000c\000o\000m\000m\000a\000n\000d}{chapter.16}% 76
\BOOKMARK [1][-]{section.16.2}{\376\377\000T\000h\000e\000\040\000s\0003\000q\000l\000a\000d\000m\000\040\000c\000o\000m\000m\000a\000n\000d}{chapter.16}% 77
\BOOKMARK [1][-]{section.16.3}{\376\377\000T\000h\000e\000\040\000m\000o\000u\000n\000t\000.\000s\0003\000q\000l\000\040\000c\000o\000m\000m\000a\000n\000d}{chapter.16}% 78
\BOOKMARK [1][-]{section.16.4}{\376\377\000T\000h\000e\000\040\000s\0003\000q\000l\000s\000t\000a\000t\000\040\000c\000o\000m\000m\000a\000n\000d}{chapter.16}% 79
\BOOKMARK [1][-]{section.16.5}{\376\377\000T\000h\000e\000\040\000s\0003\000q\000l\000c\000t\000r\000l\000\040\000c\000o\000m\000m\000a\000n\000d}{chapter.16}% 80
\BOOKMARK [1][-]{section.16.6}{\376\377\000T\000h\000e\000\040\000s\0003\000q\000l\000c\000p\000\040\000c\000o\000m\000m\000a\000n\000d}{chapter.16}% 81
\BOOKMARK [1][-]{section.16.7}{\376\377\000T\000h\000e\000\040\000s\0003\000q\000l\000r\000m\000\040\000c\000o\000m\000m\000a\000n\000d}{chapter.16}% 82
\BOOKMARK [1][-]{section.16.8}{\376\377\000T\000h\000e\000\040\000s\0003\000q\000l\000l\000o\000c\000k\000\040\000c\000o\000m\000m\000a\000n\000d}{chapter.16}% 83
\BOOKMARK [1][-]{section.16.9}{\376\377\000T\000h\000e\000\040\000u\000m\000o\000u\000n\000t\000.\000s\0003\000q\000l\000\040\000c\000o\000m\000m\000a\000n\000d}{chapter.16}% 84
\BOOKMARK [1][-]{section.16.10}{\376\377\000T\000h\000e\000\040\000f\000s\000c\000k\000.\000s\0003\000q\000l\000\040\000c\000o\000m\000m\000a\000n\000d}{chapter.16}% 85
\BOOKMARK [1][-]{section.16.11}{\376\377\000T\000h\000e\000\040\000s\0003\000q\000l\000\137\000o\000a\000u\000t\000h\000\137\000c\000l\000i\000e\000n\000t\000\040\000c\000o\000m\000m\000a\000n\000d}{chapter.16}% 86
\BOOKMARK [1][-]{section.16.12}{\376\377\000T\000h\000e\000\040\000s\0003\000q\000l\000\137\000v\000e\000r\000i\000f\000y\000\040\000c\000o\000m\000m\000a\000n\000d}{chapter.16}% 87
\BOOKMARK [1][-]{section.16.13}{\376\377\000T\000h\000e\000\040\000p\000c\000p\000\040\000c\000o\000m\000m\000a\000n\000d}{chapter.16}% 88
\BOOKMARK [1][-]{section.16.14}{\376\377\000T\000h\000e\000\040\000e\000x\000p\000i\000r\000e\000\137\000b\000a\000c\000k\000u\000p\000s\000\040\000c\000o\000m\000m\000a\000n\000d}{chapter.16}% 89
\BOOKMARK [0][-]{chapter.17}{\376\377\000F\000u\000r\000t\000h\000e\000r\000\040\000R\000e\000s\000o\000u\000r\000c\000e\000s\000\040\000/\000\040\000G\000e\000t\000t\000i\000n\000g\000\040\000H\000e\000l\000p}{}% 90
\BOOKMARK [0][-]{chapter.18}{\376\377\000I\000m\000p\000l\000e\000m\000e\000n\000t\000a\000t\000i\000o\000n\000\040\000D\000e\000t\000a\000i\000l\000s}{}% 91
\BOOKMARK [1][-]{section.18.1}{\376\377\000M\000e\000t\000a\000d\000a\000t\000a\000\040\000S\000t\000o\000r\000a\000g\000e}{chapter.18}% 92
\BOOKMARK [1][-]{section.18.2}{\376\377\000D\000a\000t\000a\000\040\000S\000t\000o\000r\000a\000g\000e}{chapter.18}% 93
\BOOKMARK [1][-]{section.18.3}{\376\377\000D\000a\000t\000a\000\040\000D\000e\000-\000D\000u\000p\000l\000i\000c\000a\000t\000i\000o\000n}{chapter.18}% 94
\BOOKMARK [1][-]{section.18.4}{\376\377\000C\000a\000c\000h\000i\000n\000g}{chapter.18}% 95
\BOOKMARK [1][-]{section.18.5}{\376\377\000E\000v\000e\000n\000t\000u\000a\000l\000\040\000C\000o\000n\000s\000i\000s\000t\000e\000n\000c\000y\000\040\000H\000a\000n\000d\000l\000i\000n\000g}{chapter.18}% 96
\BOOKMARK [1][-]{section.18.6}{\376\377\000E\000n\000c\000r\000y\000p\000t\000i\000o\000n}{chapter.18}% 97
