\BOOKMARK [0][-]{chapter.1}{\376\377\000S\0003\000Q\000L}{}% 1
\BOOKMARK [1][-]{section.1.1}{\376\377\000F\000e\000a\000t\000u\000r\000e\000s}{chapter.1}% 2
\BOOKMARK [1][-]{section.1.2}{\376\377\000D\000e\000v\000e\000l\000o\000p\000m\000e\000n\000t\000\040\000S\000t\000a\000t\000u\000s}{chapter.1}% 3
\BOOKMARK [1][-]{section.1.3}{\376\377\000S\000u\000p\000p\000o\000r\000t\000e\000d\000\040\000P\000l\000a\000t\000f\000o\000r\000m\000s}{chapter.1}% 4
\BOOKMARK [1][-]{section.1.4}{\376\377\000C\000o\000n\000t\000r\000i\000b\000u\000t\000i\000n\000g}{chapter.1}% 5
\BOOKMARK [0][-]{chapter.2}{\376\377\000I\000n\000s\000t\000a\000l\000l\000a\000t\000i\000o\000n}{}% 6
\BOOKMARK [1][-]{section.2.1}{\376\377\000D\000e\000p\000e\000n\000d\000e\000n\000c\000i\000e\000s}{chapter.2}% 7
\BOOKMARK [1][-]{section.2.2}{\376\377\000I\000n\000s\000t\000a\000l\000l\000i\000n\000g\000\040\000S\0003\000Q\000L}{chapter.2}% 8
\BOOKMARK [2][-]{subsection.2.2.1}{\376\377\000R\000u\000n\000n\000i\000n\000g\000\040\000S\0003\000Q\000L\000\040\000c\000o\000m\000m\000a\000n\000d\000s\000\040\000d\000i\000r\000e\000c\000t\000l\000y}{section.2.2}% 9
\BOOKMARK [2][-]{subsection.2.2.2}{\376\377\000I\000n\000s\000t\000a\000l\000l\000i\000n\000g\000\040\000S\0003\000Q\000L\000\040\000f\000o\000r\000\040\000t\000h\000e\000\040\000c\000u\000r\000r\000e\000n\000t\000\040\000u\000s\000e\000r}{section.2.2}% 10
\BOOKMARK [2][-]{subsection.2.2.3}{\376\377\000I\000n\000s\000t\000a\000l\000l\000i\000n\000g\000\040\000S\0003\000Q\000L\000\040\000f\000o\000r\000\040\000a\000l\000l\000\040\000u\000s\000e\000r\000s}{section.2.2}% 11
\BOOKMARK [1][-]{section.2.3}{\376\377\000D\000e\000v\000e\000l\000o\000p\000m\000e\000n\000t\000\040\000V\000e\000r\000s\000i\000o\000n}{chapter.2}% 12
\BOOKMARK [1][-]{section.2.4}{\376\377\000R\000u\000n\000n\000i\000n\000g\000\040\000t\000e\000s\000t\000s\000\040\000r\000e\000q\000u\000i\000r\000i\000n\000g\000\040\000r\000e\000m\000o\000t\000e\000\040\000s\000e\000r\000v\000e\000r\000s}{chapter.2}% 13
\BOOKMARK [0][-]{chapter.3}{\376\377\000S\000t\000o\000r\000a\000g\000e\000\040\000B\000a\000c\000k\000e\000n\000d\000s}{}% 14
\BOOKMARK [1][-]{section.3.1}{\376\377\000G\000o\000o\000g\000l\000e\000\040\000S\000t\000o\000r\000a\000g\000e}{chapter.3}% 15
\BOOKMARK [1][-]{section.3.2}{\376\377\000A\000m\000a\000z\000o\000n\000\040\000S\0003}{chapter.3}% 16
\BOOKMARK [1][-]{section.3.3}{\376\377\000O\000p\000e\000n\000S\000t\000a\000c\000k\000/\000S\000w\000i\000f\000t}{chapter.3}% 17
\BOOKMARK [1][-]{section.3.4}{\376\377\000R\000a\000c\000k\000s\000p\000a\000c\000e\000\040\000C\000l\000o\000u\000d\000F\000i\000l\000e\000s}{chapter.3}% 18
\BOOKMARK [1][-]{section.3.5}{\376\377\000S\0003\000\040\000c\000o\000m\000p\000a\000t\000i\000b\000l\000e}{chapter.3}% 19
\BOOKMARK [1][-]{section.3.6}{\376\377\000B\000a\000c\000k\000b\000l\000a\000z\000e\000\040\000B\0002}{chapter.3}% 20
\BOOKMARK [1][-]{section.3.7}{\376\377\000L\000o\000c\000a\000l}{chapter.3}% 21
\BOOKMARK [0][-]{chapter.4}{\376\377\000I\000m\000p\000o\000r\000t\000a\000n\000t\000\040\000R\000u\000l\000e\000s\000\040\000t\000o\000\040\000A\000v\000o\000i\000d\000\040\000L\000o\000s\000i\000n\000g\000\040\000D\000a\000t\000a}{}% 22
\BOOKMARK [1][-]{section.4.1}{\376\377\000R\000u\000l\000e\000s\000\040\000i\000n\000\040\000a\000\040\000N\000u\000t\000s\000h\000e\000l\000l}{chapter.4}% 23
\BOOKMARK [1][-]{section.4.2}{\376\377\000D\000a\000t\000a\000\040\000D\000u\000r\000a\000b\000i\000l\000i\000t\000y}{chapter.4}% 24
\BOOKMARK [0][-]{chapter.5}{\376\377\000F\000i\000l\000e\000\040\000S\000y\000s\000t\000e\000m\000\040\000C\000r\000e\000a\000t\000i\000o\000n}{}% 25
\BOOKMARK [0][-]{chapter.6}{\376\377\000M\000a\000n\000a\000g\000i\000n\000g\000\040\000F\000i\000l\000e\000\040\000S\000y\000s\000t\000e\000m\000s}{}% 26
\BOOKMARK [1][-]{section.6.1}{\376\377\000C\000h\000a\000n\000g\000i\000n\000g\000\040\000t\000h\000e\000\040\000P\000a\000s\000s\000p\000h\000r\000a\000s\000e}{chapter.6}% 27
\BOOKMARK [1][-]{section.6.2}{\376\377\000R\000e\000c\000o\000v\000e\000r\000i\000n\000g\000\040\000t\000h\000e\000\040\000m\000a\000s\000t\000e\000r\000\040\000k\000e\000y}{chapter.6}% 28
\BOOKMARK [1][-]{section.6.3}{\376\377\000R\000e\000s\000t\000o\000r\000i\000n\000g\000\040\000M\000e\000t\000a\000d\000a\000t\000a\000\040\000B\000a\000c\000k\000u\000p\000s}{chapter.6}% 29
\BOOKMARK [1][-]{section.6.4}{\376\377\000D\000e\000l\000e\000t\000i\000n\000g\000\040\000a\000\040\000f\000i\000l\000e\000\040\000s\000y\000s\000t\000e\000m}{chapter.6}% 30
\BOOKMARK [1][-]{section.6.5}{\376\377\000U\000p\000g\000r\000a\000d\000i\000n\000g\000\040\000t\000h\000e\000\040\000f\000i\000l\000e\000\040\000s\000y\000s\000t\000e\000m}{chapter.6}% 31
\BOOKMARK [0][-]{chapter.7}{\376\377\000M\000o\000u\000n\000t\000i\000n\000g}{}% 32
\BOOKMARK [1][-]{section.7.1}{\376\377\000P\000e\000r\000m\000i\000s\000s\000i\000o\000n\000\040\000C\000h\000e\000c\000k\000i\000n\000g}{chapter.7}% 33
\BOOKMARK [1][-]{section.7.2}{\376\377\000C\000o\000m\000p\000r\000e\000s\000s\000i\000o\000n\000\040\000A\000l\000g\000o\000r\000i\000t\000h\000m\000s}{chapter.7}% 34
\BOOKMARK [1][-]{section.7.3}{\376\377\000N\000o\000t\000e\000s\000\040\000a\000b\000o\000u\000t\000\040\000C\000a\000c\000h\000i\000n\000g}{chapter.7}% 35
\BOOKMARK [2][-]{subsection.7.3.1}{\376\377\000M\000a\000x\000i\000m\000u\000m\000\040\000N\000u\000m\000b\000e\000r\000\040\000o\000f\000\040\000C\000a\000c\000h\000e\000\040\000E\000n\000t\000r\000i\000e\000s}{section.7.3}% 36
\BOOKMARK [2][-]{subsection.7.3.2}{\376\377\000C\000a\000c\000h\000e\000\040\000F\000l\000u\000s\000h\000i\000n\000g\000\040\000a\000n\000d\000\040\000E\000x\000p\000i\000r\000a\000t\000i\000o\000n}{section.7.3}% 37
\BOOKMARK [1][-]{section.7.4}{\376\377\000N\000F\000S\000\040\000S\000u\000p\000p\000o\000r\000t}{chapter.7}% 38
\BOOKMARK [1][-]{section.7.5}{\376\377\000F\000a\000i\000l\000u\000r\000e\000\040\000M\000o\000d\000e\000s}{chapter.7}% 39
\BOOKMARK [1][-]{section.7.6}{\376\377\000A\000u\000t\000o\000m\000a\000t\000i\000c\000\040\000M\000o\000u\000n\000t\000i\000n\000g}{chapter.7}% 40
\BOOKMARK [0][-]{chapter.8}{\376\377\000A\000d\000v\000a\000n\000c\000e\000d\000\040\000S\0003\000Q\000L\000\040\000F\000e\000a\000t\000u\000r\000e\000s}{}% 41
\BOOKMARK [1][-]{section.8.1}{\376\377\000S\000n\000a\000p\000s\000h\000o\000t\000t\000i\000n\000g\000\040\000a\000n\000d\000\040\000C\000o\000p\000y\000-\000o\000n\000-\000W\000r\000i\000t\000e}{chapter.8}% 42
\BOOKMARK [2][-]{subsection.8.1.1}{\376\377\000S\000n\000a\000p\000s\000h\000o\000t\000t\000i\000n\000g\000\040\000v\000s\000\040\000H\000a\000r\000d\000l\000i\000n\000k\000i\000n\000g}{section.8.1}% 43
\BOOKMARK [1][-]{section.8.2}{\376\377\000G\000e\000t\000t\000i\000n\000g\000\040\000S\000t\000a\000t\000i\000s\000t\000i\000c\000s}{chapter.8}% 44
\BOOKMARK [1][-]{section.8.3}{\376\377\000I\000m\000m\000u\000t\000a\000b\000l\000e\000\040\000T\000r\000e\000e\000s}{chapter.8}% 45
\BOOKMARK [1][-]{section.8.4}{\376\377\000F\000a\000s\000t\000\040\000R\000e\000c\000u\000r\000s\000i\000v\000e\000\040\000R\000e\000m\000o\000v\000a\000l}{chapter.8}% 46
\BOOKMARK [1][-]{section.8.5}{\376\377\000R\000u\000n\000t\000i\000m\000e\000\040\000C\000o\000n\000f\000i\000g\000u\000r\000a\000t\000i\000o\000n}{chapter.8}% 47
\BOOKMARK [0][-]{chapter.9}{\376\377\000U\000n\000m\000o\000u\000n\000t\000i\000n\000g}{}% 48
\BOOKMARK [0][-]{chapter.10}{\376\377\000C\000h\000e\000c\000k\000i\000n\000g\000\040\000f\000o\000r\000\040\000E\000r\000r\000o\000r\000s}{}% 49
\BOOKMARK [1][-]{section.10.1}{\376\377\000C\000h\000e\000c\000k\000i\000n\000g\000\040\000a\000n\000d\000\040\000r\000e\000p\000a\000i\000r\000i\000n\000g\000\040\000i\000n\000t\000e\000r\000n\000a\000l\000\040\000f\000i\000l\000e\000\040\000s\000y\000s\000t\000e\000m\000\040\000e\000r\000r\000o\000r\000s}{chapter.10}% 50
\BOOKMARK [1][-]{section.10.2}{\376\377\000D\000e\000t\000e\000c\000t\000i\000n\000g\000\040\000a\000n\000d\000\040\000h\000a\000n\000d\000l\000i\000n\000g\000\040\000b\000a\000c\000k\000e\000n\000d\000\040\000d\000a\000t\000a\000\040\000c\000o\000r\000r\000u\000p\000t\000i\000o\000n}{chapter.10}% 51
\BOOKMARK [0][-]{chapter.11}{\376\377\000S\000t\000o\000r\000i\000n\000g\000\040\000B\000a\000c\000k\000e\000n\000d\000\040\000I\000n\000f\000o\000r\000m\000a\000t\000i\000o\000n\000\040\000a\000n\000d\000\040\000C\000r\000e\000d\000e\000n\000t\000i\000a\000l\000s}{}% 52
\BOOKMARK [0][-]{chapter.12}{\376\377\000C\000o\000n\000t\000r\000i\000b\000u\000t\000e\000d\000\040\000P\000r\000o\000g\000r\000a\000m\000s}{}% 53
\BOOKMARK [1][-]{section.12.1}{\376\377\000b\000e\000n\000c\000h\000m\000a\000r\000k\000.\000p\000y}{chapter.12}% 54
\BOOKMARK [1][-]{section.12.2}{\376\377\000p\000c\000p\000.\000p\000y}{chapter.12}% 55
\BOOKMARK [1][-]{section.12.3}{\376\377\000s\0003\000q\000l\000\137\000b\000a\000c\000k\000u\000p\000.\000s\000h}{chapter.12}% 56
\BOOKMARK [1][-]{section.12.4}{\376\377\000e\000x\000p\000i\000r\000e\000\137\000b\000a\000c\000k\000u\000p\000s\000.\000p\000y}{chapter.12}% 57
\BOOKMARK [1][-]{section.12.5}{\376\377\000r\000e\000m\000o\000v\000e\000\137\000o\000b\000j\000e\000c\000t\000s\000.\000p\000y}{chapter.12}% 58
\BOOKMARK [0][-]{chapter.13}{\376\377\000T\000i\000p\000s\000\040\000\046\000\040\000T\000r\000i\000c\000k\000s}{}% 59
\BOOKMARK [1][-]{section.13.1}{\376\377\000S\000S\000H\000\040\000B\000a\000c\000k\000e\000n\000d}{chapter.13}% 60
\BOOKMARK [1][-]{section.13.2}{\376\377\000P\000e\000r\000m\000a\000n\000e\000n\000t\000l\000y\000\040\000m\000o\000u\000n\000t\000e\000d\000\040\000b\000a\000c\000k\000u\000p\000\040\000f\000i\000l\000e\000\040\000s\000y\000s\000t\000e\000m}{chapter.13}% 61
\BOOKMARK [1][-]{section.13.3}{\376\377\000I\000m\000p\000r\000o\000v\000i\000n\000g\000\040\000c\000o\000p\000y\000\040\000p\000e\000r\000f\000o\000r\000m\000a\000n\000c\000e}{chapter.13}% 62
\BOOKMARK [0][-]{chapter.14}{\376\377\000F\000r\000e\000q\000u\000e\000n\000t\000l\000y\000\040\000A\000s\000k\000e\000d\000\040\000Q\000u\000e\000s\000t\000i\000o\000n\000s}{}% 63
\BOOKMARK [1][-]{section.14.1}{\376\377\000H\000o\000w\000\040\000c\000a\000n\000\040\000I\000\040\000i\000m\000p\000r\000o\000v\000e\000\040\000t\000h\000e\000\040\000f\000i\000l\000e\000\040\000s\000y\000s\000t\000e\000m\000\040\000t\000h\000r\000o\000u\000g\000h\000p\000u\000t\000?}{chapter.14}% 64
\BOOKMARK [1][-]{section.14.2}{\376\377\000W\000h\000y\000\040\000d\000o\000e\000s\000\040\000d\000f\000\040\000s\000h\000o\000w\000\040\0001\000\040\000T\000B\000\040\000o\000f\000\040\000f\000r\000e\000e\000\040\000s\000p\000a\000c\000e\000?}{chapter.14}% 65
\BOOKMARK [1][-]{section.14.3}{\376\377\000W\000h\000i\000c\000h\000\040\000o\000p\000e\000r\000a\000t\000i\000n\000g\000\040\000s\000y\000s\000t\000e\000m\000s\000\040\000a\000r\000e\000\040\000s\000u\000p\000p\000o\000r\000t\000e\000d\000?}{chapter.14}% 66
\BOOKMARK [1][-]{section.14.4}{\376\377\000I\000s\000\040\000t\000h\000e\000r\000e\000\040\000a\000\040\000f\000i\000l\000e\000\040\000s\000i\000z\000e\000\040\000l\000i\000m\000i\000t\000?}{chapter.14}% 67
\BOOKMARK [1][-]{section.14.5}{\376\377\000S\000u\000p\000p\000o\000s\000e\000\040\000I\000\040\000w\000a\000n\000t\000\040\000t\000o\000\040\000m\000a\000k\000e\000\040\000a\000\040\000s\000m\000a\000l\000l\000\040\000c\000h\000a\000n\000g\000e\000\040\000i\000n\000\040\000a\000\040\000v\000e\000r\000y\000\040\000l\000a\000r\000g\000e\000\040\000f\000i\000l\000e\000.\000\040\000W\000i\000l\000l\000\040\000S\0003\000Q\000L\000\040\000d\000o\000w\000n\000l\000o\000a\000d\000\040\000a\000n\000d\000\040\000r\000e\000-\000u\000p\000l\000o\000a\000d\000\040\000t\000h\000e\000\040\000e\000n\000t\000i\000r\000e\000\040\000f\000i\000l\000e\000?}{chapter.14}% 68
\BOOKMARK [1][-]{section.14.6}{\376\377\000I\000\040\000d\000o\000n\040\031\000t\000\040\000q\000u\000i\000t\000e\000\040\000u\000n\000d\000e\000r\000s\000t\000a\000n\000d\000\040\000t\000h\000i\000s\000\040\000d\000e\000-\000d\000u\000p\000l\000i\000c\000a\000t\000i\000o\000n\000\040\000f\000e\000a\000t\000u\000r\000e\040\046}{chapter.14}% 69
\BOOKMARK [1][-]{section.14.7}{\376\377\000W\000h\000a\000t\000\040\000d\000o\000e\000s\000\040\000t\000h\000e\000\040\040\034\000T\000r\000a\000n\000s\000p\000o\000r\000t\000\040\000e\000n\000d\000p\000o\000i\000n\000t\000\040\000n\000o\000t\000\040\000c\000o\000n\000n\000e\000c\000t\000e\000d\040\035\000\040\000e\000r\000r\000o\000r\000\040\000m\000e\000a\000n\000?}{chapter.14}% 70
\BOOKMARK [1][-]{section.14.8}{\376\377\000W\000h\000a\000t\000\040\000d\000o\000e\000s\000\040\040\034\000B\000a\000c\000k\000e\000n\000d\000\040\000r\000e\000p\000o\000r\000t\000s\000\040\000t\000h\000a\000t\000\040\000f\000s\000\040\000i\000s\000\040\000s\000t\000i\000l\000l\000\040\000m\000o\000u\000n\000t\000e\000d\000\040\000e\000l\000s\000e\000w\000h\000e\000r\000e\000,\000\040\000a\000b\000o\000r\000t\000i\000n\000g\040\035\000\040\000m\000e\000a\000n\000?}{chapter.14}% 71
\BOOKMARK [1][-]{section.14.9}{\376\377\000C\000a\000n\000\040\000I\000\040\000a\000c\000c\000e\000s\000s\000\040\000a\000n\000\040\000S\0003\000Q\000L\000\040\000f\000i\000l\000e\000\040\000s\000y\000s\000t\000e\000m\000\040\000o\000n\000\040\000m\000u\000l\000t\000i\000p\000l\000e\000\040\000c\000o\000m\000p\000u\000t\000e\000r\000s\000\040\000s\000i\000m\000u\000l\000t\000a\000n\000e\000o\000u\000s\000l\000y\000?}{chapter.14}% 72
\BOOKMARK [1][-]{section.14.10}{\376\377\000W\000h\000a\000t\000\040\000b\000l\000o\000c\000k\000\040\000s\000i\000z\000e\000\040\000s\000h\000o\000u\000l\000d\000\040\000I\000\040\000u\000s\000e\000?}{chapter.14}% 73
\BOOKMARK [1][-]{section.14.11}{\376\377\000I\000s\000\040\000t\000h\000e\000r\000e\000\040\000a\000\040\000w\000a\000y\000\040\000t\000o\000\040\000a\000c\000c\000e\000s\000s\000\040\000t\000h\000e\000\040\000f\000i\000l\000e\000\040\000s\000y\000s\000t\000e\000m\000\040\000o\000f\000f\000l\000i\000n\000e\000?}{chapter.14}% 74
\BOOKMARK [0][-]{chapter.15}{\376\377\000K\000n\000o\000w\000n\000\040\000I\000s\000s\000u\000e\000s}{}% 75
\BOOKMARK [0][-]{chapter.16}{\376\377\000M\000a\000n\000p\000a\000g\000e\000s}{}% 76
\BOOKMARK [1][-]{section.16.1}{\376\377\000T\000h\000e\000\040\000m\000k\000f\000s\000.\000s\0003\000q\000l\000\040\000c\000o\000m\000m\000a\000n\000d}{chapter.16}% 77
\BOOKMARK [2][-]{subsection.16.1.1}{\376\377\000S\000y\000n\000o\000p\000s\000i\000s}{section.16.1}% 78
\BOOKMARK [2][-]{subsection.16.1.2}{\376\377\000D\000e\000s\000c\000r\000i\000p\000t\000i\000o\000n}{section.16.1}% 79
\BOOKMARK [2][-]{subsection.16.1.3}{\376\377\000O\000p\000t\000i\000o\000n\000s}{section.16.1}% 80
\BOOKMARK [2][-]{subsection.16.1.4}{\376\377\000E\000x\000i\000t\000\040\000C\000o\000d\000e\000s}{section.16.1}% 81
\BOOKMARK [2][-]{subsection.16.1.5}{\376\377\000S\000e\000e\000\040\000A\000l\000s\000o}{section.16.1}% 82
\BOOKMARK [1][-]{section.16.2}{\376\377\000T\000h\000e\000\040\000s\0003\000q\000l\000a\000d\000m\000\040\000c\000o\000m\000m\000a\000n\000d}{chapter.16}% 83
\BOOKMARK [2][-]{subsection.16.2.1}{\376\377\000S\000y\000n\000o\000p\000s\000i\000s}{section.16.2}% 84
\BOOKMARK [2][-]{subsection.16.2.2}{\376\377\000D\000e\000s\000c\000r\000i\000p\000t\000i\000o\000n}{section.16.2}% 85
\BOOKMARK [2][-]{subsection.16.2.3}{\376\377\000O\000p\000t\000i\000o\000n\000s}{section.16.2}% 86
\BOOKMARK [2][-]{subsection.16.2.4}{\376\377\000A\000c\000t\000i\000o\000n\000s}{section.16.2}% 87
\BOOKMARK [2][-]{subsection.16.2.5}{\376\377\000E\000x\000i\000t\000\040\000C\000o\000d\000e\000s}{section.16.2}% 88
\BOOKMARK [2][-]{subsection.16.2.6}{\376\377\000S\000e\000e\000\040\000A\000l\000s\000o}{section.16.2}% 89
\BOOKMARK [1][-]{section.16.3}{\376\377\000T\000h\000e\000\040\000m\000o\000u\000n\000t\000.\000s\0003\000q\000l\000\040\000c\000o\000m\000m\000a\000n\000d}{chapter.16}% 90
\BOOKMARK [2][-]{subsection.16.3.1}{\376\377\000S\000y\000n\000o\000p\000s\000i\000s}{section.16.3}% 91
\BOOKMARK [2][-]{subsection.16.3.2}{\376\377\000D\000e\000s\000c\000r\000i\000p\000t\000i\000o\000n}{section.16.3}% 92
\BOOKMARK [2][-]{subsection.16.3.3}{\376\377\000O\000p\000t\000i\000o\000n\000s}{section.16.3}% 93
\BOOKMARK [2][-]{subsection.16.3.4}{\376\377\000E\000x\000i\000t\000\040\000C\000o\000d\000e\000s}{section.16.3}% 94
\BOOKMARK [2][-]{subsection.16.3.5}{\376\377\000S\000e\000e\000\040\000A\000l\000s\000o}{section.16.3}% 95
\BOOKMARK [1][-]{section.16.4}{\376\377\000T\000h\000e\000\040\000s\0003\000q\000l\000s\000t\000a\000t\000\040\000c\000o\000m\000m\000a\000n\000d}{chapter.16}% 96
\BOOKMARK [2][-]{subsection.16.4.1}{\376\377\000S\000y\000n\000o\000p\000s\000i\000s}{section.16.4}% 97
\BOOKMARK [2][-]{subsection.16.4.2}{\376\377\000D\000e\000s\000c\000r\000i\000p\000t\000i\000o\000n}{section.16.4}% 98
\BOOKMARK [2][-]{subsection.16.4.3}{\376\377\000O\000p\000t\000i\000o\000n\000s}{section.16.4}% 99
\BOOKMARK [2][-]{subsection.16.4.4}{\376\377\000E\000x\000i\000t\000\040\000C\000o\000d\000e\000s}{section.16.4}% 100
\BOOKMARK [2][-]{subsection.16.4.5}{\376\377\000S\000e\000e\000\040\000A\000l\000s\000o}{section.16.4}% 101
\BOOKMARK [1][-]{section.16.5}{\376\377\000T\000h\000e\000\040\000s\0003\000q\000l\000c\000t\000r\000l\000\040\000c\000o\000m\000m\000a\000n\000d}{chapter.16}% 102
\BOOKMARK [2][-]{subsection.16.5.1}{\376\377\000S\000y\000n\000o\000p\000s\000i\000s}{section.16.5}% 103
\BOOKMARK [2][-]{subsection.16.5.2}{\376\377\000D\000e\000s\000c\000r\000i\000p\000t\000i\000o\000n}{section.16.5}% 104
\BOOKMARK [2][-]{subsection.16.5.3}{\376\377\000O\000p\000t\000i\000o\000n\000s}{section.16.5}% 105
\BOOKMARK [2][-]{subsection.16.5.4}{\376\377\000E\000x\000i\000t\000\040\000C\000o\000d\000e\000s}{section.16.5}% 106
\BOOKMARK [2][-]{subsection.16.5.5}{\376\377\000S\000e\000e\000\040\000A\000l\000s\000o}{section.16.5}% 107
\BOOKMARK [1][-]{section.16.6}{\376\377\000T\000h\000e\000\040\000s\0003\000q\000l\000c\000p\000\040\000c\000o\000m\000m\000a\000n\000d}{chapter.16}% 108
\BOOKMARK [2][-]{subsection.16.6.1}{\376\377\000S\000y\000n\000o\000p\000s\000i\000s}{section.16.6}% 109
\BOOKMARK [2][-]{subsection.16.6.2}{\376\377\000D\000e\000s\000c\000r\000i\000p\000t\000i\000o\000n}{section.16.6}% 110
\BOOKMARK [3][-]{subsubsection*.65}{\376\377\000S\000n\000a\000p\000s\000h\000o\000t\000t\000i\000n\000g\000\040\000v\000s\000\040\000H\000a\000r\000d\000l\000i\000n\000k\000i\000n\000g}{subsection.16.6.2}% 111
\BOOKMARK [2][-]{subsection.16.6.3}{\376\377\000O\000p\000t\000i\000o\000n\000s}{section.16.6}% 112
\BOOKMARK [2][-]{subsection.16.6.4}{\376\377\000E\000x\000i\000t\000\040\000C\000o\000d\000e\000s}{section.16.6}% 113
\BOOKMARK [2][-]{subsection.16.6.5}{\376\377\000S\000e\000e\000\040\000A\000l\000s\000o}{section.16.6}% 114
\BOOKMARK [1][-]{section.16.7}{\376\377\000T\000h\000e\000\040\000s\0003\000q\000l\000r\000m\000\040\000c\000o\000m\000m\000a\000n\000d}{chapter.16}% 115
\BOOKMARK [2][-]{subsection.16.7.1}{\376\377\000S\000y\000n\000o\000p\000s\000i\000s}{section.16.7}% 116
\BOOKMARK [2][-]{subsection.16.7.2}{\376\377\000D\000e\000s\000c\000r\000i\000p\000t\000i\000o\000n}{section.16.7}% 117
\BOOKMARK [2][-]{subsection.16.7.3}{\376\377\000O\000p\000t\000i\000o\000n\000s}{section.16.7}% 118
\BOOKMARK [2][-]{subsection.16.7.4}{\376\377\000E\000x\000i\000t\000\040\000C\000o\000d\000e\000s}{section.16.7}% 119
\BOOKMARK [2][-]{subsection.16.7.5}{\376\377\000S\000e\000e\000\040\000A\000l\000s\000o}{section.16.7}% 120
\BOOKMARK [1][-]{section.16.8}{\376\377\000T\000h\000e\000\040\000s\0003\000q\000l\000l\000o\000c\000k\000\040\000c\000o\000m\000m\000a\000n\000d}{chapter.16}% 121
\BOOKMARK [2][-]{subsection.16.8.1}{\376\377\000S\000y\000n\000o\000p\000s\000i\000s}{section.16.8}% 122
\BOOKMARK [2][-]{subsection.16.8.2}{\376\377\000D\000e\000s\000c\000r\000i\000p\000t\000i\000o\000n}{section.16.8}% 123
\BOOKMARK [2][-]{subsection.16.8.3}{\376\377\000R\000a\000t\000i\000o\000n\000a\000l\000e}{section.16.8}% 124
\BOOKMARK [2][-]{subsection.16.8.4}{\376\377\000O\000p\000t\000i\000o\000n\000s}{section.16.8}% 125
\BOOKMARK [2][-]{subsection.16.8.5}{\376\377\000E\000x\000i\000t\000\040\000C\000o\000d\000e\000s}{section.16.8}% 126
\BOOKMARK [2][-]{subsection.16.8.6}{\376\377\000S\000e\000e\000\040\000A\000l\000s\000o}{section.16.8}% 127
\BOOKMARK [1][-]{section.16.9}{\376\377\000T\000h\000e\000\040\000u\000m\000o\000u\000n\000t\000.\000s\0003\000q\000l\000\040\000c\000o\000m\000m\000a\000n\000d}{chapter.16}% 128
\BOOKMARK [2][-]{subsection.16.9.1}{\376\377\000S\000y\000n\000o\000p\000s\000i\000s}{section.16.9}% 129
\BOOKMARK [2][-]{subsection.16.9.2}{\376\377\000D\000e\000s\000c\000r\000i\000p\000t\000i\000o\000n}{section.16.9}% 130
\BOOKMARK [2][-]{subsection.16.9.3}{\376\377\000O\000p\000t\000i\000o\000n\000s}{section.16.9}% 131
\BOOKMARK [2][-]{subsection.16.9.4}{\376\377\000E\000x\000i\000t\000\040\000C\000o\000d\000e\000s}{section.16.9}% 132
\BOOKMARK [2][-]{subsection.16.9.5}{\376\377\000S\000e\000e\000\040\000A\000l\000s\000o}{section.16.9}% 133
\BOOKMARK [1][-]{section.16.10}{\376\377\000T\000h\000e\000\040\000f\000s\000c\000k\000.\000s\0003\000q\000l\000\040\000c\000o\000m\000m\000a\000n\000d}{chapter.16}% 134
\BOOKMARK [2][-]{subsection.16.10.1}{\376\377\000S\000y\000n\000o\000p\000s\000i\000s}{section.16.10}% 135
\BOOKMARK [2][-]{subsection.16.10.2}{\376\377\000D\000e\000s\000c\000r\000i\000p\000t\000i\000o\000n}{section.16.10}% 136
\BOOKMARK [2][-]{subsection.16.10.3}{\376\377\000O\000p\000t\000i\000o\000n\000s}{section.16.10}% 137
\BOOKMARK [2][-]{subsection.16.10.4}{\376\377\000E\000x\000i\000t\000\040\000C\000o\000d\000e\000s}{section.16.10}% 138
\BOOKMARK [2][-]{subsection.16.10.5}{\376\377\000S\000e\000e\000\040\000A\000l\000s\000o}{section.16.10}% 139
\BOOKMARK [1][-]{section.16.11}{\376\377\000T\000h\000e\000\040\000s\0003\000q\000l\000\137\000o\000a\000u\000t\000h\000\137\000c\000l\000i\000e\000n\000t\000\040\000c\000o\000m\000m\000a\000n\000d}{chapter.16}% 140
\BOOKMARK [2][-]{subsection.16.11.1}{\376\377\000S\000y\000n\000o\000p\000s\000i\000s}{section.16.11}% 141
\BOOKMARK [2][-]{subsection.16.11.2}{\376\377\000D\000e\000s\000c\000r\000i\000p\000t\000i\000o\000n}{section.16.11}% 142
\BOOKMARK [2][-]{subsection.16.11.3}{\376\377\000O\000p\000t\000i\000o\000n\000s}{section.16.11}% 143
\BOOKMARK [2][-]{subsection.16.11.4}{\376\377\000E\000x\000i\000t\000\040\000C\000o\000d\000e\000s}{section.16.11}% 144
\BOOKMARK [2][-]{subsection.16.11.5}{\376\377\000S\000e\000e\000\040\000A\000l\000s\000o}{section.16.11}% 145
\BOOKMARK [1][-]{section.16.12}{\376\377\000T\000h\000e\000\040\000s\0003\000q\000l\000\137\000v\000e\000r\000i\000f\000y\000\040\000c\000o\000m\000m\000a\000n\000d}{chapter.16}% 146
\BOOKMARK [2][-]{subsection.16.12.1}{\376\377\000S\000y\000n\000o\000p\000s\000i\000s}{section.16.12}% 147
\BOOKMARK [2][-]{subsection.16.12.2}{\376\377\000D\000e\000s\000c\000r\000i\000p\000t\000i\000o\000n}{section.16.12}% 148
\BOOKMARK [2][-]{subsection.16.12.3}{\376\377\000O\000p\000t\000i\000o\000n\000s}{section.16.12}% 149
\BOOKMARK [2][-]{subsection.16.12.4}{\376\377\000E\000x\000i\000t\000\040\000C\000o\000d\000e\000s}{section.16.12}% 150
\BOOKMARK [2][-]{subsection.16.12.5}{\376\377\000S\000e\000e\000\040\000A\000l\000s\000o}{section.16.12}% 151
\BOOKMARK [1][-]{section.16.13}{\376\377\000T\000h\000e\000\040\000p\000c\000p\000\040\000c\000o\000m\000m\000a\000n\000d}{chapter.16}% 152
\BOOKMARK [2][-]{subsection.16.13.1}{\376\377\000S\000y\000n\000o\000p\000s\000i\000s}{section.16.13}% 153
\BOOKMARK [2][-]{subsection.16.13.2}{\376\377\000D\000e\000s\000c\000r\000i\000p\000t\000i\000o\000n}{section.16.13}% 154
\BOOKMARK [2][-]{subsection.16.13.3}{\376\377\000O\000p\000t\000i\000o\000n\000s}{section.16.13}% 155
\BOOKMARK [2][-]{subsection.16.13.4}{\376\377\000E\000x\000i\000t\000\040\000C\000o\000d\000e\000s}{section.16.13}% 156
\BOOKMARK [2][-]{subsection.16.13.5}{\376\377\000S\000e\000e\000\040\000A\000l\000s\000o}{section.16.13}% 157
\BOOKMARK [1][-]{section.16.14}{\376\377\000T\000h\000e\000\040\000e\000x\000p\000i\000r\000e\000\137\000b\000a\000c\000k\000u\000p\000s\000\040\000c\000o\000m\000m\000a\000n\000d}{chapter.16}% 158
\BOOKMARK [2][-]{subsection.16.14.1}{\376\377\000S\000y\000n\000o\000p\000s\000i\000s}{section.16.14}% 159
\BOOKMARK [2][-]{subsection.16.14.2}{\376\377\000D\000e\000s\000c\000r\000i\000p\000t\000i\000o\000n}{section.16.14}% 160
\BOOKMARK [2][-]{subsection.16.14.3}{\376\377\000O\000p\000t\000i\000o\000n\000s}{section.16.14}% 161
\BOOKMARK [2][-]{subsection.16.14.4}{\376\377\000E\000x\000i\000t\000\040\000C\000o\000d\000e\000s}{section.16.14}% 162
\BOOKMARK [2][-]{subsection.16.14.5}{\376\377\000S\000e\000e\000\040\000A\000l\000s\000o}{section.16.14}% 163
\BOOKMARK [0][-]{chapter.17}{\376\377\000F\000u\000r\000t\000h\000e\000r\000\040\000R\000e\000s\000o\000u\000r\000c\000e\000s\000\040\000/\000\040\000G\000e\000t\000t\000i\000n\000g\000\040\000H\000e\000l\000p}{}% 164
\BOOKMARK [0][-]{chapter.18}{\376\377\000I\000m\000p\000l\000e\000m\000e\000n\000t\000a\000t\000i\000o\000n\000\040\000D\000e\000t\000a\000i\000l\000s}{}% 165
\BOOKMARK [1][-]{section.18.1}{\376\377\000M\000e\000t\000a\000d\000a\000t\000a\000\040\000S\000t\000o\000r\000a\000g\000e}{chapter.18}% 166
\BOOKMARK [1][-]{section.18.2}{\376\377\000D\000a\000t\000a\000\040\000S\000t\000o\000r\000a\000g\000e}{chapter.18}% 167
\BOOKMARK [1][-]{section.18.3}{\376\377\000D\000a\000t\000a\000\040\000D\000e\000-\000D\000u\000p\000l\000i\000c\000a\000t\000i\000o\000n}{chapter.18}% 168
\BOOKMARK [1][-]{section.18.4}{\376\377\000C\000a\000c\000h\000i\000n\000g}{chapter.18}% 169
\BOOKMARK [1][-]{section.18.5}{\376\377\000E\000n\000c\000r\000y\000p\000t\000i\000o\000n}{chapter.18}% 170
\BOOKMARK [0][-]{section*.66}{\376\377\000I\000n\000d\000e\000x}{}% 171
