<?xml version="1.0" encoding="UTF-8" standalone="no"?>
<!-- Created with Inkscape (http://www.inkscape.org/) -->
<svg
   xmlns:dc="http://purl.org/dc/elements/1.1/"
   xmlns:cc="http://web.resource.org/cc/"
   xmlns:rdf="http://www.w3.org/1999/02/22-rdf-syntax-ns#"
   xmlns:svg="http://www.w3.org/2000/svg"
   xmlns="http://www.w3.org/2000/svg"
   xmlns:xlink="http://www.w3.org/1999/xlink"
   xmlns:sodipodi="http://sodipodi.sourceforge.net/DTD/sodipodi-0.dtd"
   xmlns:inkscape="http://www.inkscape.org/namespaces/inkscape"
   width="100"
   height="100"
   id="svg2"
   sodipodi:version="0.32"
   inkscape:version="0.44"
   version="1.0"
   sodipodi:docbase="/home/ryx/Documents/scripts/python/screenlets/screenlets-0.0.8/src/share/screenlets/Storage/themes/box"
   sodipodi:docname="storage-dragged-over.svg">
  <defs
     id="defs4">
    <linearGradient
       id="linearGradient3027">
      <stop
         style="stop-color:#512000;stop-opacity:1;"
         offset="0"
         id="stop3029" />
      <stop
         style="stop-color:#0b0400;stop-opacity:1;"
         offset="1"
         id="stop3031" />
    </linearGradient>
    <linearGradient
       id="linearGradient2870">
      <stop
         id="stop2872"
         offset="0"
         style="stop-color:#d97938;stop-opacity:1;" />
      <stop
         id="stop2874"
         offset="1"
         style="stop-color:#bf6325;stop-opacity:0;" />
    </linearGradient>
    <linearGradient
       id="linearGradient2854">
      <stop
         id="stop2856"
         offset="0"
         style="stop-color:#7b4522;stop-opacity:1;" />
      <stop
         id="stop2858"
         offset="1"
         style="stop-color:#b46532;stop-opacity:1;" />
    </linearGradient>
    <linearGradient
       id="linearGradient2838">
      <stop
         style="stop-color:#884c26;stop-opacity:1;"
         offset="0"
         id="stop2840" />
      <stop
         style="stop-color:#cc7c48;stop-opacity:1;"
         offset="1"
         id="stop2842" />
    </linearGradient>
    <linearGradient
       id="linearGradient2830">
      <stop
         style="stop-color:#bf6325;stop-opacity:1;"
         offset="0"
         id="stop2832" />
      <stop
         style="stop-color:#e5a275;stop-opacity:1;"
         offset="1"
         id="stop2834" />
    </linearGradient>
    <linearGradient
       id="linearGradient3840">
      <stop
         style="stop-color:white;stop-opacity:0.72566372;"
         offset="0"
         id="stop3842" />
      <stop
         style="stop-color:white;stop-opacity:0;"
         offset="1"
         id="stop3844" />
    </linearGradient>
    <linearGradient
       id="linearGradient4841">
      <stop
         id="stop4843"
         offset="0"
         style="stop-color:black;stop-opacity:1;" />
      <stop
         style="stop-color:black;stop-opacity:0.90265489;"
         offset="0.5"
         id="stop3755" />
      <stop
         id="stop4845"
         offset="1"
         style="stop-color:black;stop-opacity:0;" />
    </linearGradient>
    <linearGradient
       id="linearGradient4819">
      <stop
         id="stop4821"
         offset="0"
         style="stop-color:white;stop-opacity:0.7079646;" />
      <stop
         id="stop4823"
         offset="1"
         style="stop-color:white;stop-opacity:0;" />
    </linearGradient>
    <linearGradient
       id="linearGradient4807">
      <stop
         style="stop-color:black;stop-opacity:0.34513274;"
         offset="0"
         id="stop4809" />
      <stop
         style="stop-color:black;stop-opacity:0;"
         offset="1"
         id="stop4811" />
    </linearGradient>
    <linearGradient
       inkscape:collect="always"
       xlink:href="#linearGradient2830"
       id="linearGradient2836"
       x1="12.92157"
       y1="34.274512"
       x2="59.009804"
       y2="34.274512"
       gradientUnits="userSpaceOnUse" />
    <linearGradient
       inkscape:collect="always"
       xlink:href="#linearGradient2838"
       id="linearGradient2844"
       x1="7.5294127"
       y1="74.166672"
       x2="15.931373"
       y2="51.372551"
       gradientUnits="userSpaceOnUse" />
    <linearGradient
       inkscape:collect="always"
       xlink:href="#linearGradient2854"
       id="linearGradient2852"
       x1="53.92157"
       y1="86.970589"
       x2="53.431374"
       y2="56.823528"
       gradientUnits="userSpaceOnUse" />
    <linearGradient
       inkscape:collect="always"
       xlink:href="#linearGradient2870"
       id="linearGradient2868"
       x1="54.656864"
       y1="36.764706"
       x2="53.511871"
       y2="40.973427"
       gradientUnits="userSpaceOnUse" />
    <linearGradient
       inkscape:collect="always"
       xlink:href="#linearGradient2838"
       id="linearGradient3018"
       gradientUnits="userSpaceOnUse"
       x1="7.5294127"
       y1="74.166672"
       x2="15.931373"
       y2="51.372551"
       gradientTransform="translate(22.62457,7.193925)" />
    <linearGradient
       inkscape:collect="always"
       xlink:href="#linearGradient2854"
       id="linearGradient3020"
       gradientUnits="userSpaceOnUse"
       x1="53.92157"
       y1="86.970589"
       x2="53.431374"
       y2="56.823528"
       gradientTransform="translate(22.62457,7.193925)" />
    <linearGradient
       inkscape:collect="always"
       xlink:href="#linearGradient2870"
       id="linearGradient3022"
       gradientUnits="userSpaceOnUse"
       x1="54.656864"
       y1="36.764706"
       x2="53.511871"
       y2="40.973427"
       gradientTransform="translate(22.62457,7.193925)" />
    <linearGradient
       inkscape:collect="always"
       xlink:href="#linearGradient2830"
       id="linearGradient3024"
       gradientUnits="userSpaceOnUse"
       x1="12.92157"
       y1="34.274512"
       x2="59.009804"
       y2="34.274512"
       gradientTransform="translate(22.62457,7.193925)" />
    <linearGradient
       inkscape:collect="always"
       xlink:href="#linearGradient3027"
       id="linearGradient3033"
       x1="56.346203"
       y1="38.402504"
       x2="56.927906"
       y2="64.572388"
       gradientUnits="userSpaceOnUse" />
  </defs>
  <sodipodi:namedview
     id="base"
     pagecolor="#ffffff"
     bordercolor="#666666"
     borderopacity="1.0"
     inkscape:pageopacity="0.0"
     inkscape:pageshadow="2"
     inkscape:zoom="11.539983"
     inkscape:cx="33.347085"
     inkscape:cy="67.262388"
     inkscape:document-units="px"
     inkscape:current-layer="layer1"
     width="100px"
     height="100px"
     inkscape:window-width="989"
     inkscape:window-height="624"
     inkscape:window-x="244"
     inkscape:window-y="72" />
  <metadata
     id="metadata7">
    <rdf:RDF>
      <cc:Work
         rdf:about="">
        <dc:format>image/svg+xml</dc:format>
        <dc:type
           rdf:resource="http://purl.org/dc/dcmitype/StillImage" />
      </cc:Work>
    </rdf:RDF>
  </metadata>
  <g
     inkscape:label="Ebene 1"
     inkscape:groupmode="layer"
     id="layer1"
     style="display:inline">
    <path
       style="fill:black;fill-opacity:1;fill-rule:evenodd;stroke:none;stroke-width:1px;stroke-linecap:butt;stroke-linejoin:miter;stroke-opacity:1;display:inline"
       d="M 2.4012296,25.445841 L 11.419508,34.160346 L 11.419508,61.000557 L 36.492176,79.731889 L 79.786574,79.731889 L 79.548273,40.404124 L 79.483137,39.840865 L 78.356619,39.667363 L 40.557135,33.293794 L 40.557135,33.391353 L 28.058485,32.600552 L 20.881966,27.180479 L 2.4012296,25.445841 z M 78.031662,39.624035 L 79.504849,39.840673 L 92.566423,28.56773 L 53.012171,26.659781 L 40.589655,33.163716 L 78.031662,39.624035 z "
       id="path3006"
       sodipodi:nodetypes="ccccccccccccccccccc" />
    <path
       style="fill:#2b1100;fill-opacity:1;fill-rule:evenodd;stroke:none;stroke-width:1px;stroke-linecap:butt;stroke-linejoin:miter;stroke-opacity:1"
       d="M 12.990196,33.823529 L 40.931373,34.068628 L 41.421569,61.27451 L 14.705882,61.27451 L 12.990196,33.823529 z "
       id="path1933"
       sodipodi:nodetypes="ccccc" />
    <path
       style="color:black;fill:black;fill-opacity:0.23549488;fill-rule:evenodd;stroke:none;stroke-width:2;stroke-linecap:butt;stroke-linejoin:miter;marker:none;marker-start:none;marker-mid:none;marker-end:none;stroke-miterlimit:4;stroke-dashoffset:0;stroke-opacity:1;visibility:visible;display:inline;overflow:visible"
       d="M 87.862412,81.705883 L 47.482793,59.282795 L 8.6764718,59.523436 L 33.103999,81.705886 L 87.862412,81.705883 z "
       id="path2826"
       sodipodi:nodetypes="ccccc" />
    <path
       style="color:black;fill:url(#linearGradient2844);fill-opacity:1;fill-rule:evenodd;stroke:none;stroke-width:2;stroke-linecap:butt;stroke-linejoin:miter;marker:none;marker-start:none;marker-mid:none;marker-end:none;stroke-miterlimit:4;stroke-dashoffset:0;stroke-opacity:1;visibility:visible;display:inline;overflow:visible"
       d="M 37.009804,39.950981 L 12.92157,33.950981 L 12.92157,60.598042 L 37.009804,78.598042 L 37.009804,39.950981 z "
       id="rect1923"
       sodipodi:nodetypes="ccccc" />
    <path
       style="color:black;fill:url(#linearGradient3033);fill-opacity:1.0;fill-rule:evenodd;stroke:none;stroke-width:2;stroke-linecap:butt;stroke-linejoin:miter;marker:none;marker-start:none;marker-mid:none;marker-end:none;stroke-miterlimit:4;stroke-dashoffset:0;stroke-opacity:1;visibility:visible;display:inline;overflow:visible"
       d="M 78.245098,39.705883 L 40.92157,33.950981 L 40.92157,56.921571 L 78.245098,77.862748 L 78.245098,39.705883 z "
       id="path2822"
       sodipodi:nodetypes="ccccc" />
    <path
       style="color:black;fill:url(#linearGradient2852);fill-opacity:1;fill-rule:evenodd;stroke:none;stroke-width:2;stroke-linecap:butt;stroke-linejoin:miter;marker:none;marker-start:none;marker-mid:none;marker-end:none;stroke-miterlimit:4;stroke-dashoffset:0;stroke-opacity:1;visibility:visible;display:inline;overflow:visible"
       d="M 37 39.9375 L 37 78.59375 L 78.4375 78.59375 L 78.4375 39.9375 L 37 39.9375 z M 54.9375 43.125 L 62.9375 43.125 C 64.0455 43.125 64.9375 43.89326 64.9375 44.84375 C 64.9375 45.79424 64.0455 46.5625 62.9375 46.5625 L 54.9375 46.5625 C 53.8295 46.562499 52.9375 45.79424 52.9375 44.84375 C 52.9375 43.893259 53.8295 43.125 54.9375 43.125 z "
       id="rect1921" />
    <path
       style="fill:url(#linearGradient2868);fill-opacity:1;fill-rule:evenodd;stroke:none;stroke-width:1px;stroke-linecap:butt;stroke-linejoin:miter;stroke-opacity:1"
       d="M 40.931373,33.823529 L 52.882353,27.578431 L 90.210784,29.583333 L 78.308824,39.705882 L 40.931373,33.823529 z "
       id="path2860"
       sodipodi:nodetypes="ccccc" />
    <path
       style="color:black;fill:url(#linearGradient2836);fill-opacity:1;fill-rule:evenodd;stroke:none;stroke-width:2;stroke-linecap:butt;stroke-linejoin:miter;marker:none;marker-start:none;marker-mid:none;marker-end:none;stroke-miterlimit:4;stroke-dashoffset:0;stroke-opacity:1;visibility:visible;display:inline;overflow:visible"
       d="M 37.009804,39.950981 L 12.92157,33.950981 L 4.4016385,26.511386 L 21.009804,28.598042 L 37.009804,39.950981 z "
       id="path1926"
       sodipodi:nodetypes="ccccc" />
    <rect
       style="opacity:1;color:black;fill:none;fill-opacity:1;fill-rule:evenodd;stroke:black;stroke-width:1;stroke-linecap:butt;stroke-linejoin:miter;marker:none;marker-start:none;marker-mid:none;marker-end:none;stroke-miterlimit:4;stroke-dasharray:none;stroke-dashoffset:0;stroke-opacity:1;visibility:visible;display:inline;overflow:visible"
       id="rect2828"
       width="12.009804"
       height="3.4313726"
       x="52.941177"
       y="43.137257"
       rx="2"
       ry="2" />
  </g>
  <g
     inkscape:groupmode="layer"
     id="layer2"
     inkscape:label="HIghlights"
     style="display:inline"
     sodipodi:insensitive="true">
    <path
       style="fill:#520;fill-opacity:1;fill-rule:evenodd;stroke:none;stroke-width:1px;stroke-linecap:butt;stroke-linejoin:miter;stroke-opacity:1"
       d="M 17.647059,35.04902 L 37.009804,39.705882 L 36.764706,65.441176 L 36.029412,40.686275 L 17.647059,35.04902 z "
       id="path2912" />
    <path
       style="fill:#520;fill-opacity:1;fill-rule:evenodd;stroke:none;stroke-width:1px;stroke-linecap:butt;stroke-linejoin:miter;stroke-opacity:1"
       d="M 28.352941,71.813725 L 12.666667,60.784314 L 12.911765,35.04902 L 13.647059,59.803921 L 28.352941,71.813725 z "
       id="path2914"
       sodipodi:nodetypes="ccccc" />
    <path
       style="fill:#520;fill-opacity:1;fill-rule:evenodd;stroke:none;stroke-width:1px;stroke-linecap:butt;stroke-linejoin:miter;stroke-opacity:1"
       d="M 59.191177,39.950981 L 78.553922,39.95098 L 78.308824,65.686274 L 77.57353,40.931373 L 59.191177,39.950981 z "
       id="path2916"
       sodipodi:nodetypes="ccccc" />
    <path
       style="fill:#520;fill-opacity:1;fill-rule:evenodd;stroke:none;stroke-width:1px;stroke-linecap:butt;stroke-linejoin:miter;stroke-opacity:1"
       d="M 56.553922,39.950981 L 37.191177,39.95098 L 37.436275,71.686274 L 38.171569,40.931373 L 56.553922,39.950981 z "
       id="path2918"
       sodipodi:nodetypes="ccccc" />
    <path
       style="fill:#520;fill-opacity:1;fill-rule:evenodd;stroke:none;stroke-width:1px;stroke-linecap:butt;stroke-linejoin:miter;stroke-opacity:1"
       d="M 68.455883,28.480393 L 90.412148,29.621262 L 81.200981,37.181372 L 88.25912,30.125836 L 68.455883,28.480393 z "
       id="path2920"
       sodipodi:nodetypes="ccccc" />
    <path
       style="fill:#ffc39a;fill-opacity:1;fill-rule:evenodd;stroke:none;stroke-width:1px;stroke-linecap:butt;stroke-linejoin:miter;stroke-opacity:1"
       d="M 74.790071,28.947983 L 88.214621,30.181666 L 82.816284,35.527184 L 87.128641,30.527797 L 74.790071,28.947983 z "
       id="path2922"
       sodipodi:nodetypes="ccccc" />
    <path
       style="fill:#fcbf95;fill-opacity:1;fill-rule:evenodd;stroke:none;stroke-width:1px;stroke-linecap:butt;stroke-linejoin:miter;stroke-opacity:1"
       d="M 21.529412,36.313726 L 12.950981,34.352941 L 13.196079,50.039215 L 13.931373,35.578432 L 21.529412,36.313726 z "
       id="path2924"
       sodipodi:nodetypes="ccccc" />
    <path
       style="fill:#520;fill-opacity:1;fill-rule:evenodd;stroke:none;stroke-width:1px;stroke-linecap:butt;stroke-linejoin:miter;stroke-opacity:1"
       d="M 58.906863,78.666665 L 78.269608,78.666666 L 78.02451,68.931372 L 77.289216,77.686273 L 58.906863,78.666665 z "
       id="path2926"
       sodipodi:nodetypes="ccccc" />
    <path
       style="fill:#520;fill-opacity:1;fill-rule:evenodd;stroke:none;stroke-width:1px;stroke-linecap:butt;stroke-linejoin:miter;stroke-opacity:1;display:inline"
       d="M 19.21345,28.499688 L 5.2233296,26.766582 L 12.574158,33.545166 L 6.6369978,27.487009 L 19.21345,28.499688 z "
       id="path3002"
       sodipodi:nodetypes="ccccc" />
    <path
       style="fill:#fcbf95;fill-opacity:1;fill-rule:evenodd;stroke:none;stroke-width:1px;stroke-linecap:butt;stroke-linejoin:miter;stroke-opacity:1;display:inline"
       d="M 64.081333,28.086352 L 53.076555,27.512051 L 45.869302,31.239901 L 53.537016,28.217611 L 64.081333,28.086352 z "
       id="path3004"
       sodipodi:nodetypes="ccccc" />
  </g>
</svg>
