<?xml version="1.0" encoding="UTF-8" standalone="no"?>
<!-- Created with Inkscape (http://www.inkscape.org/) -->
<svg
   xmlns:dc="http://purl.org/dc/elements/1.1/"
   xmlns:cc="http://creativecommons.org/ns#"
   xmlns:rdf="http://www.w3.org/1999/02/22-rdf-syntax-ns#"
   xmlns:svg="http://www.w3.org/2000/svg"
   xmlns="http://www.w3.org/2000/svg"
   xmlns:xlink="http://www.w3.org/1999/xlink"
   xmlns:sodipodi="http://sodipodi.sourceforge.net/DTD/sodipodi-0.dtd"
   xmlns:inkscape="http://www.inkscape.org/namespaces/inkscape"
   width="25"
   height="25"
   id="svg2694"
   sodipodi:version="0.32"
   inkscape:version="0.46"
   version="1.0"
   sodipodi:docname="stop.svg"
   inkscape:output_extension="org.inkscape.output.svg.inkscape">
  <defs
     id="defs2696">
    <linearGradient
       inkscape:collect="always"
       xlink:href="#linearGradient3179"
       id="linearGradient5557"
       gradientUnits="userSpaceOnUse"
       x1="117.78688"
       y1="1002.5701"
       x2="111.80088"
       y2="1002.5701" />
    <linearGradient
       inkscape:collect="always"
       xlink:href="#linearGradient5517"
       id="linearGradient5553"
       gradientUnits="userSpaceOnUse"
       x1="112.05402"
       y1="1000.7372"
       x2="127.29938"
       y2="1000.7372" />
    <linearGradient
       inkscape:collect="always"
       xlink:href="#linearGradient3157"
       id="linearGradient5555"
       gradientUnits="userSpaceOnUse"
       gradientTransform="matrix(1.0424264,0,0,1.0424264,-81.903413,495.92309)"
       x1="190"
       y1="432.36218"
       x2="190"
       y2="417.36218" />
    <linearGradient
       inkscape:collect="always"
       xlink:href="#linearGradient3179"
       id="linearGradient5640"
       gradientUnits="userSpaceOnUse"
       x1="115.64713"
       y1="1002.5701"
       x2="111.80088"
       y2="1002.5701" />
    <linearGradient
       inkscape:collect="always"
       xlink:href="#linearGradient5074"
       id="linearGradient5638"
       gradientUnits="userSpaceOnUse"
       x1="106.69753"
       y1="1000.7372"
       x2="127.29938"
       y2="1000.7372" />
    <linearGradient
       inkscape:collect="always"
       xlink:href="#linearGradient3157"
       id="linearGradient5636"
       gradientUnits="userSpaceOnUse"
       gradientTransform="matrix(1.0424264,0,0,1.0424264,-81.903413,495.92309)"
       x1="190"
       y1="432.36218"
       x2="190"
       y2="417.36218" />
    <linearGradient
       inkscape:collect="always"
       xlink:href="#linearGradient3179"
       id="linearGradient5509"
       gradientUnits="userSpaceOnUse"
       x1="117.78688"
       y1="1002.5701"
       x2="111.80088"
       y2="1002.5701" />
    <linearGradient
       id="linearGradient5517">
      <stop
         id="stop5519"
         offset="0"
         style="stop-color:#7e8377;stop-opacity:1;" />
      <stop
         id="stop5521"
         offset="1"
         style="stop-color:#c8cdc3;stop-opacity:1;" />
    </linearGradient>
    <linearGradient
       inkscape:collect="always"
       xlink:href="#linearGradient5517"
       id="linearGradient5507"
       gradientUnits="userSpaceOnUse"
       x1="111.50463"
       y1="1000.7372"
       x2="127.29938"
       y2="1000.7372" />
    <linearGradient
       inkscape:collect="always"
       xlink:href="#linearGradient3157"
       id="linearGradient5505"
       gradientUnits="userSpaceOnUse"
       gradientTransform="matrix(1.0424264,0,0,1.0424264,-81.903413,495.92309)"
       x1="190"
       y1="432.36218"
       x2="190"
       y2="417.36218" />
    <linearGradient
       inkscape:collect="always"
       id="linearGradient3179">
      <stop
         style="stop-color:#eeeeec;stop-opacity:1"
         offset="0"
         id="stop3181" />
      <stop
         id="stop3185"
         offset="0.05499936"
         style="stop-color:#bbbeb7;stop-opacity:1;" />
      <stop
         style="stop-color:#d3d7cf;stop-opacity:1"
         offset="1"
         id="stop3183" />
    </linearGradient>
    <linearGradient
       inkscape:collect="always"
       xlink:href="#linearGradient3179"
       id="linearGradient5634"
       gradientUnits="userSpaceOnUse"
       x1="115.64713"
       y1="1002.5701"
       x2="111.80088"
       y2="1002.5701" />
    <linearGradient
       id="linearGradient5074">
      <stop
         style="stop-color:#979b91;stop-opacity:1;"
         offset="0"
         id="stop5076" />
      <stop
         style="stop-color:#d3d7cf;stop-opacity:1"
         offset="1"
         id="stop5078" />
    </linearGradient>
    <linearGradient
       inkscape:collect="always"
       xlink:href="#linearGradient5074"
       id="linearGradient5632"
       gradientUnits="userSpaceOnUse"
       x1="106.69753"
       y1="1000.7372"
       x2="127.29938"
       y2="1000.7372" />
    <linearGradient
       id="linearGradient3157"
       inkscape:collect="always">
      <stop
         id="stop3159"
         offset="0"
         style="stop-color:#babdb6;stop-opacity:1;" />
      <stop
         id="stop3161"
         offset="1"
         style="stop-color:#d3d7cf;stop-opacity:1" />
    </linearGradient>
    <linearGradient
       inkscape:collect="always"
       xlink:href="#linearGradient3157"
       id="linearGradient5630"
       gradientUnits="userSpaceOnUse"
       gradientTransform="matrix(1.0424264,0,0,1.0424264,-81.903413,495.92309)"
       x1="190"
       y1="432.36218"
       x2="190"
       y2="417.36218" />
    <inkscape:perspective
       sodipodi:type="inkscape:persp3d"
       inkscape:vp_x="0 : 526.18109 : 1"
       inkscape:vp_y="0 : 1000 : 0"
       inkscape:vp_z="744.09448 : 526.18109 : 1"
       inkscape:persp3d-origin="372.04724 : 350.78739 : 1"
       id="perspective2702" />
  </defs>
  <sodipodi:namedview
     id="base"
     pagecolor="#ffffff"
     bordercolor="#666666"
     borderopacity="1.0"
     gridtolerance="10000"
     guidetolerance="10"
     objecttolerance="10"
     inkscape:pageopacity="0.0"
     inkscape:pageshadow="2"
     inkscape:zoom="8"
     inkscape:cx="24.979389"
     inkscape:cy="8.6917755"
     inkscape:document-units="px"
     inkscape:current-layer="layer1"
     showgrid="false"
     inkscape:window-width="1600"
     inkscape:window-height="1152"
     inkscape:window-x="0"
     inkscape:window-y="47" />
  <metadata
     id="metadata2699">
    <rdf:RDF>
      <cc:Work
         rdf:about="">
        <dc:format>image/svg+xml</dc:format>
        <dc:type
           rdf:resource="http://purl.org/dc/dcmitype/StillImage" />
      </cc:Work>
    </rdf:RDF>
  </metadata>
  <g
     inkscape:label="Layer 1"
     inkscape:groupmode="layer"
     id="layer1">
    <g
       transform="matrix(1.0733104,0,0,1.0733104,-111.63957,-1104.4958)"
       id="g5608"
       inkscape:export-filename="/home/odd/Desktop/play.png"
       inkscape:export-xdpi="96"
       inkscape:export-ydpi="96">
      <path
         sodipodi:type="arc"
         style="opacity:1;fill:url(#linearGradient5630);fill-opacity:1;fill-rule:nonzero;stroke:#888a85;stroke-width:0.97122544;stroke-linecap:butt;stroke-linejoin:miter;marker:none;marker-start:none;marker-mid:none;marker-end:none;stroke-miterlimit:4;stroke-dasharray:none;stroke-dashoffset:0;stroke-opacity:1;visibility:visible;display:inline;overflow:visible;enable-background:accumulate"
         id="path5610"
         sodipodi:cx="115.625"
         sodipodi:cy="1000.7372"
         sodipodi:rx="11.125"
         sodipodi:ry="11.125"
         d="M 126.75,1000.7372 A 11.125,11.125 0 1 1 104.5,1000.7372 A 11.125,11.125 0 1 1 126.75,1000.7372 z"
         transform="matrix(8.5712909e-8,-0.9999999,0.9999999,8.5712909e-8,-885.11223,1156.3621)" />
      <path
         transform="matrix(-2.879455e-8,-0.9101124,0.9101124,-2.879455e-8,-795.15832,1145.9688)"
         d="M 126.75,1000.7372 A 11.125,11.125 0 1 1 104.5,1000.7372 A 11.125,11.125 0 1 1 126.75,1000.7372 z"
         sodipodi:ry="11.125"
         sodipodi:rx="11.125"
         sodipodi:cy="1000.7372"
         sodipodi:cx="115.625"
         id="path5612"
         style="opacity:1;fill:url(#linearGradient5632);fill-opacity:1;fill-rule:nonzero;stroke:url(#linearGradient5634);stroke-width:1.02371633;stroke-linecap:butt;stroke-linejoin:miter;marker:none;marker-start:none;marker-mid:none;marker-end:none;stroke-miterlimit:4;stroke-dasharray:none;stroke-dashoffset:0;stroke-opacity:1;visibility:visible;display:inline;overflow:visible;enable-background:accumulate"
         sodipodi:type="arc" />
      <path
         transform="matrix(0.6802627,0,0,0.6802627,-14.04932,751.71913)"
         d="M 200.63186,424.86218 L 192.93921,429.30353 L 185.24657,433.74488 L 185.24657,424.86218 L 185.24657,415.97948 L 192.93921,420.42083 L 200.63186,424.86218 z"
         inkscape:randomized="0"
         inkscape:rounded="0"
         inkscape:flatsided="false"
         sodipodi:arg2="1.0471976"
         sodipodi:arg1="0"
         sodipodi:r2="5.1284289"
         sodipodi:r1="10.256857"
         sodipodi:cy="424.86218"
         sodipodi:cx="190.375"
         sodipodi:sides="3"
         id="path5614"
         style="opacity:1;fill:#555753;fill-opacity:1;fill-rule:nonzero;stroke:#eeeeec;stroke-width:0.93169695;stroke-linecap:butt;stroke-linejoin:miter;marker:none;marker-start:none;marker-mid:none;marker-end:none;stroke-miterlimit:4;stroke-dasharray:none;stroke-dashoffset:0;stroke-opacity:1;visibility:visible;display:inline;overflow:visible;enable-background:accumulate"
         sodipodi:type="star" />
      <path
         transform="matrix(-2.879455e-8,-0.9101124,0.9101124,-2.879455e-8,-795.15832,1145.9688)"
         style="opacity:0.5;fill:#eeeeec;fill-opacity:1;fill-rule:nonzero;stroke:#eeeeec;stroke-width:1.02371633;stroke-linecap:butt;stroke-linejoin:miter;marker:none;marker-start:none;marker-mid:none;marker-end:none;stroke-miterlimit:4;stroke-dasharray:none;stroke-dashoffset:0;stroke-opacity:1;visibility:visible;display:inline;overflow:visible;enable-background:accumulate"
         d="M 126.75,1000.7372 C 126.75,1006.8782 121.766,1011.8622 115.625,1011.8622 C 115.625,1011.8622 117.68518,1006.8782 117.68518,1000.7372 C 117.68518,994.59618 115.625,989.61218 115.625,989.61218 C 121.766,989.61218 126.75,994.59618 126.75,1000.7372 z"
         id="path5616"
         sodipodi:nodetypes="csssc" />
    </g>
    <g
       transform="matrix(1.0733104,0,0,1.0733104,-111.63957,-1104.4958)"
       id="g5413"
       inkscape:export-filename="/home/odd/Desktop/play_press.png"
       inkscape:export-xdpi="96"
       inkscape:export-ydpi="96">
      <path
         sodipodi:type="arc"
         style="opacity:1;fill:url(#linearGradient5505);fill-opacity:1;fill-rule:nonzero;stroke:#888a85;stroke-width:0.97122544;stroke-linecap:butt;stroke-linejoin:miter;marker:none;marker-start:none;marker-mid:none;marker-end:none;stroke-miterlimit:4;stroke-dasharray:none;stroke-dashoffset:0;stroke-opacity:1;visibility:visible;display:inline;overflow:visible;enable-background:accumulate"
         id="path5415"
         sodipodi:cx="115.625"
         sodipodi:cy="1000.7372"
         sodipodi:rx="11.125"
         sodipodi:ry="11.125"
         d="M 126.75,1000.7372 A 11.125,11.125 0 1 1 104.5,1000.7372 A 11.125,11.125 0 1 1 126.75,1000.7372 z"
         transform="matrix(8.5712909e-8,-0.9999999,0.9999999,8.5712909e-8,-885.11223,1156.3621)" />
      <path
         transform="matrix(-2.879455e-8,-0.9101124,0.9101124,-2.879455e-8,-795.15832,1145.9688)"
         d="M 126.75,1000.7372 A 11.125,11.125 0 1 1 104.5,1000.7372 A 11.125,11.125 0 1 1 126.75,1000.7372 z"
         sodipodi:ry="11.125"
         sodipodi:rx="11.125"
         sodipodi:cy="1000.7372"
         sodipodi:cx="115.625"
         id="path5417"
         style="opacity:1;fill:url(#linearGradient5507);fill-opacity:1;fill-rule:nonzero;stroke:url(#linearGradient5509);stroke-width:1.02371633;stroke-linecap:butt;stroke-linejoin:miter;marker:none;marker-start:none;marker-mid:none;marker-end:none;stroke-miterlimit:4;stroke-dasharray:none;stroke-dashoffset:0;stroke-opacity:1;visibility:visible;display:inline;overflow:visible;enable-background:accumulate"
         sodipodi:type="arc" />
      <path
         transform="matrix(0.6802627,0,0,0.6802627,-14.04932,752.07269)"
         d="M 200.63186,424.86218 L 192.93921,429.30353 L 185.24657,433.74488 L 185.24657,424.86218 L 185.24657,415.97948 L 192.93921,420.42083 L 200.63186,424.86218 z"
         inkscape:randomized="0"
         inkscape:rounded="0"
         inkscape:flatsided="false"
         sodipodi:arg2="1.0471976"
         sodipodi:arg1="0"
         sodipodi:r2="5.1284289"
         sodipodi:r1="10.256857"
         sodipodi:cy="424.86218"
         sodipodi:cx="190.375"
         sodipodi:sides="3"
         id="path5419"
         style="opacity:1;fill:#555753;fill-opacity:1;fill-rule:nonzero;stroke:#eeeeec;stroke-width:0.93169695;stroke-linecap:butt;stroke-linejoin:miter;marker:none;marker-start:none;marker-mid:none;marker-end:none;stroke-miterlimit:4;stroke-dasharray:none;stroke-dashoffset:0;stroke-opacity:1;visibility:visible;display:inline;overflow:visible;enable-background:accumulate"
         sodipodi:type="star" />
      <path
         transform="matrix(-2.879455e-8,-0.9101124,0.9101124,-2.879455e-8,-795.15832,1145.9688)"
         style="opacity:0.25;fill:#eeeeec;fill-opacity:1;fill-rule:nonzero;stroke:#eeeeec;stroke-width:1.02371633;stroke-linecap:butt;stroke-linejoin:miter;marker:none;marker-start:none;marker-mid:none;marker-end:none;stroke-miterlimit:4;stroke-dasharray:none;stroke-dashoffset:0;stroke-opacity:1;visibility:visible;display:inline;overflow:visible;enable-background:accumulate"
         d="M 126.75,1000.7372 C 126.75,1006.8782 121.59596,1011.5708 117.84951,1011.5708 C 117.84951,1011.5708 119.85573,1006.7174 119.85573,1000.7372 C 119.85573,994.75701 117.84951,989.90353 117.84951,989.90353 C 121.22011,989.90353 126.75,994.59618 126.75,1000.7372 z"
         id="path5421"
         sodipodi:nodetypes="csssc" />
    </g>
    <g
       transform="matrix(1.0733104,0,0,1.0733104,-154.57199,-1104.4958)"
       id="g5618"
       inkscape:export-filename="/home/odd/Desktop/stop.png"
       inkscape:export-xdpi="96"
       inkscape:export-ydpi="96">
      <g
         id="g5620"
         transform="translate(40,0)">
        <path
           sodipodi:type="arc"
           style="opacity:1;fill:url(#linearGradient5636);fill-opacity:1;fill-rule:nonzero;stroke:#888a85;stroke-width:0.97122544;stroke-linecap:butt;stroke-linejoin:miter;marker:none;marker-start:none;marker-mid:none;marker-end:none;stroke-miterlimit:4;stroke-dasharray:none;stroke-dashoffset:0;stroke-opacity:1;visibility:visible;display:inline;overflow:visible;enable-background:accumulate"
           id="path5622"
           sodipodi:cx="115.625"
           sodipodi:cy="1000.7372"
           sodipodi:rx="11.125"
           sodipodi:ry="11.125"
           d="M 126.75,1000.7372 A 11.125,11.125 0 1 1 104.5,1000.7372 A 11.125,11.125 0 1 1 126.75,1000.7372 z"
           transform="matrix(8.5712909e-8,-0.9999999,0.9999999,8.5712909e-8,-885.11223,1156.3621)" />
        <path
           transform="matrix(-2.879455e-8,-0.9101124,0.9101124,-2.879455e-8,-795.15832,1145.9688)"
           d="M 126.75,1000.7372 A 11.125,11.125 0 1 1 104.5,1000.7372 A 11.125,11.125 0 1 1 126.75,1000.7372 z"
           sodipodi:ry="11.125"
           sodipodi:rx="11.125"
           sodipodi:cy="1000.7372"
           sodipodi:cx="115.625"
           id="path5624"
           style="opacity:1;fill:url(#linearGradient5638);fill-opacity:1;fill-rule:nonzero;stroke:url(#linearGradient5640);stroke-width:1.02371633;stroke-linecap:butt;stroke-linejoin:miter;marker:none;marker-start:none;marker-mid:none;marker-end:none;stroke-miterlimit:4;stroke-dasharray:none;stroke-dashoffset:0;stroke-opacity:1;visibility:visible;display:inline;overflow:visible;enable-background:accumulate"
           sodipodi:type="arc" />
        <path
           transform="matrix(-2.879455e-8,-0.9101124,0.9101124,-2.879455e-8,-795.15832,1145.9688)"
           style="opacity:0.5;fill:#eeeeec;fill-opacity:1;fill-rule:nonzero;stroke:#eeeeec;stroke-width:1.02371633;stroke-linecap:butt;stroke-linejoin:miter;marker:none;marker-start:none;marker-mid:none;marker-end:none;stroke-miterlimit:4;stroke-dasharray:none;stroke-dashoffset:0;stroke-opacity:1;visibility:visible;display:inline;overflow:visible;enable-background:accumulate"
           d="M 126.75,1000.7372 C 126.75,1006.8782 121.766,1011.8622 115.625,1011.8622 C 115.625,1011.8622 117.68518,1006.8782 117.68518,1000.7372 C 117.68518,994.59618 115.625,989.61218 115.625,989.61218 C 121.766,989.61218 126.75,994.59618 126.75,1000.7372 z"
           id="path5626"
           sodipodi:nodetypes="csssc" />
      </g>
      <path
         sodipodi:type="star"
         style="fill:#555753;fill-opacity:1;fill-rule:nonzero;stroke:#eeeeec;stroke-width:0.93169695;stroke-linecap:butt;stroke-linejoin:miter;marker:none;marker-start:none;marker-mid:none;marker-end:none;stroke-miterlimit:4;stroke-dasharray:none;stroke-dashoffset:0;stroke-opacity:1;visibility:visible;display:inline;overflow:visible;enable-background:accumulate"
         id="path5628"
         sodipodi:sides="4"
         sodipodi:cx="190.375"
         sodipodi:cy="424.86218"
         sodipodi:r1="10.256857"
         sodipodi:r2="7.1798"
         sodipodi:arg1="0"
         sodipodi:arg2="0.78539816"
         inkscape:flatsided="false"
         inkscape:rounded="0"
         inkscape:randomized="0"
         d="M 200.63186,424.86218 L 195.45189,429.93907 L 190.375,435.11904 L 185.29811,429.93907 L 180.11814,424.86218 L 185.29811,419.7853 L 190.375,414.60533 L 195.45189,419.7853 L 200.63186,424.86218 z"
         transform="matrix(0.4810184,-0.4810183,0.4810183,0.4810184,-140.3155,927.94453)" />
    </g>
  </g>
</svg>
