<?xml version="1.0" encoding="UTF-8" standalone="no"?>
<!-- Created with Inkscape (http://www.inkscape.org/) -->
<svg
   xmlns:dc="http://purl.org/dc/elements/1.1/"
   xmlns:cc="http://web.resource.org/cc/"
   xmlns:rdf="http://www.w3.org/1999/02/22-rdf-syntax-ns#"
   xmlns:svg="http://www.w3.org/2000/svg"
   xmlns="http://www.w3.org/2000/svg"
   xmlns:xlink="http://www.w3.org/1999/xlink"
   xmlns:sodipodi="http://sodipodi.sourceforge.net/DTD/sodipodi-0.dtd"
   xmlns:inkscape="http://www.inkscape.org/namespaces/inkscape"
   width="100"
   height="100"
   id="svg2"
   sodipodi:version="0.32"
   inkscape:version="0.44"
   version="1.0"
   sodipodi:docbase="/home/ryx/Documents/scripts/python/screenlets/control/themes/ryx"
   sodipodi:docname="control-bg.svg">
  <defs
     id="defs4">
    <linearGradient
       id="linearGradient2879">
      <stop
         style="stop-color:white;stop-opacity:0.80973452;"
         offset="0"
         id="stop2881" />
      <stop
         style="stop-color:white;stop-opacity:0;"
         offset="1"
         id="stop2883" />
    </linearGradient>
    <linearGradient
       id="linearGradient2806">
      <stop
         style="stop-color:#9fff16;stop-opacity:1;"
         offset="0"
         id="stop2808" />
      <stop
         style="stop-color:#7ad000;stop-opacity:1;"
         offset="1"
         id="stop2810" />
    </linearGradient>
    <linearGradient
       id="linearGradient2798">
      <stop
         style="stop-color:white;stop-opacity:0.85398233;"
         offset="0"
         id="stop2800" />
      <stop
         style="stop-color:white;stop-opacity:0;"
         offset="1"
         id="stop2802" />
    </linearGradient>
    <linearGradient
       id="linearGradient2790">
      <stop
         style="stop-color:black;stop-opacity:0.26106194;"
         offset="0"
         id="stop2792" />
      <stop
         style="stop-color:black;stop-opacity:0;"
         offset="1"
         id="stop2794" />
    </linearGradient>
    <linearGradient
       inkscape:collect="always"
       xlink:href="#linearGradient2790"
       id="linearGradient2796"
       x1="49.55117"
       y1="86.740196"
       x2="49.346504"
       y2="71.898285"
       gradientUnits="userSpaceOnUse" />
    <linearGradient
       inkscape:collect="always"
       xlink:href="#linearGradient2798"
       id="linearGradient2804"
       x1="59.396809"
       y1="13.720588"
       x2="59.464096"
       y2="36.708946"
       gradientUnits="userSpaceOnUse"
       gradientTransform="translate(-60,0)" />
    <linearGradient
       inkscape:collect="always"
       xlink:href="#linearGradient2806"
       id="linearGradient2814"
       x1="54.656864"
       y1="16.421568"
       x2="55.392159"
       y2="88.235291"
       gradientUnits="userSpaceOnUse" />
    <linearGradient
       inkscape:collect="always"
       xlink:href="#linearGradient2879"
       id="linearGradient2885"
       x1="50.484375"
       y1="12.25"
       x2="50.484375"
       y2="46.5"
       gradientUnits="userSpaceOnUse"
       gradientTransform="matrix(0.954832,0,0,0.899814,2.280289,2.942966)" />
  </defs>
  <sodipodi:namedview
     id="base"
     pagecolor="#ffffff"
     bordercolor="#666666"
     borderopacity="1.0"
     inkscape:pageopacity="0.0"
     inkscape:pageshadow="2"
     inkscape:zoom="4.08"
     inkscape:cx="50"
     inkscape:cy="50"
     inkscape:document-units="px"
     inkscape:current-layer="layer1"
     width="100px"
     height="100px"
     inkscape:window-width="989"
     inkscape:window-height="624"
     inkscape:window-x="124"
     inkscape:window-y="79" />
  <metadata
     id="metadata7">
    <rdf:RDF>
      <cc:Work
         rdf:about="">
        <dc:format>image/svg+xml</dc:format>
        <dc:type
           rdf:resource="http://purl.org/dc/dcmitype/StillImage" />
      </cc:Work>
    </rdf:RDF>
  </metadata>
  <g
     inkscape:label="Ebene 1"
     inkscape:groupmode="layer"
     id="layer1">
    <rect
       style="opacity:1;fill:black;fill-opacity:0.23890782;stroke:none;stroke-width:2;stroke-linecap:butt;stroke-linejoin:miter;stroke-miterlimit:4;stroke-dasharray:none;stroke-dashoffset:0;stroke-opacity:1"
       id="rect2870"
       width="75.980392"
       height="75.980392"
       x="16.5"
       y="16.254902"
       rx="8"
       ry="8" />
    <rect
       style="opacity:0.8;fill:url(#linearGradient2814);fill-opacity:1.0;stroke:none;stroke-width:2;stroke-linecap:butt;stroke-linejoin:miter;stroke-miterlimit:4;stroke-dasharray:none;stroke-dashoffset:0;stroke-opacity:1"
       id="rect1892"
       width="75.980392"
       height="75.980392"
       x="12.5"
       y="12.254902"
       rx="8"
       ry="8" />
    <path
       id="rect2816"
       style="fill:#acff12;fill-opacity:0.55631399;stroke:none;stroke-width:2;stroke-linecap:butt;stroke-linejoin:miter;stroke-miterlimit:4;stroke-dashoffset:0;stroke-opacity:1;opacity:1"
       d="M 21.309436,21.5625 L 21.309436,50.96875 L 21.309436,79.40625 L 50.746936,79.40625 L 50.746936,50.96875 L 79.153186,50.96875 L 79.153186,21.5625 L 50.746936,21.5625 L 21.309436,21.5625 z M 51.960784,52.205883 L 79.166667,52.205883 L 79.166667,79.411766 L 51.960784,79.411766 L 51.960784,52.205883 z " />
    <path
       style="opacity:1;fill:url(#linearGradient2796);fill-opacity:1.0;stroke:none;stroke-width:2;stroke-linecap:butt;stroke-linejoin:miter;stroke-miterlimit:4;stroke-dasharray:none;stroke-dashoffset:0;stroke-opacity:1"
       d="M 86.846502,71.898284 C 73.112041,78.974549 53.983733,83.385128 32.809442,83.385128 C 26.584355,83.385129 20.536381,82.992261 14.747248,82.276249 C 15.906339,84.890473 18.623802,86.740199 21.804662,86.740196 L 79.191002,86.740196 C 83.432149,86.740196 86.846502,83.493858 86.846502,79.461404 L 86.846502,71.898284 z "
       id="rect2785" />
    <path
       style="opacity:1;fill:url(#linearGradient2885);fill-opacity:1;stroke:none;stroke-width:2;stroke-linecap:butt;stroke-linejoin:miter;stroke-miterlimit:4;stroke-dasharray:none;stroke-dashoffset:0;stroke-opacity:1"
       d="M 21.854341,13.965686 C 17.622526,13.965686 14.215686,17.176222 14.215686,21.164198 L 14.215686,44.784314 C 31.763591,38.338338 53.79474,34.492692 77.741839,34.492692 C 80.776665,34.492692 83.78428,34.568672 86.753064,34.689526 L 86.753064,21.164198 C 86.753064,17.176222 83.346224,13.965686 79.114409,13.965686 L 21.854341,13.965686 z "
       id="rect2872" />
  </g>
</svg>
