<?xml version="1.0" encoding="UTF-8" standalone="no"?>
<!-- Created with Inkscape (http://www.inkscape.org/) -->
<svg
   xmlns:dc="http://purl.org/dc/elements/1.1/"
   xmlns:cc="http://web.resource.org/cc/"
   xmlns:rdf="http://www.w3.org/1999/02/22-rdf-syntax-ns#"
   xmlns:svg="http://www.w3.org/2000/svg"
   xmlns="http://www.w3.org/2000/svg"
   xmlns:xlink="http://www.w3.org/1999/xlink"
   xmlns:sodipodi="http://sodipodi.sourceforge.net/DTD/sodipodi-0.dtd"
   xmlns:inkscape="http://www.inkscape.org/namespaces/inkscape"
   width="140"
   height="20"
   id="svg2"
   inkscape:label="Pozadí"
   sodipodi:version="0.32"
   inkscape:version="0.45.1"
   version="1.0"
   sodipodi:docname="fieldh.svg"
   sodipodi:docbase="/home/helder/.screenlets/TorrentSearch/themes/default"
   inkscape:output_extension="org.inkscape.output.svg.inkscape">
  <defs
     id="defs2201">
    <linearGradient
       id="linearGradient5815">
      <stop
         style="stop-color:#404040;stop-opacity:0;"
         offset="0"
         id="stop5817" />
      <stop
         style="stop-color:#404040;stop-opacity:0.50196081;"
         offset="1"
         id="stop5819" />
    </linearGradient>
    <linearGradient
       inkscape:collect="always"
       xlink:href="#linearGradient5815"
       id="linearGradient4461"
       x1="184.9711"
       y1="5.0578051"
       x2="185"
       y2="0"
       gradientUnits="userSpaceOnUse" />
    <linearGradient
       inkscape:collect="always"
       xlink:href="#linearGradient5815"
       id="linearGradient4473"
       x1="44.653179"
       y1="33.670521"
       x2="40"
       y2="33.670521"
       gradientUnits="userSpaceOnUse" />
    <radialGradient
       inkscape:collect="always"
       xlink:href="#linearGradient5815"
       id="radialGradient4485"
       cx="44.942196"
       cy="34.9711"
       fx="44.942196"
       fy="34.9711"
       r="2.5"
       gradientUnits="userSpaceOnUse"
       gradientTransform="matrix(-1.1627176e-2,-1.98854,1.9768786,-1.1559749e-2,-23.66887,124.74471)" />
    <linearGradient
       inkscape:collect="always"
       xlink:href="#linearGradient5815"
       id="linearGradient4684"
       gradientUnits="userSpaceOnUse"
       gradientTransform="matrix(3.7142858,0,0,1,-149.28572,-35)"
       x1="60.020229"
       y1="40"
       x2="60.020229"
       y2="34.992195" />
    <linearGradient
       inkscape:collect="always"
       xlink:href="#linearGradient5815"
       id="linearGradient4687"
       gradientUnits="userSpaceOnUse"
       gradientTransform="matrix(1,0,0,0.5,0,-15)"
       x1="54.989429"
       y1="49.971497"
       x2="50"
       y2="50" />
    <linearGradient
       inkscape:collect="always"
       xlink:href="#linearGradient5815"
       id="linearGradient4719"
       gradientUnits="userSpaceOnUse"
       gradientTransform="matrix(3.7142858,0,0,1,-149.28572,-35)"
       x1="60.020229"
       y1="40"
       x2="60.020229"
       y2="34.992195" />
    <linearGradient
       inkscape:collect="always"
       xlink:href="#linearGradient5815"
       id="linearGradient4722"
       gradientUnits="userSpaceOnUse"
       gradientTransform="matrix(1,0,0,0.5,0,-15)"
       x1="54.989429"
       y1="49.971497"
       x2="50"
       y2="50" />
  </defs>
  <sodipodi:namedview
     id="base"
     pagecolor="#ffffff"
     bordercolor="#666666"
     borderopacity="1.0"
     inkscape:pageopacity="0.0"
     inkscape:pageshadow="2"
     inkscape:zoom="4.8931791"
     inkscape:cx="46.8846"
     inkscape:cy="21.735798"
     inkscape:document-units="px"
     inkscape:current-layer="layer1"
     width="140px"
     height="20px"
     inkscape:grid-points="true"
     showgrid="true"
     inkscape:window-width="910"
     inkscape:window-height="626"
     inkscape:window-x="329"
     inkscape:window-y="57"
     gridtolerance="10000" />
  <metadata
     id="metadata2204">
    <rdf:RDF>
      <cc:Work
         rdf:about="">
        <dc:format>image/svg+xml</dc:format>
        <dc:type
           rdf:resource="http://purl.org/dc/dcmitype/StillImage" />
      </cc:Work>
    </rdf:RDF>
  </metadata>
  <g
     inkscape:label="Vrstva 1"
     inkscape:groupmode="layer"
     id="layer1">
    <g
       id="g4725"
       transform="translate(-50,0)">
      <rect
         ry="5"
         rx="5"
         y="0"
         x="50"
         height="20"
         width="140"
         id="rect8889"
         style="fill:#f9f9f9;fill-opacity:1;stroke:none;stroke-width:1;stroke-miterlimit:4;stroke-dasharray:none;stroke-opacity:1" />
      <rect
         clip-path="none"
         y="5"
         x="50"
         height="10"
         width="5"
         id="rect5846"
         style="fill:url(#linearGradient4722);fill-opacity:1;stroke:none;stroke-width:1;stroke-miterlimit:4;stroke-dasharray:none;stroke-opacity:1" />
      <rect
         clip-path="none"
         y="0"
         x="55"
         height="5"
         width="130"
         id="rect5828"
         style="fill:url(#linearGradient4719);fill-opacity:1;stroke:none;stroke-width:1;stroke-miterlimit:4;stroke-dasharray:none;stroke-opacity:1" />
      <path
         sodipodi:end="6.2831853"
         sodipodi:start="4.712389"
         d="M 185,8.8817842e-16 A 5,5 0 0 1 190,5 L 185,5 z"
         sodipodi:ry="5"
         sodipodi:rx="5"
         sodipodi:cy="5"
         sodipodi:cx="185"
         id="path3470"
         style="fill:url(#linearGradient4461);fill-opacity:1;stroke:none;stroke-width:1;stroke-miterlimit:4;stroke-dasharray:none;stroke-opacity:1"
         sodipodi:type="arc" />
      <path
         transform="translate(9.9999999,-15)"
         sodipodi:end="3.1415927"
         sodipodi:start="1.5707963"
         d="M 45,35 A 5,5 0 0 1 40,30 L 45,30 z"
         sodipodi:ry="5"
         sodipodi:rx="5"
         sodipodi:cy="30"
         sodipodi:cx="45"
         id="path4465"
         style="fill:url(#linearGradient4473);fill-opacity:1;stroke:none;stroke-width:1;stroke-miterlimit:4;stroke-dasharray:none;stroke-opacity:1"
         sodipodi:type="arc" />
      <path
         transform="translate(9.9999999,-30)"
         sodipodi:end="4.712389"
         sodipodi:start="3.1415927"
         d="M 40,35 A 5,5 0 0 1 45,30 L 45,35 z"
         sodipodi:ry="5"
         sodipodi:rx="5"
         sodipodi:cy="35"
         sodipodi:cx="45"
         id="path4477"
         style="fill:url(#radialGradient4485);fill-opacity:1;stroke:none;stroke-width:1;stroke-miterlimit:4;stroke-dasharray:none;stroke-opacity:1"
         sodipodi:type="arc" />
    </g>
  </g>
</svg>
