[
  {
    "category": "``s3control``",
    "description": "It allows customers to pass CRC64NVME as a header in S3 Batch Operations copy requests",
    "type": "api-change"
  },
  {
    "category": "``socialmessaging``",
    "description": "Added support for passing role arn corresponding to the supported event destination",
    "type": "api-change"
  },
  {
    "category": "``bedrock-runtime``",
    "description": "Add an API parameter that allows customers to set performance configuration for invoking a model.",
    "type": "api-change"
  }
]