[
  {
    "category": "``s3``",
    "description": "This change is only for updating the model regexp of CopySource which is not for validation but only for documentation and user guide change.",
    "type": "api-change"
  },
  {
    "category": "``route53domains``",
    "description": "Doc only update for Route 53 Domains that fixes several customer-reported issues",
    "type": "api-change"
  },
  {
    "category": "``ecs``",
    "description": "Adding SDK reference examples for Amazon ECS operations.",
    "type": "api-change"
  }
]