[
  {
    "category": "``keyspaces``",
    "description": "Amazon Keyspaces: adding the list of IAM actions required by the UpdateKeyspace API.",
    "type": "api-change"
  },
  {
    "category": "``sso``",
    "description": "Support the ``--ca-bundle`` and ``--no-verify-ssl`` options on SSO commands.",
    "type": "bugfix"
  },
  {
    "category": "``appsync``",
    "description": "Provides description of new Amazon Bedrock runtime datasource.",
    "type": "api-change"
  },
  {
    "category": "``ec2``",
    "description": "This release includes a new API for modifying instance network-performance-options after launch.",
    "type": "api-change"
  },
  {
    "category": "``medialive``",
    "description": "H265 outputs now support disabling the deblocking filter.",
    "type": "api-change"
  },
  {
    "category": "``s3``",
    "description": "Follow ``IllegalLocationConstraintException`` redirects for ``s3``.",
    "type": "bugfix"
  },
  {
    "category": "``ecs``",
    "description": "This is a documentation only update to address various tickets for Amazon ECS.",
    "type": "api-change"
  },
  {
    "category": "``cognito-idp``",
    "description": "Change `CustomDomainConfig` from a required to an optional parameter for the `UpdateUserPoolDomain` operation.",
    "type": "api-change"
  },
  {
    "category": "``workspaces``",
    "description": "Added text to clarify case-sensitivity",
    "type": "api-change"
  }
]