[
  {
    "category": "``eks``",
    "description": "Added support for disabling unmanaged addons during cluster creation.",
    "type": "api-change"
  },
  {
    "category": "``kinesisanalyticsv2``",
    "description": "This release adds support for new ListApplicationOperations and DescribeApplicationOperation APIs. It adds a new configuration to enable system rollbacks, adds field ApplicationVersionCreateTimestamp for clarity and improves support for pagination for APIs.",
    "type": "api-change"
  },
  {
    "category": "``opensearch``",
    "description": "This release adds support for enabling or disabling Natural Language Query Processing feature for Amazon OpenSearch Service domains, and provides visibility into the current state of the setup or tear-down.",
    "type": "api-change"
  },
  {
    "category": "``ivs-realtime``",
    "description": "IVS Real-Time now offers customers the ability to upload public keys for customer vended participant tokens.",
    "type": "api-change"
  },
  {
    "category": "``controltower``",
    "description": "Added ListLandingZoneOperations API.",
    "type": "api-change"
  }
]