[
  {
    "category": "``athena``",
    "description": "Throwing validation errors on CreateNotebook with Name containing `/`,`:`,`\\`",
    "type": "api-change"
  },
  {
    "category": "``connect``",
    "description": "This release includes changes to DescribeContact API's response by including ConnectedToSystemTimestamp, RoutingCriteria, Customer, Campaign, AnsweringMachineDetectionStatus, CustomerVoiceActivity, QualityMetrics, DisconnectDetails, and SegmentAttributes information from a contact in Amazon Connect.",
    "type": "api-change"
  },
  {
    "category": "``securityhub``",
    "description": "Add ROOT type for TargetType model",
    "type": "api-change"
  },
  {
    "category": "``glue``",
    "description": "Add optional field JobMode to CreateJob and UpdateJob APIs.",
    "type": "api-change"
  },
  {
    "category": "``codebuild``",
    "description": "AWS CodeBuild now supports manually creating GitHub webhooks",
    "type": "api-change"
  }
]