[
  {
    "category": "``iotwireless``",
    "description": "Add RoamingDeviceSNR and RoamingDeviceRSSI to Customer Metrics.",
    "type": "api-change"
  },
  {
    "category": "``kms``",
    "description": "This feature allows customers to use their keys stored in KMS to derive a shared secret which can then be used to establish a secured channel for communication, provide proof of possession, or establish trust with other parties.",
    "type": "api-change"
  },
  {
    "category": "Parsers",
    "description": "Fixes datetime parse error handling for out-of-range and negative timestamps",
    "type": "bugfix"
  },
  {
    "category": "``glue``",
    "description": "This release adds support for configuration of evaluation method for composite rules in Glue Data Quality rulesets.",
    "type": "api-change"
  },
  {
    "category": "``cloudhsmv2``",
    "description": "Added support for hsm type hsm2m.medium. Added supported for creating a cluster in FIPS or NON_FIPS mode.",
    "type": "api-change"
  },
  {
    "category": "``mediapackagev2``",
    "description": "This release adds support for CMAF ingest (DASH-IF live media ingest protocol interface 1)",
    "type": "api-change"
  }
]