[
  {
    "category": "``firehose``",
    "description": "Amazon Data Firehose / Features : Adds support for a new DeliveryStreamType, DatabaseAsSource. DatabaseAsSource hoses allow customers to stream CDC events from their RDS and Amazon EC2 hosted databases, running MySQL and PostgreSQL database engines, to Iceberg Table destinations.",
    "type": "api-change"
  },
  {
    "category": "``eks``",
    "description": "Adds new error code `Ec2InstanceTypeDoesNotExist` for Amazon EKS managed node groups",
    "type": "api-change"
  },
  {
    "category": "``controlcatalog``",
    "description": "AWS Control Catalog GetControl public API returns additional data in output, including Implementation and Parameters",
    "type": "api-change"
  },
  {
    "category": "``bedrock-agent-runtime``",
    "description": "This release adds trace functionality to Bedrock Prompt Flows",
    "type": "api-change"
  },
  {
    "category": "``qbusiness``",
    "description": "Adds S3 path option to pass group member list for PutGroup API.",
    "type": "api-change"
  },
  {
    "category": "``lambda``",
    "description": "This release adds support for using AWS KMS customer managed keys to encrypt AWS Lambda .zip deployment packages.",
    "type": "api-change"
  },
  {
    "category": "``batch``",
    "description": "This feature allows override LaunchTemplates to be specified in an AWS Batch Compute Environment.",
    "type": "api-change"
  },
  {
    "category": "``chime-sdk-media-pipelines``",
    "description": "Added support for Media Capture Pipeline and Media Concatenation Pipeline for customer managed server side encryption. Now Media Capture Pipeline can use IAM sink role to get access to KMS key and encrypt/decrypt recorded artifacts. KMS key ID can also be supplied with encryption context.",
    "type": "api-change"
  },
  {
    "category": "``s3``",
    "description": "Handle HTTP 200 responses with error information for all supported s3 operations.",
    "type": "enhancement"
  },
  {
    "category": "``pinpoint-sms-voice-v2``",
    "description": "Added the RequiresAuthenticationTimestamp field to the RegistrationVersionStatusHistory data type.",
    "type": "api-change"
  }
]