[
  {
    "category": "``organizations``",
    "description": "Added a new reason under ConstraintViolationException in RegisterDelegatedAdministrator API to prevent registering suspended accounts as delegated administrator of a service.",
    "type": "api-change"
  },
  {
    "category": "``workspaces``",
    "description": "Fix create workspace bundle RootStorage/UserStorage to accept non null values",
    "type": "api-change"
  },
  {
    "category": "``directconnect``",
    "description": "This update includes documentation for support of new native 400 GBps ports for Direct Connect.",
    "type": "api-change"
  },
  {
    "category": "``application-autoscaling``",
    "description": "Doc only update for Application Auto Scaling that fixes resource name.",
    "type": "api-change"
  },
  {
    "category": "``rekognition``",
    "description": "This release adds support for tagging projects and datasets with the CreateProject and CreateDataset APIs.",
    "type": "api-change"
  }
]