[
  {
    "category": "``network-firewall``",
    "description": "Dual-stack endpoints are now supported.",
    "type": "api-change"
  },
  {
    "category": "``bcm-pricing-calculator``",
    "description": "Added ConflictException to DeleteBillEstimate.",
    "type": "api-change"
  },
  {
    "category": "``securityhub``",
    "description": "Documentation updates for AWS Security Hub",
    "type": "api-change"
  },
  {
    "category": "``ecr``",
    "description": "Add support for Dualstack Endpoints",
    "type": "api-change"
  }
]