[
  {
    "category": "``sso``",
    "description": "Add support and default to the OAuth 2.0 Authorization Code Flow with PKCE for ``aws sso login``.",
    "type": "feature"
  },
  {
    "category": "``cloudformation``",
    "description": "This release adds a new API, ListHookResults, that allows retrieving CloudFormation Hooks invocation results for hooks invoked during a create change set operation or Cloud Control API operation",
    "type": "api-change"
  },
  {
    "category": "``autoscaling``",
    "description": "Amazon EC2 Auto Scaling now supports Amazon Application Recovery Controller (ARC) zonal shift and zonal autoshift to help you quickly recover an impaired application from failures in an Availability Zone (AZ).",
    "type": "api-change"
  },
  {
    "category": "``customer-profiles``",
    "description": "This release introduces Segmentation APIs and new Calculated Attribute Event Filters as part of Amazon Connect Customer Profiles service.",
    "type": "api-change"
  },
  {
    "category": "``rds-data``",
    "description": "Add support for the automatic pause/resume feature of Aurora Serverless v2.",
    "type": "api-change"
  },
  {
    "category": "``appconfig``",
    "description": "AWS AppConfig has added a new extension action point, AT_DEPLOYMENT_TICK, to support third-party monitors to trigger an automatic rollback during a deployment.",
    "type": "api-change"
  },
  {
    "category": "``ecs``",
    "description": "This release adds support for adding VPC Lattice configurations in ECS CreateService/UpdateService APIs. The configuration allows for associating VPC Lattice target groups with ECS Services.",
    "type": "api-change"
  },
  {
    "category": "``iotsitewise``",
    "description": "The release introduces a generative AI Assistant in AWS IoT SiteWise. It includes: 1) InvokeAssistant API - Invoke the Assistant to get alarm summaries and ask questions. 2) Dataset APIs - Manage knowledge base configuration for the Assistant. 3) Portal APIs enhancement - Manage AI-aware dashboards.",
    "type": "api-change"
  },
  {
    "category": "``ec2``",
    "description": "Adding request and response elements for managed resources.",
    "type": "api-change"
  },
  {
    "category": "``connect``",
    "description": "Adds CreateContactFlowVersion and ListContactFlowVersions APIs to create and view the versions of a contact flow.",
    "type": "api-change"
  },
  {
    "category": "``qconnect``",
    "description": "This release introduces MessageTemplate as a resource in Amazon Q in Connect, along with APIs to create, read, search, update, and delete MessageTemplate resources.",
    "type": "api-change"
  },
  {
    "category": "``rds``",
    "description": "Add support for the automatic pause/resume feature of Aurora Serverless v2.",
    "type": "api-change"
  }
]