[
  {
    "category": "``marketplace-reporting``",
    "description": "Documentation-only update for AWS Marketplace Reporting API.",
    "type": "api-change"
  },
  {
    "category": "``qconnect``",
    "description": "This release adds support for the following capabilities: Configuration of the Gen AI system via AIAgent and AIPrompts. Integration support for Bedrock Knowledge Base.",
    "type": "api-change"
  },
  {
    "category": "``deadline``",
    "description": "Add support for using the template from a previous job during job creation and listing parameter definitions for a job.",
    "type": "api-change"
  },
  {
    "category": "``redshift``",
    "description": "Add validation pattern to S3KeyPrefix on the EnableLogging API",
    "type": "api-change"
  }
]