[
  {
    "category": "``qbusiness``",
    "description": "This release removes the deprecated UserId and UserGroups fields from SearchRelevantContent api's request parameters.",
    "type": "api-change"
  },
  {
    "category": "``partnercentral-selling``",
    "description": "Introducing the preview of new partner central selling APIs designed to transform how AWS partners collaborate and co-sell with multiple partners. This enables multiple partners to seamlessly engage and jointly pursue customer opportunities, fostering a new era of collaborative selling.",
    "type": "api-change"
  }
]