[
  {
    "category": "``supplychain``",
    "description": "Allow vanity DNS domain when creating a new ASC instance",
    "type": "api-change"
  },
  {
    "category": "``iotsecuretunneling``",
    "description": "Adds dualstack endpoint support for IoT Secure Tunneling",
    "type": "api-change"
  }
]