[
  {
    "category": "``workspaces``",
    "description": "Adds new APIs for managing and sharing WorkSpaces BYOL configuration across accounts.",
    "type": "api-change"
  },
  {
    "category": "``rolesanywhere``",
    "description": "This release introduces the PutAttributeMapping and DeleteAttributeMapping APIs. IAM Roles Anywhere now provides the capability to define a set of mapping rules, allowing customers to specify which data is extracted from their X.509 end-entity certificates.",
    "type": "api-change"
  },
  {
    "category": "``guardduty``",
    "description": "Added IPv6Address fields for local and remote IP addresses",
    "type": "api-change"
  },
  {
    "category": "``emr-serverless``",
    "description": "This release adds the capability to publish detailed Spark engine metrics to Amazon Managed Service for Prometheus (AMP) for  enhanced monitoring for Spark jobs.",
    "type": "api-change"
  },
  {
    "category": "``qbusiness``",
    "description": "This release adds support for IAM Identity Center (IDC) as the identity gateway for Q Business. It also allows users to provide an explicit intent for Q Business to identify how the Chat request should be handled.",
    "type": "api-change"
  },
  {
    "category": "``drs``",
    "description": "Outpost ARN added to Source Server and Recovery Instance",
    "type": "api-change"
  },
  {
    "category": "``ec2``",
    "description": "Documentation updates for Elastic Compute Cloud (EC2).",
    "type": "api-change"
  },
  {
    "category": "``sagemaker``",
    "description": "Removed deprecated enum values and updated API documentation.",
    "type": "api-change"
  },
  {
    "category": "``quicksight``",
    "description": "This release adds support for the Cross Sheet Filter and Control features, and support for warnings in asset imports for any permitted errors encountered during execution",
    "type": "api-change"
  }
]