[
  {
    "category": "``nimble``",
    "description": "The nimble client has been removed following the deprecation of the service.",
    "type": "api-change"
  },
  {
    "category": "``ecs``",
    "description": "This release adds support for EBS volumes attached to Amazon ECS Windows tasks running on EC2 instances.",
    "type": "api-change"
  },
  {
    "category": "``pcs``",
    "description": "Documentation update: added the default value of the Slurm configuration parameter scaleDownIdleTimeInSeconds to its description.",
    "type": "api-change"
  },
  {
    "category": "``appconfig``",
    "description": "This release improves deployment safety by granting customers the ability to REVERT completed deployments, to the last known good state.In the StopDeployment API revert case the status of a COMPLETE deployment will be REVERTED. AppConfig only allows a revert within 72 hours of deployment completion.",
    "type": "api-change"
  },
  {
    "category": "``ec2``",
    "description": "This release includes a new API to describe some details of the Amazon Machine Images (AMIs) that were used to launch EC2 instances, even if those AMIs are no longer available for use.",
    "type": "api-change"
  },
  {
    "category": "shorthand",
    "description": "Improve performance when parsing invalid shorthand syntax.",
    "type": "bugfix"
  },
  {
    "category": "``qbusiness``",
    "description": "Add a new field in chat response. This field can be used to support nested schemas in array fields",
    "type": "api-change"
  }
]