[
  {
    "category": "``rds``",
    "description": "This release provides additional support for enabling Aurora Limitless Database DB clusters.",
    "type": "api-change"
  },
  {
    "category": "``bedrock-agent``",
    "description": "This release adds support to stop an ongoing ingestion job using the StopIngestionJob API in Agents for Amazon Bedrock.",
    "type": "api-change"
  },
  {
    "category": "``codeartifact``",
    "description": "Add support for the dual stack endpoints.",
    "type": "api-change"
  }
]