[
  {
    "category": "``bedrock-runtime``",
    "description": "Updating invoke regex to support imported models for converse API",
    "type": "api-change"
  },
  {
    "category": "``m2``",
    "description": "Add AuthSecretsManagerArn optional parameter to batch job APIs, expand batch parameter limits, and introduce clientToken constraints.",
    "type": "api-change"
  },
  {
    "category": "``imagebuilder``",
    "description": "Add macOS platform and instance placement options",
    "type": "api-change"
  },
  {
    "category": "``repostspace``",
    "description": "Adds the BatchAddRole and BatchRemoveRole APIs.",
    "type": "api-change"
  },
  {
    "category": "``rds``",
    "description": "Global clusters now expose the Endpoint attribute as one of its fields. It is a Read/Write endpoint for the global cluster which resolves to the Global Cluster writer instance.",
    "type": "api-change"
  },
  {
    "category": "``timestream-query``",
    "description": "This release adds support for Query Insights, a feature that provides details of query execution, enabling users to identify areas for improvement to optimize their queries, resulting in improved query performance and lower query costs.",
    "type": "api-change"
  }
]