[
  {
    "category": "``wafv2``",
    "description": "The minimum request rate for a rate-based rule is now 10. Before this, it was 100.",
    "type": "api-change"
  },
  {
    "category": "``bedrock-runtime``",
    "description": "Add support for imported-model in invokeModel and InvokeModelWithResponseStream.",
    "type": "api-change"
  },
  {
    "category": "``bedrock-agent-runtime``",
    "description": "Lifting the maximum length on Bedrock KnowledgeBase RetrievalFilter array",
    "type": "api-change"
  },
  {
    "category": "``stepfunctions``",
    "description": "This release adds support for static analysis to ValidateStateMachineDefinition API, which can now return optional WARNING diagnostics for semantic errors on the definition of an Amazon States Language (ASL) state machine.",
    "type": "api-change"
  },
  {
    "category": "``personalize``",
    "description": "This releases ability to update automatic training scheduler for customer solutions",
    "type": "api-change"
  },
  {
    "category": "``quicksight``",
    "description": "Increased Character Limit for Dataset Calculation Field expressions",
    "type": "api-change"
  }
]