[
  {
    "category": "``opensearch``",
    "description": "This release adds support for enabling or disabling a data source configured as part of Zero-ETL integration with Amazon S3, by setting its status.",
    "type": "api-change"
  },
  {
    "category": "``cloudformation``",
    "description": "Added DeletionMode FORCE_DELETE_STACK for deleting a stack that is stuck in DELETE_FAILED state due to resource deletion failure.",
    "type": "api-change"
  },
  {
    "category": "``chatbot``",
    "description": "This change adds support for tagging Chatbot configurations.",
    "type": "api-change"
  },
  {
    "category": "``wafv2``",
    "description": "You can now use Security Lake to collect web ACL traffic data.",
    "type": "api-change"
  },
  {
    "category": "``kms``",
    "description": "This release includes feature to import customer's asymmetric (RSA, ECC and SM2) and HMAC keys into KMS in China.",
    "type": "api-change"
  }
]