[
  {
    "category": "``ses``",
    "description": "Add v2 smoke tests and smithy smokeTests trait for SDK testing.",
    "type": "api-change"
  },
  {
    "category": "``es``",
    "description": "Add v2 smoke tests and smithy smokeTests trait for SDK testing.",
    "type": "api-change"
  },
  {
    "category": "``qapps``",
    "description": "This is a general availability (GA) release of Amazon Q Apps, a capability of Amazon Q Business. Q Apps leverages data sources your company has provided to enable users to build, share, and customize apps within your organization.",
    "type": "api-change"
  },
  {
    "category": "``gamelift``",
    "description": "Add v2 smoke tests and smithy smokeTests trait for SDK testing.",
    "type": "api-change"
  },
  {
    "category": "``dms``",
    "description": "Add v2 smoke tests and smithy smokeTests trait for SDK testing.",
    "type": "api-change"
  },
  {
    "category": "``elasticbeanstalk``",
    "description": "Add v2 smoke tests and smithy smokeTests trait for SDK testing.",
    "type": "api-change"
  },
  {
    "category": "``devicefarm``",
    "description": "Add v2 smoke tests and smithy smokeTests trait for SDK testing.",
    "type": "api-change"
  },
  {
    "category": "``route53resolver``",
    "description": "Add v2 smoke tests and smithy smokeTests trait for SDK testing.",
    "type": "api-change"
  },
  {
    "category": "``codedeploy``",
    "description": "Add v2 smoke tests and smithy smokeTests trait for SDK testing.",
    "type": "api-change"
  },
  {
    "category": "``firehose``",
    "description": "Add v2 smoke tests and smithy smokeTests trait for SDK testing.",
    "type": "api-change"
  }
]