[
  {
    "category": "``application-autoscaling``",
    "description": "Application Auto Scaling is now more responsive to the changes in demand of your SageMaker Inference endpoints. To get started, create or update a Target Tracking policy based on High Resolution CloudWatch metrics.",
    "type": "api-change"
  },
  {
    "category": "``elbv2``",
    "description": "This release adds support for sharing trust stores across accounts and organizations through integration with AWS Resource Access Manager.",
    "type": "api-change"
  },
  {
    "category": "``network-firewall``",
    "description": "You can now log events that are related to TLS inspection, in addition to the existing alert and flow logging.",
    "type": "api-change"
  },
  {
    "category": "``outposts``",
    "description": "Adding default vCPU information to GetOutpostSupportedInstanceTypes and GetOutpostInstanceTypes responses",
    "type": "api-change"
  },
  {
    "category": "``codecommit``",
    "description": "CreateRepository API now throws OperationNotAllowedException when the account has been restricted from creating a repository.",
    "type": "api-change"
  },
  {
    "category": "``stepfunctions``",
    "description": "This release adds support to customer managed KMS key encryption in AWS Step Functions.",
    "type": "api-change"
  },
  {
    "category": "``bedrock-runtime``",
    "description": "Provides ServiceUnavailableException error message",
    "type": "api-change"
  },
  {
    "category": "``application-signals``",
    "description": "CloudWatch Application Signals now supports application logs correlation with traces and operational health metrics of applications running on EC2 instances. Users can view the most relevant telemetry to troubleshoot application health anomalies such as spikes in latency, errors, and availability.",
    "type": "api-change"
  },
  {
    "category": "``datazone``",
    "description": "Introduces GetEnvironmentCredentials operation to SDK",
    "type": "api-change"
  },
  {
    "category": "``ecr``",
    "description": "API and documentation updates for Amazon ECR, adding support for creating, updating, describing and deleting ECR Repository Creation Template.",
    "type": "api-change"
  },
  {
    "category": "``eks``",
    "description": "This release adds support for EKS cluster to manage extended support.",
    "type": "api-change"
  },
  {
    "category": "``ec2``",
    "description": "EC2 Fleet now supports using custom identifiers to reference Amazon Machine Images (AMI) in launch requests that are configured to choose from a diversified list of instance types.",
    "type": "api-change"
  }
]