[
  {
    "category": "``secretsmanager``",
    "description": "add v2 smoke tests and smithy smokeTests trait for SDK testing",
    "type": "api-change"
  },
  {
    "category": "``bedrock-agent-runtime``",
    "description": "This release adds support for using Guardrails with Bedrock Agents.",
    "type": "api-change"
  },
  {
    "category": "``rds``",
    "description": "This release adds support for EngineLifecycleSupport on DBInstances, DBClusters, and GlobalClusters.",
    "type": "api-change"
  },
  {
    "category": "``controltower``",
    "description": "Added ListControlOperations API and filtering support for ListEnabledControls API. Updates also includes added metadata for enabled controls and control operations.",
    "type": "api-change"
  },
  {
    "category": "``bedrock-agent``",
    "description": "This release adds support for using Guardrails with Bedrock Agents.",
    "type": "api-change"
  },
  {
    "category": "``osis``",
    "description": "Add support for creating an OpenSearch Ingestion pipeline that is attached to a provided VPC. Add information about the destinations of an OpenSearch Ingestion pipeline to the GetPipeline and ListPipelines APIs.",
    "type": "api-change"
  }
]