[
  {
    "category": "``ecr-public``",
    "description": "Restoring custom endpoint functionality for ECR Public",
    "type": "api-change"
  },
  {
    "category": "``ecr``",
    "description": "Restoring custom endpoint functionality for ECR",
    "type": "api-change"
  }
]