[
  {
    "category": "``bedrock-runtime``",
    "description": "Allow hyphens in tool name for Converse and ConverseStream APIs",
    "type": "api-change"
  },
  {
    "category": "``sagemaker``",
    "description": "Correction of docs for  \"Added support for ml.trn1.32xlarge instance type in Reserved Capacity Offering\"",
    "type": "api-change"
  },
  {
    "category": "``notifications``",
    "description": "Added support for Managed Notifications, integration with AWS Organization and added aggregation summaries for Aggregate Notifications",
    "type": "api-change"
  },
  {
    "category": "``detective``",
    "description": "Doc only update for Detective documentation.",
    "type": "api-change"
  },
  {
    "category": "``ec2``",
    "description": "Release u7i-6tb.112xlarge, u7i-8tb.112xlarge, u7inh-32tb.480xlarge, p5e.48xlarge, p5en.48xlarge, f2.12xlarge, f2.48xlarge, trn2.48xlarge instance types.",
    "type": "api-change"
  }
]