[
  {
    "category": "``resiliencehub``",
    "description": "AWS Resilience Hub now automatically detects already configured CloudWatch alarms and FIS experiments as part of the assessment process and returns the discovered resources in the corresponding list API responses. It also allows you to include or exclude test recommendations for an AppComponent.",
    "type": "api-change"
  },
  {
    "category": "``ec2``",
    "description": "Replace cryptographic functions from ``cryptography`` with ``awscrt`` for the ``get-password-data`` command.",
    "type": "enhancement"
  },
  {
    "category": "``quicksight``",
    "description": "Add support for PerformanceConfiguration attribute to Dataset entity. Allow PerformanceConfiguration specification in CreateDataset and UpdateDataset APIs.",
    "type": "api-change"
  },
  {
    "category": "``transfer``",
    "description": "Added AS2 agreement configurations to control filename preservation and message signing enforcement. Added AS2 connector configuration to preserve content type from S3 objects.",
    "type": "api-change"
  },
  {
    "category": "``budgets``",
    "description": "Releasing minor partition endpoint updates",
    "type": "api-change"
  },
  {
    "category": "``connect``",
    "description": "This release adds support for the UpdateParticipantAuthentication API used for customer authentication within Amazon Connect chats.",
    "type": "api-change"
  },
  {
    "category": "``cloudfront``",
    "description": "Replace cryptographic functions from ``cryptography`` with ``awscrt`` for the ``sign`` command.",
    "type": "enhancement"
  },
  {
    "category": "``datasync``",
    "description": "AWS DataSync introduces the ability to update attributes for in-cloud locations.",
    "type": "api-change"
  },
  {
    "category": "``iot``",
    "description": "Release connectivity status query API which is a dedicated high throughput(TPS) API to query a specific device's most recent connectivity state and metadata.",
    "type": "api-change"
  },
  {
    "category": "``amplify``",
    "description": "Added WAF Configuration to Amplify Apps",
    "type": "api-change"
  },
  {
    "category": "``cloudtrail``",
    "description": "Replace cryptographic functions from ``cryptography`` with ``awscrt`` for the ``validate-logs`` and ``verify-query-results`` commands.",
    "type": "enhancement"
  },
  {
    "category": "``connectparticipant``",
    "description": "This release adds support for the GetAuthenticationUrl and CancelParticipantAuthentication APIs used for customer authentication within Amazon Connect chats. There are also minor updates to the GetAttachment API.",
    "type": "api-change"
  },
  {
    "category": "``mwaa``",
    "description": "Added support for Apache Airflow version 2.10.3 to MWAA.",
    "type": "api-change"
  }
]