<?xml version="1.0" encoding="UTF-8" standalone="no"?>
<!-- Created with Inkscape (http://www.inkscape.org/) -->

<svg
   width="691.16125"
   height="323.75253"
   viewBox="0 0 182.86974 85.659519"
   version="1.1"
   id="svg5"
   inkscape:version="1.2 (dc2aedaf03, 2022-05-15)"
   sodipodi:docname="boxshadow_blur_radius.svg"
   xml:space="preserve"
   xmlns:inkscape="http://www.inkscape.org/namespaces/inkscape"
   xmlns:sodipodi="http://sodipodi.sourceforge.net/DTD/sodipodi-0.dtd"
   xmlns:xlink="http://www.w3.org/1999/xlink"
   xmlns="http://www.w3.org/2000/svg"
   xmlns:svg="http://www.w3.org/2000/svg"><sodipodi:namedview
     id="namedview7"
     pagecolor="#4f4f4f"
     bordercolor="#eeeeee"
     borderopacity="1"
     inkscape:showpageshadow="false"
     inkscape:pageopacity="0"
     inkscape:pagecheckerboard="true"
     inkscape:deskcolor="#505050"
     inkscape:document-units="px"
     showgrid="false"
     inkscape:zoom="1.9025946"
     inkscape:cx="345.58072"
     inkscape:cy="161.6214"
     inkscape:window-width="1920"
     inkscape:window-height="991"
     inkscape:window-x="-9"
     inkscape:window-y="-9"
     inkscape:window-maximized="1"
     inkscape:current-layer="g27355"
     showborder="true"
     borderlayer="true"
     shape-rendering="auto"
     showguides="true" /><defs
     id="defs2"><clipPath
       clipPathUnits="userSpaceOnUse"
       id="clipPath8064"><rect
         style="opacity:1;fill:#ffffff;fill-opacity:1;stroke:none;stroke-width:0.396875;stroke-linejoin:bevel"
         id="rect8066"
         width="106.4148"
         height="85.659523"
         x="1130.7994"
         y="44.980705" /></clipPath><clipPath
       clipPathUnits="userSpaceOnUse"
       id="clipPath9119"><rect
         style="opacity:1;fill:#ffffff;fill-opacity:1;stroke:none;stroke-width:0.28857;stroke-linejoin:bevel"
         id="rect9121"
         width="91.434891"
         height="85.659523"
         x="1054.3445"
         y="44.980701" /></clipPath></defs><g
     inkscape:label="Camada 1"
     inkscape:groupmode="layer"
     id="layer1"
     transform="translate(-1824.1153,-30.257008)"><g
       id="g27355"
       inkscape:export-filename=".\g27355.svg"
       inkscape:export-xdpi="96"
       inkscape:export-ydpi="96"><rect
         style="fill:#ffffff;fill-opacity:1;stroke:none;stroke-width:0.334366;stroke-linejoin:bevel;stroke-dasharray:none;stroke-opacity:1"
         id="rect6428-9-8-4"
         width="182.86977"
         height="26.537575"
         x="1824.1152"
         y="89.37896"
         inkscape:export-filename="..\Downloads\rect6428-9-8.png"
         inkscape:export-xdpi="96"
         inkscape:export-ydpi="96" /><rect
         style="fill:#ffffff;fill-opacity:1;stroke:none;stroke-width:0.334366;stroke-linejoin:bevel;stroke-dasharray:none;stroke-opacity:1"
         id="rect6428-9-8-9-1"
         width="182.86977"
         height="26.537575"
         x="1824.1152"
         y="30.25701" /><image
         width="144.99167"
         height="105.03958"
         preserveAspectRatio="none"
         xlink:href="data:image/png;base64,iVBORw0KGgoAAAANSUhEUgAAAiQAAAGNCAYAAAAhCGrLAAAABHNCSVQICAgIfAhkiAAAGSFJREFU eJzt3Uty48gVBVBQosr20FMvopfhRXsV3oFnHtgDRw8c7q4SSQ+6U0olM4EE+HkEcU4EgiDAD1gV AK/eS4C70+l0GgAAAr1EbwAAgEACAIQTSACAcAIJABBOIAEAwgkkAEA4gQQACCeQAADhBBIAIJxA AgCEE0gAgHACCQAQTiABAMIJJABAOIEEAAgnkAAA4QQSACCcQAIAhBNIAIBwAgkAEE4gAQDCCSQA QDiBBAAIJ5AAAOEEEgAgnEACAIQTSACAcAIJABBuH70Ba3Q6nbwf8MVut/N+cAEVEgAgnEACAIQT SACAcLuTAQOT7vFPdIv38F8Lj+8WYzPuMd7DmBKuTYUEAAgnkAAA4bRsGm79z7L09a+1Xf7b4X6u 1d5Y+jq3bq9o33ANKiQAQDiBBAAIp2Xzu0c+k6b3edFtIODTrdsrj9q+udd78HxUSACAcAIJABBu ky2be33kOe9zi7bMrVs9QNstWi+Rr3kpbRymqJAAAOH20RtADFURuK18H1MdgGkCyZVdo02ydN2t Xgd4fHnoKffvsUAkOPEotGwAgHAqJE/kHlUXoE9vxWJONQOemUByoXu0UHrXCSTwXMpwMtZeWbqu 9bipx8K1adkAAOFUSFYmuiID1KlYwGUEkgXufSbN0raMQALbcYsxK87A4Z60bACAcCokKzdWPbnG YFigzy3aK6oSbIlA0uHe4zbmtGwEEqBkPAtrJJAwSliBNl/KcD0CyUqloHCLygrQZ2zfycNKGVzm BhnBhy0QSC50jzNpauvuFUiEFWhbS1Bw1VjWQCDhjBACfZwWC9cjkDywsSrI0nW1+yoksExvdWGs ZZPmlwYaQYhnIZA0LP0ivuaZNFGBRAiBPmuskCw9y6a0xs/OYxNInlwtnJT3BRKI4YscPgkkD6QV Hmrr8tuxdeXza/edgQPLXBooTqfTWcump4VjICrPSCBZYOlv2UyFgLFqxtJAcmmFRCCBtrnjRMr7 jxAe/JYNj0Ig2YA8mOTLavNT64Dr8AUPXwkkwXrbNPlUW1d7rbntnLFtAcaNtVxqy1K7ZqxlM7as fO38dVvr4JEJJL97xAucXSuQjD1maluAPnMCSS1YPCIXVOOeBJInMRZWLgkkwgm03eqL1xc6WySQ PJBW1aN2f866JZUVYJ4lrZd8ys+4yds5c9bl7wFrI5DcwZy2TGu+N3RcO5AIJ9A21ZZJtz2BpFx+ z22HRyCQrFQrjMwNK+l+7bacB76aE0hq1Ywl7wPPSiC5s6kBqK35OaEjn47HY/f4knIby/nafdiS udcaqVVA8nUvLy9dVZGyTXOt7YdHsslAcumXau8X9tw2yZxA0jvlgWSqnTP388HWXBJIWm2Z2uNa z400Zxtqx4lH+Aw8tk0GkjW6NJhMTbX3SvNA3dT1QaaCxdL9y5c7z0ggeTDXqILk98cqJGPtnHx7 yu2DreqpkIy1ZfLl+ZiSWvvm5eWluR3H47EacgQV1kwgabjki7e3LVNb1xs6lgaS1uOmthM413Mm TR46xlo4+fxUO2csrFz6WXrlxwZBiGsQSFaqt3LSCiRlaEmvmb92vgw4NxZIUsXjdDqdVT/yx6dw MVaN9IXPFggkgcZaKL0Vkjx0lLe1Zb3tHIEEpo1VNlJb5eXl5ct8fjsMn2fQpNt8XQortRbNVPUk f01YA4Gkw9hfLrV1vS2b3nbNWEAZCyRT68rXKrel9vmAT2OBJAWL4/H4pVpS3uYBpLzNXys3tl/e a58VdLg2gWQFygDU26bpmZ8bSAQUtqw1qLUWSPKxIyl4pNvytfKKyFjrtKyqwDMRSAKMtUnGxnm0 qiP51FreUz0pp7RtQN1Y+yRvz6T9LLVvXl5ePpbnIaW8PwzDl+e02kC51j4rwPDoBJLfXfrFO/ZX zVjwaC0fCyZTwWNsKp83N5AIKGxZT4WkFkjSlIJFa19vnT1TG1PSMxj2Wp9zSvmewg9LCCQrMWds SWs6HA6jlRWBBMbNDSRl+Jj6ok7tnbE/XGrbAc9AIAk21ZJpVTDKoFELH1Pret5HIIFPtUAyVhnJ g8nr6+uXcSRpWW0fK5flwWYYho9T9ctBtGldbZwKPDqBZKGpMRat1s3SqbdNUwaRPHyMhRSBBKbN DST5lIJICiGt1m7rvfLl5eDX8vlz99PyvbRgiCCQrMglrZqpsFKOTxFI4NxUIEnho6yMtMJD63Tf Vuump+0DayWQ3NklFZEyfLQqHofD4cvUWlZ7bq2FVG4/bFUrkORXYs2rIq+vr1/OkEnhJK+SvL6+ Nl8/399SSEntmmH4egZOT4VEmOGRCSQNYzt3bWevDTyrLb+0bdNTBemZ8sdOtW+mPjtsxVQgKds0 KYTUzqzJg0huqnpSvlZ6Tk8gyV87r7ZMtWim9ntBh2sQSFZiaWCphZH39/ezda2zbvK/xtJ2wFaV X7ytykg5VmTsdN7aNLWvwzMSSIL1BozWulbV4/39/Ww+X5bfLyssKiRQN1UhSdWQ19fX4XA4DK+v r8N+v/8IJ7X9qmzL1N6zDCll26b1mioXrIlAslBrkFqrjHrLds1UNaQMJK2AkgcTFRI4N1UhyQNJ Gj9SCyKtFsnYdU3KS82PVU5a77N0/xVsuAeBZEUuCS89AeV4PH60cwQSODcVSPb7/cfYkVYASY9P +2aaH7uCq3YNWyCQPJCpSkgrdLQGrqbwUZt+/PhRbevUxpOU2whbVQsk+ZS3adKA1uPxOLy9vU2+ bq0KkoedfN9vVSzyXw6GtRFIbqQ1Cv7WbZup1k0KInkgKasmAgnUTQWSNF7keDx+hJKxKkkZOlLY SFWTcj49t7eS0tuyEWJ4BALJCvQGm96AMlY5yc/AEUjgq1YgSWNHUhApg0Hr9ODa/jrWuhmG+qXl 4RkIJIFqISNfVw6GGzvbphVEyrZMqoy8v78P379/P1tWO/Omts2wRbVAUp5ZU7Y+8+e1LqRW7rut cSVpXTmf5I8trzUCj26TgWTpl+pUGbQ18OxarZqeANIzluTHjx9nU21ciUACX7UCSZrKn2MoA0Ee RGqXms9vy3BSa+WMVVBqx6uybdRaXm5363ktjhMssclA8izmjjkZCyp5OCnPvEnvld/CFtWumlpe ayR/bH5tknzQa2uweqtNA1sgkDyYuRWTclntQmdjrZsfP34M379/P6uY5I8ttw+2qqwOpCDy/v4+ vL29VceO5JWPtE/lY08Oh8PHuvK3afJ9u+e0YO0Z1kwgWaisGIy1acrnlOsvbeUsHcyaB5AUStJt ftbN2OeELSkrJCmQ5GfU5GGkdkn5PHzUKiZzBrn2VFfyoFLOl58rf8zcNg1cSiB5QktaOHlASYNd 09TqR8PWlINTD4fDRxjJl+cDXMeuJ6Q1A58EkhXpDRrluvLAWF6lNa+U/Prrr19CyY8fP87eG7aq vIDZ29vbsN/vh2/fvn1UFvKqSGrn5FWQtD/mP743tR/b/9gCgeQOpsqpU4+7VitnalDr9+/fv0wp pDggwm/Ki5kdDocvY0fyH9lL036/H/1l7d7BrXPaNMPwtfVSLk+fBR6JQLIxPUEmr5x8//79yynH AglbVg5STcvyCkhPWADOCSRPaG41pdXSSZWSv/zlL8Nf//rX4U9/+tPZdUlgS15eXob//e9/w9/+ 9rfhn//858eyNI6k3J+WVDZgqwSSQHnbZu4B6drtnPIU4VQd+fXXX4effvpp+Ne//jX88ssvDpxs 2m63G/74xz8OP/300/CPf/xjGIbhrC0zto9d2obpkZ7jSq2sjUDCpP/+978ffXLYstPpNPzyyy8f g72B63mJ3gAem5IyfGWfgNsQSFbiHv1mPW2Yz74J1yGQAADhBBIAIJxAAgCEE0gAgHACCQAQTiAB AMIJJABAOIEEAAgnkAAA4QQSACCcQAIAhBNIAIBwAgkAEE4gAQDCCSQAQDiBBAAIJ5AAAOEEEgAg nEACAIQTSACAcAIJABBOIAEAwgkkAEA4gQQACCeQAADhBBIAIJxAAgCEE0gAgHACCQAQTiABAMIJ JABAOIEEAAgnkAAA4QQSACCcQAIAhBNIAIBwAgkAEE4gAQDCCSQAQDiBBAAIJ5AAAOEEEgAgnEAC AIQTSACAcAIJABBOIAEAwgkkAEA4gQQACCeQAADhBBIAIJxAAgCEE0gAgHACCQAQTiABAMIJJABA OIEEAAgnkAAA4QQSACCcQAIAhBNIAIBwAgkAEE4gAQDCCSQAQDiBBAAIJ5AAAOEEEgAgnEACAIQT SACAcAIJABBOIAEAwgkkAEA4gQQACCeQAADhBBIAIJxAAgCEE0gAgHACCQAQTiABAMIJJABAOIEE AAgnkAAA4QQSACCcQAIAhBNIAIBwAgkAEE4gAQDCCSQAQDiBBAAIJ5AAAOEEEgAgnEACAIQTSACA cAIJABBOIAEAwgkkAEA4gQQACCeQAADhBBIAIJxAAgCEE0gAgHACCQAQTiABAMIJJABAOIEEAAgn kAAA4QQSACCcQAIAhBNIAIBwAgkAEE4gAQDCCSQAQDiBBAAIJ5AAAOEEEgAgnEACAIQTSACAcAIJ ABBOIAEAwgkkAEA4gQQACCeQAADhBBIAIJxAAgCEE0gAgHACCQAQTiABAMIJJABAOIEEAAgnkAAA 4QQSACCcQAIAhBNIAIBwAgkAEE4gAQDCCSQAQDiBBAAIJ5AAAOEEEgAgnEACAIQTSACAcAIJABBO IFmJ3W73Zbrne5xOp5u8H6xVvk9E7pvwTAQSRu12u+Hnn38e3t/fozcFHsL7+/vw888/CwZwZfvo DeDx/f3vfx/+/Oc/D29vb9GbAuF+/Pgx/Oc//4neDHg6Akmg3W43nE6nRWXYsoTbO728vDSn19fX 4fX1ddjv98Pb29twOByGYfjtL8J///vfw+Fw0L5h03a73cc+8oc//GH49u3b8Pb2Nuz3+4/9Z2wf W7rfzt3G9BxVHNZEIHlCcwNKeSBNB9xv374NwzAM+/1+OJ1Ow/F4FEjYtLTPpNtv3759hJEy2M8N ILB1AsnG9FRPUiBJ4eN0On2ZYKvKfSavjvRUQYA2geQOauXTvF2TvuSXlnN72zLpL7e8NXM4HIbD 4TC8vb19VEHS66THDcMgkMAwnIWLFEhS6yZv4aSp3O+u3c5phZ78uCMcsQYCyYr0BpDelsz7+/uw 3++H4/H40Y5JIenl5eVjfR5EBBK2rPySz4NHCiNpSmGkt6XTG1DgWQkkT6g3uJTVkjx45OuHYRBI YDivduahowwirYqIoAF1AslC+QGkbL3U1qdlZXsmn79Wa6YMHMfj8eOgmaohZVUk346Xl5ePdk55 /RGBhC0rg0MePvLqSFkpWdLCuWYrp7b9rTBUHpfgXgSSBzMniOTjPfIQkgLI4XD4uJ/CSF4Nyc+a yV//9fV1eH9//xhbMgwqJDAM5xWSvAVaCyWpcpIHkfIU4fK21cqZEzxgjQSSFZtbQckrJimklANV d7vdR5A5HA7D8Xj88p4CCVtWfunXWp9zB7UKGfCbTQaS2k7e80Vba8Ok5alt01o/Nl8efGrBIgWH NJ/fpvnX19cvlY+yLZOW5dtYq7CkICKQwFetQJJXStKUV0h6Wje9F1a7Viun/FzlMai2fum/E/TY ZCB5FHmQSVNtPEd+5kv5+DyQ1CoieRCpnS1TG+CahxGBBD7VAkkeSsrQUQsoZetmzviRfFk+n2/f WLCARyaQrMBY9WSsRVOOK6kFk9bYlHzKCSRsWSuQpCk/66Y2f+n1SNI2CBo8I4HkRloHjFopNN32 jAkZhuFLy6Y2n1dGahc0y98zPxDmg2AFEjg3FUhqA1d7xpX0nG1zzbNuhBsekUDyQPLQUcovWlaO K0nXCskfNxUc0mukU3tTZeT9/f1LFUUggU+1QJLvk/v9/uzMm7JSsmQsSU8lND0O1kogWZHev3xq 40pS1SR/rfw1UyBJtwIJnJsKJPkA17JaMvWLwEsGo8IzEUgWWnpgGGvZ5Mta7ZphOP+xu9pg1TI4 1AJIfhDNz6ypjTXJ3xu2qrb/5vtT7doiZRWkFlDmtm5u0bIp52ufF25JIAk2FkjKEFIGlFo4yNs3 rdfMqyjpx/XKsSMqJHBuqkJSG0+Sn4FTho/aZeZr4aRVBe0ZBAtrIZCsRG+rpqya5AElV17ltQwj KiRwbqpC0golZdC4tHUDz0ggaZja6VstkXL9bvf1ommt161VM/L5vGLSas+MvXY5pfEitTAikEDd VCApQ0keOmphZEnL5prtmvJzTB1Dxv4t4FICyZ31BpJ8kGmSqhr5slYQSut2u98uBV8eLNN4kXwQ a+3KrgIJfGoFknL/yudbv1lT+z2bWmWlDCLlMgNieRYCyYpMtWuGYbp6UlZeWm0agQTOTQWSqfZN LXzMrYLAsxJIFhqrTNTWz3m9WnhoDWIde+9a2ydVWWpBRCCBcXMDSa1SsjSk3KplUztWja2DWxFI gqUdPrVO0nxZ4UjryopI/jqtg2UKH6lFU44bGQsiAgl8ao2jaAWTWpgYCx+9A13HWjb5fVgTgWQl ygNfPl9r3bTUTh8WSKDP3EDSGvNxafUDnpFA8rupFszc519jG1rVk7Htmxpnkl+NtadVI4BA25xA Mja+ZCqwlJWP3vDS2rZy2/PHXfLvAJcQSAK0dt5yeWrdpBCRz5dn4OTtmfx+HkTy56bleSAZhvPf wlEhgU89FZJ0v3ZmTM/8VJCZE0rybYNHJ5CswG63mzxbJs3XKij5c/MLouU/2NcbSIBPcwJJ63bO 6bvl+8IzEUg63GvnH3ufVvUkqZ3umweP8jYfO1IOohVIoM9YIKlVMnoqHrWwsnTKt6U2X/sMtc9X zsMtCCSB8pAwDJ8hY2w8R/kbM3lFpAwd6TFlEKm1gdLj8vfJlwHnxr7oe9orvWfLjK2bCiOwFgLJ So395ZIfEIeh/uvAqX2TByKBBOaZqjxMhYc5g1Ph2QkkDflBIOKMm9Kc6kl+f2xdqpq0ru5aztfu w5b0tDTGAkm+/BpVkN4KSU/L5tJ/C7iUQPJgygNc2aKpKcNK/rx8vlYlaV2NVYUEpk2Nv5ialoaO VsiBNRNIVuJaf8W0AkpOhQTqeiok+f1W1eLSCZ7RJgNJbYee80X7CAeEscrHVPsmXyaQQL9LAkn+ mCVjSHrW1eZr71tbN/X5Lvl3gh6bDCSRLtlRyxDS87jac1qn9vaMIQE+1b7MWyFgTrCYE07y+7X5 cjvhUQkkK7XkAJPCSR5ShkEggaXmBJLasjlhBZ6dQHIH9zig1EJGq32Try+X5bdAv2sGkvIxS9bV tqWch0cikDyQ8qDRarksWddTBVEhgXl6KiStdbVQcek6WDOB5Enc6mDkIAd9rhlIYIsEkt+VB4G8 MjBn3SNK1ZJhmF8hAfrMDSTp9pJWz9z3K+en1rUeN2cd9BJIguU7chkEageOuWNByjNy0mv2ntor nEDb0i/6nmDRu662TQICaySQbICDE9zGJYEE+EogWWCsqtF6XJRaRaS8r0ICy1wjkFyrQtKzrrYt Yx7hGMZ2CCQPZOlYlTJ01No519omoG5JILlkLEjrMbBWAsmTc5CC+9CygcsIJA29bZk5z1vLQWjp Z4et6T3zZEnL5hrr5m7nHGs5nrEeAskDu/RAsXScyNpOa4ZHcOkYkrF1PaED1k4g4YwKCfQRCuB6 BJILzRmIusbKw1q2Ex7NvSskLnDG2gkkKzX3wDEWjsaqICok0LZ0DMnYa2jLsFUCCaMcEAG4B4Gk w1h1YeyxY2fZrPUMHKDPLSoktziTpvfY4xjFrQkkK3eNg8ScwAXUXSsQ+OJnq16iNwAAQIVkgaW/ ZfNsZ+AAn+5RIbn3mTSORdyTQLIyxrPAOhi3AfNo2QAA4VRILnTvioVqBqzDLVoqzqThmQkkT8SY FXhMro4K07RsAIBwKiRXdoszcIB1u/dZL86kYY0Eko3yi75wW77oYR4tGwAg3O7kz+NhGO5TJVj6 Hr3Pu/XrA/2WVkhufUbMPSo3qkMsoUICAIQTSACAcFo2Dbf+Z4lur/hvh/u5VgvjUds0WjRcgwoJ ABBOIAEAwmnZdHjkM3Du/ZrAdd2i3eFMGtZIhQQACCeQAADhtGwWuPc/2bO/HzyDe7cwnv392B4V EgAgnEACAIQTSACAcMaQAADhVEgAgHACCQAQTiABAMIJJABAOIEEAAgnkAAA4QQSACCcQAIAhBNI AIBwAgkAEE4gAQDCCSQAQDiBBAAIJ5AAAOEEEgAgnEACAIQTSACAcAIJABBOIAEAwgkkAEA4gQQA CCeQAADhBBIAIJxAAgCEE0gAgHACCQAQTiABAMIJJABAOIEEAAgnkAAA4QQSACCcQAIAhBNIAIBw AgkAEE4gAQDCCSQAQDiBBAAIJ5AAAOEEEgAgnEACAIQTSACAcAIJABBOIAEAwgkkAEA4gQQACCeQ AADhBBIAIJxAAgCEE0gAgHACCQAQTiABAMIJJABAOIEEAAgnkAAA4QQSACCcQAIAhBNIAIBwAgkA EE4gAQDCCSQAQDiBBAAIJ5AAAOEEEgAgnEACAIQTSACAcAIJABBOIAEAwv0fyxFttYm/kpwAAAAA SUVORK5CYII= "
         id="image7954"
         x="1128.6367"
         y="35.500729"
         clip-path="url(#clipPath8064)"
         transform="translate(769.77073,-14.723691)" /><image
         width="145.52083"
         height="103.1875"
         preserveAspectRatio="none"
         xlink:href="data:image/png;base64,iVBORw0KGgoAAAANSUhEUgAAAiYAAAGGCAYAAABPOko1AAAABHNCSVQICAgIfAhkiAAAEPVJREFU eJzt3c9OG1cfx+HjfxjUrCr1Gt776MX3ArrvppvuKkUNAYLteRfomMMwYxuHhK/t55EsAwFDlcz0 w++csSdd13UFACDA9KN/AACASpgAADGECQAQQ5gAADGECQAQQ5gAADGECQAQQ5gAADGECQAQQ5gA ADGECQAQQ5gAADGECQAQQ5gAADGECQAQQ5gAADGECQAQQ5gAADGECQAQQ5gAADGECQAQQ5gAADGE CQAQQ5gAADGECQAQQ5gAADGECQAQQ5gAADGECQAQQ5gAADGECQAQQ5gAADGECQAQQ5gAADGECQAQ Q5gAADGECQAQQ5gAADGECQAQQ5gAADGECQAQY/7RPwA/Xtd1EY8BvM1kMol4DPiZTEwAgBjCBACI MenM6M/SsX+t+77OPxf48fYtvxy7PGNZh1NgYgIAxLD59cwcM9EY+5qhj5uYwMdopx3tcfiWKUj9 OpMTkgkT3oVggbcTCPCaMLlg+yYib5mYCBP4eYamJyKHcyFMOMgxEQMcTmzAE5tfAYAYJiYn7L02 uo5NPnZNRLqus6wDR9i1ifWYCUn9mrdsiO0foyYzJBEmvEk9oQkT+HGEApdMmFyAfQHxlonJWJjY bwKHaaPjPQPkPS4nhgTChFeG4mNfmAx9PbDb2FLO2H3/bThHwuRMHRINYxOTY8Jk3+PCpfuZkWF6 wikTJmzV2BgLk33vt48DDBsKkzot6b9/6OPAOREmF+Ct+0aG3j8mTAQKPNs1MRkLk2Ov1Bn6vnAq hMmFO3Qqstls9oZK+5j9j8GlOzRM2tt0ethTTYkPzokwYdBYhOwLlPq17T0wHia7gsTzjXCJhMmZ OSQG9i3VjAVJvY2FytDjA092hcl0On0RJl3XbeNkLF7Glnl2xUs9JgUOyYTJhds3Falv77sfm54A Lw3FRdd1LwKllOdjsx8uQ8s7QoNzIkzO1K4Nr4dMTIYCpH9rPy5M4DBDyzY1POrb/YlJva9/1nfo MSdgOAXC5EIdGiP1fr1eb+/bIKnvDy3rCBR41t/o2k5BZrPZNjo2m02ZzWbb42c6nZbNZrO9r4/R Tk4s0XBOhMkJe8v/+N+6r6Q/HWnDpP1YfV+YwG5jYVKDo8ZJf+NrOz1pJyZjU9Gh79lnUy3JhMkF G4uVoSjp3/ph0k5ShAm81l+SaScl9VibTqfbaclsNtv5OO2UpO5FgXMgTM7M2G9T+yYmY3tJ2hhZ rVaD7/cnKfaawGtD+0pqmMxmszKfz7dRsuvYaacsYxOUQ34WSCVMLtChSzj9CKm3off7kxNhAi+1 YdIGSY2SzWazvd8XJv0rd+rb9c/hlAkTtsYiZShOHh8fX9wLE9htLExqjPT3aA1dvdMeWwKEcyVM zlw/Eg7d7NpGST9I2tu3b99eTVKECbzWRkZdtpnP5zvDpP269oqc9s/6E5Oh407EcEqEyYU7ZBmn BkcbJA8PD+Xbt2+vQmVoEyzwetPrYrHY3upx1//8/mXF7cdrlJiecG6EyQU55lLh/jJOnZLUMHl4 eNh+rMZJ13XbQAGe1CCZTCbbILm6uiqr1Wob8v0rd9rbZrMZXNIZmorWx4BTJEwu3K6rc8b2ltQo ub+/Lw8PD68ipQ0b4EkbGYvFoiyXy7JarcpyuXy1r6QfJf1A6ccJnBNhcoYO2VPyHhOTh4eHcnd3 Vx4eHl5ESnv5MPCkvTy4Rkl7nLQbY9vNsev1usxmsxfPdXLIxGSMSQrphMkF2xUv/Wd7Xa/Xr/aT 1CC5u7srd3d35f7+vtzf329DRpjAs+l0ut30Wq9mqxPK/qXD9e32GGyf4+StMQKnRJhciO+dmIxN TWqY3N7ebgOlXfoBntQrcObz+XZaUsrz3pMaJIvF4tWTGbYTk13HbikvI8V0hFMkTCilHHYZcf8K nRonNUhub2/Lly9fXkxVgCf9q3BKeV7eqRthF4vFiycs3BcjcI6ECa/sCpT+pcP9qcl///1XHh4e yq+//lp+//33cnNz4wTKRZtMJuXu7q788ccf5d9//y3L5XK7wbVGyXK5fPVkhWNBAudOmJyJoTHu 0Mns2E2x+15Lp42U29vb8r///a/89ddf5f7+3smUizaZTMr19XX57bffyt9//126rivL5bJcX18P TkeGXq370Fv/Bf2GlnUs9ZBOmLDXIZtj26Wdr1+/ltvb27JYLEQJF6/runJ/f18eHx/L169fy3w+ 3z7vT/9FME1IoJTpR/8AfKxjLifetwelPsmakyo8qcdDjZFD95AceoNzIkwAgBjChHfnNzgY5tiA /YQJABBDmAAAMYQJABBDmAAAMYQJABBDmAAAMYQJABBDmAAAMYQJABBDmAAAMYQJABBDmAAAMYQJ ABBDmAAAMYQJABBDmAAAMYQJABBDmAAAMYQJABBDmAAAMYQJABBDmAAAMYQJABBDmAAAMYQJABBD mAAAMYQJABBDmAAAMYQJABBDmAAAMYQJABBDmAAAMYQJABBDmAAAMYQJABBDmAAAMYQJABBDmAAA MYQJABBDmAAAMYQJABBDmAAAMYQJABBDmAAAMYQJABBDmAAAMYQJABBDmAAAMYQJABBDmAAAMYQJ ABBDmAAAMYQJABBDmAAAMYQJABBDmAAAMYQJABBDmAAAMYQJABBDmAAAMYQJABBDmAAAMYQJABBD mAAAMYQJABBDmAAAMYQJABBDmAAAMYQJABBDmAAAMYQJABBDmAAAMYQJABBDmAAAMYQJABBDmAAA MYQJABBDmAAAMYQJABBDmAAAMYQJABBDmAAAMYQJABBDmAAAMYQJABBDmAAAMYQJABBDmAAAMYQJ ABBDmAAAMYQJABBDmAAAMYQJABBDmAAAMYQJABBDmAAAMYQJABBDmAAAMYQJABBDmAAAMYQJABBD mAAAMYQJABBDmAAAMYQJABBDmAAAMYQJABBDmAAAMYQJABBDmAAAMYQJABBDmAAAMYQJABBDmAAA MYQJABBDmAAAMYQJABBDmAAAMYQJABBDmAAAMYQJABBDmAAAMYQJABBDmAAAMYQJABBDmAAAMYQJ ABBDmAAAMYQJABBDmAAAMYQJABBDmAAAMYQJABBDmAAAMYQJABBDmAAAMYQJABBDmAAAMYQJABBD mAAAMYQJP0TXdR/9I0AUxwQcRpjw7iaTSfn8+XNZrVYf/aNAhNVqVT5//lwmk8lH/ygQb/7RPwDn ZzKZlD///LN8+vSpLJfLj/5x4MM9PDyUL1++lJubm4/+USCeMLlwk8nku27T6XR7m81mZTablcVi Ub5+/Vr++eefj/7PgxifPn0qi8Vie5y0x873HodwToQJe40FST251hi5uroqy+WyrNfrMplMTEug cXNzU25ubspyuSxXV1fbSGmPJdEBwuRstCewuslu7GNd1x01GelPSPpTkuVyWa6vr8tkMimLxcLY GhptvC+Xy9HpSXusHTM5aY/7ocARPKQTJryya8lmNpuV+XxeFovFNkYeHx/Ler0um82mdF1Xrq+v y+PjY3l8fPzo/xSIUY+ZxWJRfvnll3Jzc1Our6+3kbJYLMp8Pn8RKiYoXCJhQillfK/J0HSkhkm7 dLPZbEoppUyn07JarbY34Ml8Pt/e6rJOf2mnhsmhe1DgHAmTC9Ef5db7Q2OkBkmNkvV6XVarVVmv 19tlovo59c9qrABP0V7D4/r6ulxfX7+YmrRx0gbK92yUhVMkTC7YrkCpUbJer1/sI2mDZLlcls1m s/38Gi2bzebFFAUoLza51n0mNUra5Zx6a6Nk3+ZYEcI5ESZnaN9J6piJyXw+L5vNZhsnXddtJyXt 3pOrq6uy2Wy2N+BJe1zV/VntZthdU5P3uLS4FAHDaRAmF24oSjabzTY2NpvNNkrqrY2SyWTyYt/J 4+Nj6bruxRIP8Hys1KvW6j6tfqS0YdKPk7GrdeCcCJML0v+tadfEpOu6wTipsVEvOa5LOPP5fHt1 Ttd1Lz4XKC+ioi6Ntrerq6t3nZjAqRImF24oSNr4aCOjHxr9S4ivrq7KarXafq4wgWftsVajowZI DZL21t8AuytQ4JwIkzM3dNIampxMp0+v5zi0d6QNlfr57V6Uuhm2bnoVJvBaGxLtpta6DNre95dy +k/Adsj0pP2ecEqECVtjSzo1TsbCpF4iLExg3FiYtJOTdpLSn5JYquFSCJMLNLbXpJSyjZFdX9u/ aqe9PLhd9hEm8Gzoyrf+5KT/vEHHPJcJnDphcmbecmLqL+XUq3H2hUl7Yu1PSvobZIEn/eNtaHLS f1LD73ktnfq92nOCcOEUCJMLNpk8v6Bffb+Ust1vMvT5/Yipb7dX7QgTeK0fC21g9AOk/8Rqu6Yl 7WPDORAmJ2zoZDQWA2MnrqHfptrNsEMnv36YjF29I0zg2ViYtJOToUnKsa82fMjPAomEyYUa+k2r Xcap4VHv6+dOJpMXT0NfP6fdVyJIYNzQJvM2PnYt23hRPy6BMDlTh56kxi4nbiNl6GqcGiNDUSJM YNxQUAwFyND9IVMS+0o4dcLkwg2dtNrlmXYfSn3tm/7H+zFiKQdeG5pSDi3r9Ccn37tsA6dGmJyZ epLad2XN0MeGJh9Dz1/Sfrz/bLHt9xYm8GxXmOyboBwyITkkUEQMp0CYMKh/Ams3vg5FizCB3cbC pN6bjMATYXLhDj3Zjb2OjjCBwxwaJv33901IBAvnRphcgO89cfWXb0o5LEyA194aJu37Y3829rhw ioQJW/tOZjVQSimj+0ratwUKPNsXELtiY9dVN3BuhMmZak9cbSD8qBPa2PcDXho7Bo8Nk31LOiKG UyNMeGXopNefguyamADjjpmY9N+GcyZMLsDPmJ6YmMBhjpmYHPr2vu8Bp0CY8CZOePB9DgkTuGST zq+3Z+Utf51Dn7tvQ+shnwsc5i2Tj/eckgggkg2/vj0AwAewlMNB+ptg248Bx3ElDbwmTC6Y2ICP 9ZYwETFcCmHCu3ByBOA92Px6po79a933df65wI93yLMw/4jHhQQ2vwIAMUxMLsB7/BX7ZwI/33tM OExJODUmJgBADGECAMQQJgBADHtMAIAYJiYAQAxhAgDEECYAQAxhAgDEECYAQAxhAgDEECYAQAxh AgDEECYAQAxhAgDEECYAQAxhAgDEECYAQAxhAgDEECYAQAxhAgDEECYAQAxhAgDEECYAQAxhAgDE ECYAQAxhAgDEECYAQAxhAgDEECYAQAxhAgDEECYAQAxhAgDEECYAQAxhAgDEECYAQAxhAgDEECYA QAxhAgDEECYAQAxhAgDEECYAQAxhAgDEECYAQAxhAgDEECYAQAxhAgDEECYAQAxhAgDEECYAQAxh AgDEECYAQAxhAgDEECYAQAxhAgDEECYAQAxhAgDEECYAQAxhAgDEECYAQAxhAgDEECYAQAxhAgDE ECYAQAxhAgDEECYAQAxhAgDEECYAQAxhAgDEECYAQAxhAgDEECYAQAxhAgDEECYAQAxhAgDEECYA QAxhAgDEECYAQAxhAgDEECYAQAxhAgDEECYAQAxhAgDEECYAQAxhAgDEECYAQAxhAgDEECYAQAxh AgDEECYAQAxhAgDEECYAQAxhAgDEECYAQAxhAgDEECYAQAxhAgDEECYAQAxhAgDEECYAQAxhAgDE ECYAQAxhAgDEECYAQAxhAgDEECYAQAxhAgDEECYAQAxhAgDEECYAQAxhAgDEECYAQAxhAgDEECYA QAxhAgDEECYAQAxhAgDEECYAQAxhAgDEECYAQAxhAgDEECYAQAxhAgDEECYAQAxhAgDEECYAQAxh AgDE+D+l/ymEBCy0nAAAAABJRU5ErkJggg== "
         id="image8900"
         x="1034.313"
         y="42.608383"
         clip-path="url(#clipPath9119)"
         transform="translate(769.77073,-14.723691)" /><text
         xml:space="preserve"
         style="font-weight:bold;font-size:4.93532px;font-family:sans-serif;-inkscape-font-specification:'sans-serif Bold';text-align:end;text-anchor:end;fill:#e4e4e4;fill-opacity:1;stroke:none;stroke-width:0.396588;stroke-linejoin:bevel;stroke-dasharray:none;stroke-opacity:1"
         x="1897.0149"
         y="107.65083"
         id="text8997-9-9-4-9"
         transform="scale(0.99927722,1.0007233)"><tspan
           sodipodi:role="line"
           style="font-style:normal;font-variant:normal;font-weight:bold;font-stretch:normal;font-size:4.93532px;font-family:'Fira Code';-inkscape-font-specification:'Fira Code Bold';fill:#1a1a1a;stroke-width:0.396588"
           x="1897.0149"
           y="107.65083"
           id="tspan7679-9">blur_radius: 25.0</tspan><tspan
           sodipodi:role="line"
           style="font-style:normal;font-variant:normal;font-weight:bold;font-stretch:normal;font-size:4.93532px;font-family:'Fira Code';-inkscape-font-specification:'Fira Code Bold';fill:#1a1a1a;stroke-width:0.396588"
           x="1897.0149"
           y="114.00422"
           id="tspan12511-7-6-2-7" /></text><text
         xml:space="preserve"
         style="font-weight:bold;font-size:4.93532px;font-family:sans-serif;-inkscape-font-specification:'sans-serif Bold';text-align:end;text-anchor:end;fill:#e4e4e4;fill-opacity:1;stroke:none;stroke-width:0.396588;stroke-linejoin:bevel;stroke-dasharray:none;stroke-opacity:1"
         x="1988.1193"
         y="107.65083"
         id="text8997-1-1-6-5"
         transform="scale(0.99927722,1.0007233)"><tspan
           sodipodi:role="line"
           style="font-style:normal;font-variant:normal;font-weight:bold;font-stretch:normal;font-size:4.93532px;font-family:'Fira Code';-inkscape-font-specification:'Fira Code Bold';fill:#1a1a1a;stroke-width:0.396588"
           x="1988.1193"
           y="107.65083"
           id="tspan9051-6-5-6-0">blur_radius: 50.0</tspan><tspan
           sodipodi:role="line"
           style="font-style:normal;font-variant:normal;font-weight:bold;font-stretch:normal;font-size:4.93532px;font-family:'Fira Code';-inkscape-font-specification:'Fira Code Bold';fill:#1a1a1a;stroke-width:0.396588"
           x="1988.1193"
           y="114.00422"
           id="tspan12511-0-8-0-3" /></text><path
         id="path6359-4"
         style="fill:#ff0000;stroke-width:0.0268653"
         d="m 1988.785,57.790221 -1.4403,2.316167 1.4403,2.31614 -5e-4,-1.91316 h 10.3491 v 1.91316 l 1.4403,-2.31614 -1.4403,-2.316179 v 1.913199 h -10.3486 z"
         sodipodi:nodetypes="ccccccccccc" /><text
         xml:space="preserve"
         style="font-weight:bold;font-size:5.64444px;font-family:sans-serif;-inkscape-font-specification:'sans-serif Bold';text-align:end;text-anchor:end;fill:#ff0000;stroke:none;stroke-width:0.396875;stroke-linejoin:bevel;stroke-dasharray:none;stroke-opacity:1"
         x="77.805771"
         y="-1992.4337"
         id="text5498-5-3-4-5"
         transform="rotate(90)"><tspan
           sodipodi:role="line"
           id="tspan5496-1-0-79-1"
           style="font-size:5.64444px;fill:#ff0000;stroke-width:0.396875"
           x="77.805771"
           y="-1992.4337">50px</tspan></text><path
         id="path6359-7-0"
         style="fill:#ff0000;stroke-width:0.0268653"
         d="m 1951.1633,46.514479 2.3162,1.44028 2.3161,-1.44028 -1.9131,4.6e-4 v -10.34906 h 1.9131 l -2.3161,-1.4403 -2.3162,1.4403 h 1.9132 v 10.3486 z"
         sodipodi:nodetypes="ccccccccccc" /><text
         xml:space="preserve"
         style="font-weight:bold;font-size:5.64444px;font-family:sans-serif;-inkscape-font-specification:'sans-serif Bold';text-align:end;text-anchor:end;fill:#ff0000;stroke:none;stroke-width:0.396875;stroke-linejoin:bevel;stroke-dasharray:none;stroke-opacity:1"
         x="1971.1788"
         y="42.865734"
         id="text5498-5-3-4-1-7"><tspan
           sodipodi:role="line"
           id="tspan5496-1-0-79-8-9"
           style="font-size:5.64444px;fill:#ff0000;stroke-width:0.396875"
           x="1971.1788"
           y="42.865734">50px</tspan></text><text
         xml:space="preserve"
         style="font-weight:bold;font-size:5.64444px;font-family:sans-serif;-inkscape-font-specification:'sans-serif Bold';text-align:end;text-anchor:end;fill:#ff0000;stroke:none;stroke-width:0.396875;stroke-linejoin:bevel;stroke-dasharray:none;stroke-opacity:1"
         x="78.546448"
         y="-1897.895"
         id="text5498-5-3-4-3-7"
         transform="rotate(90)"><tspan
           sodipodi:role="line"
           id="tspan5496-1-0-79-5-4"
           style="font-size:5.64444px;fill:#ff0000;stroke-width:0.396875"
           x="78.546448"
           y="-1897.895">25px</tspan></text><path
         id="path6359-5-2-1"
         style="fill:#ff0000;stroke-width:0.0189966"
         d="m 1897.5536,56.943469 -1.4403,2.31617 1.4403,2.31614 -5e-4,-1.91316 h 3.7345 v 1.91316 l 1.4403,-2.31614 -1.4403,-2.31618 v 1.9132 h -3.734 z"
         sodipodi:nodetypes="ccccccccccc" /><text
         xml:space="preserve"
         style="font-weight:bold;font-size:5.64444px;font-family:sans-serif;-inkscape-font-specification:'sans-serif Bold';text-align:end;text-anchor:end;fill:#ff0000;stroke:none;stroke-width:0.396875;stroke-linejoin:bevel;stroke-dasharray:none;stroke-opacity:1"
         x="1880.8026"
         y="46.50481"
         id="text5498-5-3-4-3-2-5"><tspan
           sodipodi:role="line"
           id="tspan5496-1-0-79-5-1-0"
           style="font-size:5.64444px;fill:#ff0000;stroke-width:0.396875"
           x="1880.8026"
           y="46.50481">25px</tspan></text><path
         id="path6359-5-2-8-5"
         style="fill:#ff0000;stroke-width:0.0189966"
         d="m 1859.1997,46.846299 2.3161,1.4403 2.3162,-1.4403 -1.9132,5e-4 v -3.7345 h 1.9132 l -2.3162,-1.4403 -2.3162,1.4403 h 1.9132 v 3.734 z"
         sodipodi:nodetypes="ccccccccccc" /><rect
         style="fill:none;stroke:#ff0000;stroke-width:0.625011;stroke-linejoin:bevel;stroke-dasharray:3.75006616,3.75006616;stroke-opacity:1;stroke-dashoffset:0"
         id="rect756-9-3"
         width="79.014572"
         height="65.917694"
         x="1921.9214"
         y="34.433186" /><rect
         style="fill:none;stroke:#ff0000;stroke-width:0.51086;stroke-linejoin:bevel;stroke-dasharray:3.06516016,3.06516016;stroke-opacity:1;stroke-dashoffset:0"
         id="rect756-9-3-3"
         width="65.899559"
         height="52.802681"
         x="1837.0151"
         y="41.360821" /></g></g><inkscape:templateinfo><inkscape:name>Padrão</inkscape:name><inkscape:date>2022-06-22</inkscape:date></inkscape:templateinfo></svg>
