{
    "package_folder": ".",
    "email": "cannatag@gmail.com",
    "status": "5 - Production/Stable",
    "package_name": "ldap3",
    "url": "https://github.com/cannatag/ldap3",
    "description": "A strictly RFC 4510 conforming LDAP V3 pure Python client library",
    "author": "Giovanni Cannata",
    "version": "2.9.1",
    "license": "LGPL v3"
}
