releasing package python-tornado4 version 4.5.3-3

5 jobs for debian/4.5.3-3 in 3 minutes and 10 seconds (queued for 1 second)
latest
Status Job ID Name Coverage
  Build
failed #113595
build

00:03:10

 
  Test
skipped #113598
autopkgtest
skipped #113597
lintian
skipped #113599
piuparts
skipped #113596
reprotest
 
Name Stage Failure
failed
build Build
make[1]: *** [debian/rules:18: override_dh_auto_test] Error 25
make[1]: Leaving directory '/tmp/building/package'
make: *** [debian/rules:11: build] Error 2
dpkg-buildpackage: error: debian/rules build subprocess returned exit status 2
+ cleanup
+ docker rm -f 68db7b422aae8bc306e783c4f5878a7151bfd1af3d4cdd17196801251ab1164f
68db7b422aae8bc306e783c4f5878a7151bfd1af3d4cdd17196801251ab1164f
gbp:error: 'docker-build.sh registry.salsa.debian.org/salsa-ci-team/images/dockerbuilder:unstable' failed: it exited with 1
ERROR: Job failed: exit code 1