/*
 (c) Copyright 2003, 2004, 2005
     Author: Ola Skavhaug and Ondrej Certik
     
     This file is part of swiginac.

     swiginac is free software; you can redistribute it and/or modify
     it under the terms of the GNU General Public License as published by
     the Free Software Foundation; either version 2 of the License, or
     (at your option) any later version.

     swiginac is distributed in the hope that it will be useful,
     but WITHOUT ANY WARRANTY; without even the implied warranty of
     MERCHANTABILITY or FITNESS FOR A PARTICULAR PURPOSE.  See the
     GNU General Public License for more details.

     You should have received a copy of the GNU General Public License
     along with swiginac; if not, write to the Free Software
     Foundation, Inc., 59 Temple Place, Suite 330, Boston, MA  02111-1307  USA
*/

class symbol : public basic
{
public:
    symbol();
    explicit symbol(const std::string & initname);
    explicit symbol(const std::string & initname, const std::string & texname);
    ex conjugate() const;
    ex real_part() const;
    ex imag_part() const;
};


class realsymbol : public symbol
{
  // constructors
public:
    realsymbol();
    explicit realsymbol(const std::string & initname);
    realsymbol(const std::string & initname, const std::string & texname);
    ex conjugate() const;
    ex real_part() const;
    ex imag_part() const;

};



// vim:ft=cpp:
