PP little_endian 4
num variables: 1

var 0: nz = 5, nt = 3
var 0 record 0
hdr offset: 187652
data offset: 187916
disk length: 46640
int hdr: [   1979       5       1       0       0     121    1979       5       2
       0       0     122     121    3648   11660     101       3     110
     106       0       0       2      56       0     128       8       0
     133 1390592   12288     900       5      50       0       0       0
       0    1111       1 1390592       0   15201       0       0       1]
real hdr: [  0.00000000e+00   0.00000000e+00   0.00000000e+00   0.00000000e+00
   0.00000000e+00  -9.90000000e+01   5.00000038e+01   0.00000000e+00
   0.00000000e+00   0.00000000e+00   3.80000000e+01   1.90000000e+02
   0.00000000e+00   2.37600002e+01  -4.39999998e-01   3.39019989e+02
   4.39999998e-01  -1.07374182e+09   1.00000000e+00]
data_type = real nwords = 11660
data: [ 1.94408166  1.99718308  2.04474235 ..., -4.75558281 -5.05577517
 -5.05779886]
-----------------------
var 0 record 1
hdr offset: 140740
data offset: 141004
disk length: 46640
int hdr: [   1979       5       1       0       0     121    1979       5       2
       0       0     122     121    3648   11660     101       3     110
     106       0       0       2      56       0     128       8       0
     133 1378304   12288     900       5     250       0       0       0
       0    1111       1 1378304       0   15201       0       0       1]
real hdr: [  0.00000000e+00   0.00000000e+00   0.00000000e+00   0.00000000e+00
   0.00000000e+00  -9.90000000e+01   2.50000015e+02   0.00000000e+00
   0.00000000e+00   0.00000000e+00   3.80000000e+01   1.90000000e+02
   0.00000000e+00   2.37600002e+01  -4.39999998e-01   3.39019989e+02
   4.39999998e-01  -1.07374182e+09   1.00000000e+00]
data_type = real nwords = 11660
data: [ 49.80299377  50.26750946  50.63897324 ...,  29.66181755  29.07848549
  29.01329231]
-----------------------
var 0 record 2
hdr offset: 93828
data offset: 94092
disk length: 46640
int hdr: [   1979       5       1       0       0     121    1979       5       2
       0       0     122     121    3648   11660     101       3     110
     106       0       0       2      56       0     128       8       0
     133 1366016   12288     900       5     500       0       0       0
       0    1111       1 1366016       0   15201       0       0       1]
real hdr: [  0.00000000e+00   0.00000000e+00   0.00000000e+00   0.00000000e+00
   0.00000000e+00  -9.90000000e+01   5.00000031e+02   0.00000000e+00
   0.00000000e+00   0.00000000e+00   3.80000000e+01   1.90000000e+02
   0.00000000e+00   2.37600002e+01  -4.39999998e-01   3.39019989e+02
   4.39999998e-01  -1.07374182e+09   1.00000000e+00]
data_type = real nwords = 11660
data: [ 25.3536129   24.78829956  24.53061676 ...,   1.71871078   1.51844108
   1.49270189]
-----------------------
var 0 record 3
hdr offset: 46916
data offset: 47180
disk length: 46640
int hdr: [   1979       5       1       0       0     121    1979       5       2
       0       0     122     121    3648   11660     101       3     110
     106       0       0       2      56       0     128       8       0
     133 1353728   12288     900       5     700       0       0       0
       0    1111       1 1353728       0   15201       0       0       1]
real hdr: [  0.00000000e+00   0.00000000e+00   0.00000000e+00   0.00000000e+00
   0.00000000e+00  -9.90000000e+01   7.00000061e+02   0.00000000e+00
   0.00000000e+00   0.00000000e+00   3.80000000e+01   1.90000000e+02
   0.00000000e+00   2.37600002e+01  -4.39999998e-01   3.39019989e+02
   4.39999998e-01  -1.07374182e+09   1.00000000e+00]
data_type = real nwords = 11660
data: [ 9.91138363  9.40522385  9.38437462 ..., -1.06550407 -1.1214056
 -1.12985194]
-----------------------
var 0 record 4
hdr offset: 4
data offset: 268
disk length: 46640
int hdr: [   1979       5       1       0       0     121    1979       5       2
       0       0     122     121    3648   11660     101       3     110
     106       0       0       2      56       0     128       8       0
     133 1341440   12288     900       5     850       0       0       0
       0    1111       1 1341440       0   15201       0       0       1]
real hdr: [  0.00000000e+00   0.00000000e+00   0.00000000e+00   0.00000000e+00
   0.00000000e+00  -9.90000000e+01   8.50000061e+02   0.00000000e+00
   0.00000000e+00   0.00000000e+00   3.80000000e+01   1.90000000e+02
   0.00000000e+00   2.37600002e+01  -4.39999998e-01   3.39019989e+02
   4.39999998e-01  -1.07374182e+09   1.00000000e+00]
data_type = real nwords = 11660
data: [-0.12850454  0.30537409  0.89345634 ..., -0.90012771 -1.02400351
 -1.02327657]
-----------------------
var 0 record 5
hdr offset: 422212
data offset: 422476
disk length: 46640
int hdr: [   1979       5       2       0       0     122    1979       5       3
       0       0     123     121    3672   11660     101       3     110
     106       0       0       2      56       0     128       8       0
     133 2902016   12288     900       5      50       0       0       0
       0    1111       1 2902016       0   15201       0       0       1]
real hdr: [  0.00000000e+00   0.00000000e+00   0.00000000e+00   0.00000000e+00
   0.00000000e+00  -9.90000000e+01   5.00000038e+01   0.00000000e+00
   0.00000000e+00   0.00000000e+00   3.80000000e+01   1.90000000e+02
   0.00000000e+00   2.37600002e+01  -4.39999998e-01   3.39019989e+02
   4.39999998e-01  -1.07374182e+09   1.00000000e+00]
data_type = real nwords = 11660
data: [ 1.12230837  1.13196766  1.14027655 ..., -3.34485221 -3.552737   -3.56620502]
-----------------------
var 0 record 6
hdr offset: 375300
data offset: 375564
disk length: 46640
int hdr: [   1979       5       2       0       0     122    1979       5       3
       0       0     123     121    3672   11660     101       3     110
     106       0       0       2      56       0     128       8       0
     133 2889728   12288     900       5     250       0       0       0
       0    1111       1 2889728       0   15201       0       0       1]
real hdr: [  0.00000000e+00   0.00000000e+00   0.00000000e+00   0.00000000e+00
   0.00000000e+00  -9.90000000e+01   2.50000015e+02   0.00000000e+00
   0.00000000e+00   0.00000000e+00   3.80000000e+01   1.90000000e+02
   0.00000000e+00   2.37600002e+01  -4.39999998e-01   3.39019989e+02
   4.39999998e-01  -1.07374182e+09   1.00000000e+00]
data_type = real nwords = 11660
data: [ 39.66373444  40.7345047   41.7251091  ...,  33.35466385  32.88820267
  32.86706543]
-----------------------
var 0 record 7
hdr offset: 328388
data offset: 328652
disk length: 46640
int hdr: [   1979       5       2       0       0     122    1979       5       3
       0       0     123     121    3672   11660     101       3     110
     106       0       0       2      56       0     128       8       0
     133 2877440   12288     900       5     500       0       0       0
       0    1111       1 2877440       0   15201       0       0       1]
real hdr: [  0.00000000e+00   0.00000000e+00   0.00000000e+00   0.00000000e+00
   0.00000000e+00  -9.90000000e+01   5.00000031e+02   0.00000000e+00
   0.00000000e+00   0.00000000e+00   3.80000000e+01   1.90000000e+02
   0.00000000e+00   2.37600002e+01  -4.39999998e-01   3.39019989e+02
   4.39999998e-01  -1.07374182e+09   1.00000000e+00]
data_type = real nwords = 11660
data: [ 25.3900795   25.5765686   25.8936615  ...,   3.75123811   3.2344563
   3.22648478]
-----------------------
var 0 record 8
hdr offset: 281476
data offset: 281740
disk length: 46640
int hdr: [   1979       5       2       0       0     122    1979       5       3
       0       0     123     121    3672   11660     101       3     110
     106       0       0       2      56       0     128       8       0
     133 2865152   12288     900       5     700       0       0       0
       0    1111       1 2865152       0   15201       0       0       1]
real hdr: [  0.00000000e+00   0.00000000e+00   0.00000000e+00   0.00000000e+00
   0.00000000e+00  -9.90000000e+01   7.00000061e+02   0.00000000e+00
   0.00000000e+00   0.00000000e+00   3.80000000e+01   1.90000000e+02
   0.00000000e+00   2.37600002e+01  -4.39999998e-01   3.39019989e+02
   4.39999998e-01  -1.07374182e+09   1.00000000e+00]
data_type = real nwords = 11660
data: [ 11.72118092  11.39163113  11.3867178  ...,   0.04169134  -0.12455849
  -0.12718374]
-----------------------
var 0 record 9
hdr offset: 234564
data offset: 234828
disk length: 46640
int hdr: [   1979       5       2       0       0     122    1979       5       3
       0       0     123     121    3672   11660     101       3     110
     106       0       0       2      56       0     128       8       0
     133 2852864   12288     900       5     850       0       0       0
       0    1111       1 2852864       0   15201       0       0       1]
real hdr: [  0.00000000e+00   0.00000000e+00   0.00000000e+00   0.00000000e+00
   0.00000000e+00  -9.90000000e+01   8.50000061e+02   0.00000000e+00
   0.00000000e+00   0.00000000e+00   3.80000000e+01   1.90000000e+02
   0.00000000e+00   2.37600002e+01  -4.39999998e-01   3.39019989e+02
   4.39999998e-01  -1.07374182e+09   1.00000000e+00]
data_type = real nwords = 11660
data: [ 2.93325782  3.36176467  3.92748976 ..., -1.49084044 -1.61046946
 -1.6003381 ]
-----------------------
var 0 record 10
hdr offset: 656772
data offset: 657036
disk length: 46640
int hdr: [   1979       5       3       0       0     123    1979       5       4
       0       0     124     121    3696   11660     101       3     110
     106       0       0       2      56       0     128       8       0
     133 4413440   12288     900       5      50       0       0       0
       0    1111       1 4413440       0   15201       0       0       1]
real hdr: [  0.00000000e+00   0.00000000e+00   0.00000000e+00   0.00000000e+00
   0.00000000e+00  -9.90000000e+01   5.00000038e+01   0.00000000e+00
   0.00000000e+00   0.00000000e+00   3.80000000e+01   1.90000000e+02
   0.00000000e+00   2.37600002e+01  -4.39999998e-01   3.39019989e+02
   4.39999998e-01  -1.07374182e+09   1.00000000e+00]
data_type = real nwords = 11660
data: [-0.70770234 -0.82124394 -0.92155576 ..., -1.15786588 -1.21203947
 -1.22635651]
-----------------------
var 0 record 11
hdr offset: 609860
data offset: 610124
disk length: 46640
int hdr: [   1979       5       3       0       0     123    1979       5       4
       0       0     124     121    3696   11660     101       3     110
     106       0       0       2      56       0     128       8       0
     133 4401152   12288     900       5     250       0       0       0
       0    1111       1 4401152       0   15201       0       0       1]
real hdr: [  0.00000000e+00   0.00000000e+00   0.00000000e+00   0.00000000e+00
   0.00000000e+00  -9.90000000e+01   2.50000015e+02   0.00000000e+00
   0.00000000e+00   0.00000000e+00   3.80000000e+01   1.90000000e+02
   0.00000000e+00   2.37600002e+01  -4.39999998e-01   3.39019989e+02
   4.39999998e-01  -1.07374182e+09   1.00000000e+00]
data_type = real nwords = 11660
data: [ 27.31070709  29.02667999  30.62471199 ...,  32.79201889  32.61489868
  32.60603714]
-----------------------
var 0 record 12
hdr offset: 562948
data offset: 563212
disk length: 46640
int hdr: [   1979       5       3       0       0     123    1979       5       4
       0       0     124     121    3696   11660     101       3     110
     106       0       0       2      56       0     128       8       0
     133 4388864   12288     900       5     500       0       0       0
       0    1111       1 4388864       0   15201       0       0       1]
real hdr: [  0.00000000e+00   0.00000000e+00   0.00000000e+00   0.00000000e+00
   0.00000000e+00  -9.90000000e+01   5.00000031e+02   0.00000000e+00
   0.00000000e+00   0.00000000e+00   3.80000000e+01   1.90000000e+02
   0.00000000e+00   2.37600002e+01  -4.39999998e-01   3.39019989e+02
   4.39999998e-01  -1.07374182e+09   1.00000000e+00]
data_type = real nwords = 11660
data: [ 21.56608963  22.70127678  23.89733124 ...,   2.47970223   2.33779645
   2.34782624]
-----------------------
var 0 record 13
hdr offset: 516036
data offset: 516300
disk length: 46640
int hdr: [   1979       5       3       0       0     123    1979       5       4
       0       0     124     121    3696   11660     101       3     110
     106       0       0       2      56       0     128       8       0
     133 4376576   12288     900       5     700       0       0       0
       0    1111       1 4376576       0   15201       0       0       1]
real hdr: [  0.00000000e+00   0.00000000e+00   0.00000000e+00   0.00000000e+00
   0.00000000e+00  -9.90000000e+01   7.00000061e+02   0.00000000e+00
   0.00000000e+00   0.00000000e+00   3.80000000e+01   1.90000000e+02
   0.00000000e+00   2.37600002e+01  -4.39999998e-01   3.39019989e+02
   4.39999998e-01  -1.07374182e+09   1.00000000e+00]
data_type = real nwords = 11660
data: [ 9.23853111  8.94081306  8.94977283 ..., -1.343063   -1.55235732
 -1.54391372]
-----------------------
var 0 record 14
hdr offset: 469124
data offset: 469388
disk length: 46640
int hdr: [   1979       5       3       0       0     123    1979       5       4
       0       0     124     121    3696   11660     101       3     110
     106       0       0       2      56       0     128       8       0
     133 4364288   12288     900       5     850       0       0       0
       0    1111       1 4364288       0   15201       0       0       1]
real hdr: [  0.00000000e+00   0.00000000e+00   0.00000000e+00   0.00000000e+00
   0.00000000e+00  -9.90000000e+01   8.50000061e+02   0.00000000e+00
   0.00000000e+00   0.00000000e+00   3.80000000e+01   1.90000000e+02
   0.00000000e+00   2.37600002e+01  -4.39999998e-01   3.39019989e+02
   4.39999998e-01  -1.07374182e+09   1.00000000e+00]
data_type = real nwords = 11660
data: [ 1.66281414  1.97502601  2.40246844 ..., -1.50481987 -1.87925422
 -1.85736954]
-----------------------
===============================
record read using saved file type and offsets:
int hdr: [   1979       5       1       0       0     121    1979       5       2
       0       0     122     121    3648   11660     101       3     110
     106       0       0       2      56       0     128       8       0
     133 1390592   12288     900       5      50       0       0       0
       0    1111       1 1390592       0   15201       0       0       1]
real hdr: [  0.00000000e+00   0.00000000e+00   0.00000000e+00   0.00000000e+00
   0.00000000e+00  -9.90000000e+01   5.00000038e+01   0.00000000e+00
   0.00000000e+00   0.00000000e+00   3.80000000e+01   1.90000000e+02
   0.00000000e+00   2.37600002e+01  -4.39999998e-01   3.39019989e+02
   4.39999998e-01  -1.07374182e+09   1.00000000e+00]
data_type = real nwords = 11660
data: [ 1.94408166  1.99718308  2.04474235 ..., -4.75558281 -5.05577517
 -5.05779886]
nx = 106
ny = 110
data_type = real nwords = 11660
