<?xml version="1.0" encoding="UTF-8" standalone="no"?>
<svg
   xmlns:dc="http://purl.org/dc/elements/1.1/"
   xmlns:cc="http://creativecommons.org/ns#"
   xmlns:rdf="http://www.w3.org/1999/02/22-rdf-syntax-ns#"
   xmlns:svg="http://www.w3.org/2000/svg"
   xmlns="http://www.w3.org/2000/svg"
   xmlns:xlink="http://www.w3.org/1999/xlink"
   xmlns:sodipodi="http://sodipodi.sourceforge.net/DTD/sodipodi-0.dtd"
   xmlns:inkscape="http://www.inkscape.org/namespaces/inkscape"
   version="1.1"
   viewBox="0 0 96 96"
   id="svg31"
   sodipodi:docname="sbIrc96.svg"
   inkscape:version="0.92.0 r15299"
   width="96"
   height="96">
  <metadata
     id="metadata35">
    <rdf:RDF>
      <cc:Work
         rdf:about="">
        <dc:format>image/svg+xml</dc:format>
        <dc:type
           rdf:resource="http://purl.org/dc/dcmitype/StillImage" />
        <dc:title></dc:title>
      </cc:Work>
    </rdf:RDF>
  </metadata>
  <sodipodi:namedview
     pagecolor="#ffffff"
     bordercolor="#666666"
     borderopacity="1"
     objecttolerance="10"
     gridtolerance="10"
     guidetolerance="10"
     inkscape:pageopacity="0"
     inkscape:pageshadow="2"
     inkscape:window-width="1650"
     inkscape:window-height="1051"
     id="namedview33"
     showgrid="false"
     inkscape:zoom="14.895833"
     inkscape:cx="24"
     inkscape:cy="24"
     inkscape:window-x="0"
     inkscape:window-y="0"
     inkscape:window-maximized="0"
     inkscape:current-layer="svg31" />
  <defs
     id="defs19">
    <linearGradient
       id="i"
       x2="0"
       y1="34"
       y2="4"
       gradientUnits="userSpaceOnUse">
      <stop
         stop-color="#7cbaf8"
         offset="0"
         id="stop2" />
      <stop
         stop-color="#f4fcff"
         offset="1"
         id="stop4" />
    </linearGradient>
    <linearGradient
       id="e"
       x1="405.57001"
       x2="427.57001"
       y1="509.79999"
       y2="533.79999"
       gradientUnits="userSpaceOnUse">
      <stop
         stop-opacity=".286"
         offset="0"
         id="stop7" />
      <stop
         stop-opacity="0"
         offset="1"
         id="stop9" />
    </linearGradient>
    <linearGradient
       id="h"
       x1="412.57001"
       x2="425.57001"
       y1="514.79999"
       y2="527.79999"
       gradientUnits="userSpaceOnUse"
       xlink:href="#e" />
    <linearGradient
       id="g"
       x2="0"
       y1="44"
       y2="4"
       gradientTransform="matrix(-1,0,0,1,432.57,499.8)"
       gradientUnits="userSpaceOnUse">
      <stop
         stop-color="#2f74c8"
         offset="0"
         id="stop13" />
      <stop
         stop-color="#4699d7"
         offset="1"
         id="stop15" />
    </linearGradient>
    <linearGradient
       id="f"
       x1="405.57001"
       x2="427.57001"
       y1="509.79999"
       y2="533.79999"
       gradientUnits="userSpaceOnUse"
       xlink:href="#e" />
  </defs>
  <g
     transform="matrix(2.1,0,0,2.1,-809.997,-1051.98)"
     id="g29"
     style="fill-rule:evenodd">
    <path
       d="m 428.57,503.8 v 30 h -20 l -11,10 v -10 h -9 v -30 z"
       id="path21"
       style="fill:url(#g)"
       inkscape:connector-curvature="0" />
    <path
       d="m 402.57,534.8 -6,-6 v -3 l -3,-3 v -9 h 4 l 1,1 v -1 l 20,-6 10,7.461 V 533.8 h -26 z"
       id="path23"
       style="opacity:0.2;fill:url(#f)"
       inkscape:connector-curvature="0" />
    <path
       d="m 419.57,521.8 9,9 v -11 l -5,-5 h -4 z"
       id="path25"
       style="opacity:0.2;fill:url(#h)"
       inkscape:connector-curvature="0" />
    <path
       transform="translate(384.57,499.8)"
       d="m 34,8 -20,6 v 9 l 20,6 V 14 Z M 9,14 v 9 h 4 v -9 z m 26,1 v 7 h 4 v -7 z m -23,9 v 5 h 3 v -5 z"
       id="path27"
       style="fill:url(#i)"
       inkscape:connector-curvature="0" />
  </g>
</svg>
