<?xml version="1.0" encoding="UTF-8" standalone="no"?>
<svg
   xmlns:dc="http://purl.org/dc/elements/1.1/"
   xmlns:cc="http://creativecommons.org/ns#"
   xmlns:rdf="http://www.w3.org/1999/02/22-rdf-syntax-ns#"
   xmlns:svg="http://www.w3.org/2000/svg"
   xmlns="http://www.w3.org/2000/svg"
   xmlns:sodipodi="http://sodipodi.sourceforge.net/DTD/sodipodi-0.dtd"
   xmlns:inkscape="http://www.inkscape.org/namespaces/inkscape"
   version="1.1"
   viewBox="0 0 48 48"
   id="svg32"
   sodipodi:docname="sbShell48.svg"
   width="48"
   height="48"
   inkscape:version="1.0.2 (e86c870879, 2021-01-15)">
  <metadata
     id="metadata38">
    <rdf:RDF>
      <cc:Work
         rdf:about="">
        <dc:format>image/svg+xml</dc:format>
        <dc:type
           rdf:resource="http://purl.org/dc/dcmitype/StillImage" />
        <dc:title></dc:title>
      </cc:Work>
    </rdf:RDF>
  </metadata>
  <defs
     id="defs36" />
  <sodipodi:namedview
     pagecolor="#ffffff"
     bordercolor="#666666"
     borderopacity="1"
     objecttolerance="10"
     gridtolerance="10"
     guidetolerance="10"
     inkscape:pageopacity="0"
     inkscape:pageshadow="2"
     inkscape:window-width="1552"
     inkscape:window-height="1132"
     id="namedview34"
     showgrid="false"
     inkscape:zoom="16.25"
     inkscape:cx="23.391087"
     inkscape:cy="20.51671"
     inkscape:window-x="0"
     inkscape:window-y="0"
     inkscape:window-maximized="0"
     inkscape:current-layer="svg32" />
  <g
     transform="matrix(1.99995,0,0,2.00004,-649.97605,-1066.7414)"
     id="g30">
    <g
       fill="#6c7a89"
       id="g26">
      <rect
         x="256.23001"
         y="514.70001"
         width="0"
         height="14.668"
         id="rect2" />
      <rect
         x="263.19"
         y="537.27002"
         width="0"
         height="14.668"
         id="rect4" />
      <rect
         x="265"
         y="536.21002"
         width="0"
         height="14.668"
         id="rect6" />
      <rect
         x="256.23001"
         y="514.70001"
         width="0"
         height="14.668"
         id="rect8" />
      <rect
         x="263.19"
         y="537.27002"
         width="0"
         height="14.668"
         id="rect10" />
      <rect
         x="265"
         y="536.21002"
         width="0"
         height="14.668"
         id="rect12" />
      <rect
         x="256.23001"
         y="514.70001"
         width="0"
         height="14.668"
         id="rect14" />
      <rect
         x="263.19"
         y="537.27002"
         width="0"
         height="14.668"
         id="rect16" />
      <rect
         x="265"
         y="536.21002"
         width="0"
         height="14.668"
         id="rect18" />
      <rect
         x="256.23001"
         y="514.70001"
         width="0"
         height="14.668"
         id="rect20" />
      <rect
         x="263.19"
         y="537.27002"
         width="0"
         height="14.668"
         id="rect22" />
      <rect
         x="265"
         y="536.21002"
         width="0"
         height="14.668"
         id="rect24" />
    </g>
    <path
       d="m 328.09,535.36 -1.0938,0.86496 6.7243,7.7065 -6.7243,7.7065 1.0938,0.86496 7.4777,-8.5714 z m 7.4777,18.571 v 1.4286 h 11.429 v -1.4286 z"
       color="#000000"
       color-rendering="auto"
       fill="#eff0f1"
       fill-rule="evenodd"
       image-rendering="auto"
       shape-rendering="auto"
       stroke-width="1.4286"
       id="path28" />
  </g>
</svg>
