<?xml version="1.0" encoding="UTF-8" standalone="no"?>
<svg
   xmlns:dc="http://purl.org/dc/elements/1.1/"
   xmlns:cc="http://creativecommons.org/ns#"
   xmlns:rdf="http://www.w3.org/1999/02/22-rdf-syntax-ns#"
   xmlns:svg="http://www.w3.org/2000/svg"
   xmlns="http://www.w3.org/2000/svg"
   xmlns:sodipodi="http://sodipodi.sourceforge.net/DTD/sodipodi-0.dtd"
   xmlns:inkscape="http://www.inkscape.org/namespaces/inkscape"
   viewBox="0 0 22 22"
   version="1.1"
   id="svg8"
   sodipodi:docname="minus_3.svg"
   inkscape:version="1.0.2 (e86c870879, 2021-01-15)">
  <metadata
     id="metadata12">
    <rdf:RDF>
      <cc:Work
         rdf:about="">
        <dc:format>image/svg+xml</dc:format>
        <dc:type
           rdf:resource="http://purl.org/dc/dcmitype/StillImage" />
        <dc:title></dc:title>
      </cc:Work>
    </rdf:RDF>
  </metadata>
  <sodipodi:namedview
     pagecolor="#ffffff"
     bordercolor="#666666"
     borderopacity="1"
     objecttolerance="10"
     gridtolerance="10"
     guidetolerance="10"
     inkscape:pageopacity="0"
     inkscape:pageshadow="2"
     inkscape:window-width="1595"
     inkscape:window-height="870"
     id="namedview10"
     showgrid="false"
     inkscape:zoom="22.98097"
     inkscape:cx="9.8889522"
     inkscape:cy="9.2831558"
     inkscape:window-x="92"
     inkscape:window-y="90"
     inkscape:window-maximized="0"
     inkscape:current-layer="svg8" />
  <defs
     id="defs4">
    <style
       type="text/css"
       id="style2">.ColorScheme-Text {
        color:#232629;
      }</style>
  </defs>
  <g
     id="g46"
     transform="translate(0,2)">
    <path
       class="ColorScheme-Text"
       d="M 10,4 V 6 H 20 V 4 Z"
       fill="currentColor"
       id="path6" />
    <path
       class="ColorScheme-Text"
       d="m 6,8 v 2 H 16 V 8 Z"
       fill="currentColor"
       id="path6-3"
       style="color:#232629" />
    <path
       class="ColorScheme-Text"
       d="m 2,12 v 2 h 10 v -2 z"
       fill="currentColor"
       id="path6-6"
       style="color:#232629" />
  </g>
</svg>
