<?xml version="1.0" encoding="UTF-8" standalone="no"?>
<svg
   xmlns:dc="http://purl.org/dc/elements/1.1/"
   xmlns:cc="http://creativecommons.org/ns#"
   xmlns:rdf="http://www.w3.org/1999/02/22-rdf-syntax-ns#"
   xmlns:svg="http://www.w3.org/2000/svg"
   xmlns="http://www.w3.org/2000/svg"
   xmlns:sodipodi="http://sodipodi.sourceforge.net/DTD/sodipodi-0.dtd"
   xmlns:inkscape="http://www.inkscape.org/namespaces/inkscape"
   version="1.1"
   viewBox="0 0 48 48"
   id="svg10"
   sodipodi:docname="sbTemplateViewer48.svg"
   width="48"
   height="48"
   inkscape:version="1.0.2 (e86c870879, 2021-01-15)">
  <metadata
     id="metadata14">
    <rdf:RDF>
      <cc:Work
         rdf:about="">
        <dc:format>image/svg+xml</dc:format>
        <dc:type
           rdf:resource="http://purl.org/dc/dcmitype/StillImage" />
        <dc:title></dc:title>
      </cc:Work>
    </rdf:RDF>
  </metadata>
  <sodipodi:namedview
     pagecolor="#ffffff"
     bordercolor="#666666"
     borderopacity="1"
     objecttolerance="10"
     gridtolerance="10"
     guidetolerance="10"
     inkscape:pageopacity="0"
     inkscape:pageshadow="2"
     inkscape:window-width="1598"
     inkscape:window-height="1059"
     id="namedview12"
     showgrid="false"
     inkscape:zoom="16.25"
     inkscape:cx="23.586522"
     inkscape:cy="24.939606"
     inkscape:window-x="0"
     inkscape:window-y="0"
     inkscape:window-maximized="0"
     inkscape:current-layer="svg10"
     inkscape:document-rotation="0" />
  <defs
     id="defs4">
    <style
       type="text/css"
       id="style2">.ColorScheme-Text {
        color:#eff0f1;
      }</style>
  </defs>
  <path
     d="M 4,4 V 44 H 21.43596 V 41.5 H 6.6002145 V 6.5 H 27.38593 v 10 H 37.778583 V 22 h 2.596112 V 13.9804 L 30.002145,4 29.982114,4.023438 V 4 H 4.0004821 Z"
     color="#eff0f1"
     fill="currentColor"
     id="path6"
     style="stroke-width:2.02549" />
  <path
     d="m 33.743697,24 -1.963146,5.3776 -5.288429,-2.448 2.510778,5.1562 -5.515507,1.91406 5.515507,1.91406 -2.510778,5.1562 5.288429,-2.448 1.963146,5.3776 1.963145,-5.3776 5.28843,2.448 -2.510779,-5.1562 L 44,33.99986 38.484493,32.0858 l 2.510779,-5.1562 -5.28843,2.448 z"
     color="#eff0f1"
     fill="currentColor"
     id="path8"
     style="stroke-width:2.02549" />
</svg>
