<?xml version="1.0" encoding="UTF-8" standalone="no"?>
<svg
   width="22"
   height="22"
   version="1.1"
   viewBox="0 0 5.8208 5.8208"
   id="svg37"
   sodipodi:docname="ericPdf.svg"
   inkscape:version="1.1.2 (0a00cf5339, 2022-02-04)"
   xmlns:inkscape="http://www.inkscape.org/namespaces/inkscape"
   xmlns:sodipodi="http://sodipodi.sourceforge.net/DTD/sodipodi-0.dtd"
   xmlns:xlink="http://www.w3.org/1999/xlink"
   xmlns="http://www.w3.org/2000/svg"
   xmlns:svg="http://www.w3.org/2000/svg">
  <sodipodi:namedview
     id="namedview39"
     pagecolor="#ffffff"
     bordercolor="#666666"
     borderopacity="1.0"
     inkscape:pageshadow="2"
     inkscape:pageopacity="0.0"
     inkscape:pagecheckerboard="0"
     showgrid="false"
     inkscape:zoom="29.272727"
     inkscape:cx="11"
     inkscape:cy="11"
     inkscape:window-width="2580"
     inkscape:window-height="1080"
     inkscape:window-x="426"
     inkscape:window-y="146"
     inkscape:window-maximized="0"
     inkscape:current-layer="svg37" />
  <defs
     id="defs19">
    <linearGradient
       id="f"
       x1="4"
       x2="4"
       y1="44"
       y2="4"
       gradientTransform="matrix(0.066146,0,0,0.066142,2.4253,293.6)"
       gradientUnits="userSpaceOnUse">
      <stop
         stop-color="#54d883"
         offset="0"
         id="stop2" />
      <stop
         stop-color="#abf9c7"
         offset="1"
         id="stop4" />
    </linearGradient>
    <linearGradient
       id="a"
       x1="34"
       x2="44"
       y1="19.008"
       y2="29.008"
       gradientUnits="userSpaceOnUse">
      <stop
         stop-color="#292c2f"
         offset="0"
         id="stop7" />
      <stop
         stop-opacity="0"
         offset="1"
         id="stop9" />
    </linearGradient>
    <linearGradient
       id="g"
       x1="9"
       x2="38"
       y1="9"
       y2="38"
       gradientTransform="matrix(0.066146,0,0,0.066142,2.4253,293.6)"
       gradientUnits="userSpaceOnUse"
       xlink:href="#a" />
    <linearGradient
       id="h"
       x1="4"
       x2="4"
       y1="44"
       y2="4"
       gradientTransform="matrix(0.066146,0,0,0.066142,2.4253,293.6)"
       gradientUnits="userSpaceOnUse">
      <stop
         stop-color="#197cf1"
         offset="0"
         id="stop13" />
      <stop
         stop-color="#20bcfa"
         offset="1"
         id="stop15" />
    </linearGradient>
    <linearGradient
       id="e"
       x1="34"
       x2="44"
       y1="19.008"
       y2="29.008"
       gradientTransform="matrix(0.066146,0,0,0.066142,2.4253,293.6)"
       gradientUnits="userSpaceOnUse"
       xlink:href="#a" />
    <linearGradient
       id="a-3"
       y1="392.36"
       y2="336.36"
       x2="0"
       gradientUnits="userSpaceOnUse"
       gradientTransform="matrix(0.07298809,0,0,0.07298809,0.59308977,-23.158892)">
      <stop
         stop-color="#ffffff"
         stop-opacity="0"
         id="stop2-6" />
      <stop
         offset="1"
         stop-color="#ffffff"
         stop-opacity=".15"
         id="stop4-7" />
    </linearGradient>
    <linearGradient
       id="linearGradient860"
       y1="392.36"
       y2="336.36"
       x2="0"
       gradientUnits="userSpaceOnUse"
       gradientTransform="translate(-14-332.36)">
      <stop
         stop-color="#ffffff"
         stop-opacity="0"
         id="stop856" />
      <stop
         offset="1"
         stop-color="#ffffff"
         stop-opacity=".15"
         id="stop858" />
    </linearGradient>
    <linearGradient
       id="a-5"
       y1="392.36"
       y2="336.36"
       x2="0"
       gradientUnits="userSpaceOnUse"
       gradientTransform="translate(-14,-332.36)">
      <stop
         stop-color="#ffffff"
         stop-opacity="0"
         id="stop2-3" />
      <stop
         offset="1"
         stop-color="#ffffff"
         stop-opacity=".15"
         id="stop4-5" />
    </linearGradient>
    <linearGradient
       id="linearGradient916"
       y1="392.36"
       y2="336.36"
       x2="0"
       gradientUnits="userSpaceOnUse"
       gradientTransform="translate(-14-332.36)">
      <stop
         stop-color="#ffffff"
         stop-opacity="0"
         id="stop912" />
      <stop
         offset="1"
         stop-color="#ffffff"
         stop-opacity=".15"
         id="stop914" />
    </linearGradient>
    <linearGradient
       id="a-6"
       y1="392.35999"
       y2="365.20001"
       x2="0"
       gradientUnits="userSpaceOnUse"
       gradientTransform="translate(365.57,152.44)">
      <stop
         stop-color="#ffffff"
         stop-opacity="0"
         id="stop2-2" />
      <stop
         offset="1"
         stop-color="#ffffff"
         stop-opacity=".2"
         id="stop4-9" />
    </linearGradient>
  </defs>
  <g
     id="g918">
    <path
       color-rendering="auto"
       color-interpolation-filters="linearRGB"
       shape-rendering="auto"
       image-rendering="auto"
       text-rendering="auto"
       id="use26"
       color-interpolation="sRGB"
       color="#000000"
       d="M 10,3 V 61 H 54 V 3 H 40 Z"
       style="fill:url(#a-5)" />
  </g>
  <g
     id="g921" />
  <g
     id="g952"
     transform="translate(-0.26458001,-0.26000243)">
    <image
       x="0.26458001"
       y="0.26000243"
       width="5.2916999"
       height="5.2916999"
       preserveAspectRatio="none"
       xlink:href="data:image/png;base64,iVBORw0KGgoAAAANSUhEUgAAADAAAAAwCAYAAABXAvmHAAAABHNCSVQICAgIfAhkiAAADvxJREFU aIHtmXlwXWd5h5/vO+fcc/crXUmWbMmyY1neHQfHcQIxW3DqLIUGmLQDDO2EYWgnU6bQTjulQ8hM WkphIN1oOyGUsAdMiEkcwNkcBzu4cWzHlhfJlmTJWq72u9977tm+r39kKRSDSXCYTie/v8+c8zzz vuc3Z4HX83pez//VCK2flhc96LdBcqE89N0fyudWHDbWl5pimUohqXUpU4aMGW9qcQpuWgeV1lJ5 PC2ojmeam09ufPumkTcs/mThf5/ntybwwM7d5szUj1Ku6Wdniqp7fmH2irnS/Godmp121O9wGnNZ T1tRrGg8mVSRFV1xI2u5ZiqlPUcGM5YfP1o5nfr6p+7e+7AQ6Ndc4M47Nlqhty3duSy7dGRiYoMI giuIm+tCK9IdNxe3p9NNmbauDqN1abuYqQYUPQdpecyNPyMUjxPXRbJiNaLSTX5+TOfGzzJ2Kjhp 26mPff+Job0vXce8xNzih/vvXXL8mTPXbnzDVW/M+2qTG430dGx6U0tb2ox1ZZpFe3YlrYlmUQLm Gjks28c5sovU8DNcdtVWfno+ZHCkQDqpyUenqReGWVQviWi1hkCuk0r9zo/ffdtPbtx1X3BJBU49 8cXmBw4cuKXv6Kk/mJhVb0pNicQTfftE6opWUTOn6EnNMd/UQrT+NqxFCc7V+gmmXFaEaX764/up PXyMG/5SUowmiRIFBFNlh8Ssi+X5ZLQmY4eyEviXPXjZ0xZwaQSeO3KvvW/XYzu+9uPH31clftN4 38nU5k3vEsW5LKM/GeTGJU0kNrYx3D9NIptBnz2KFtMUIxaW6TKaD5iadlj+hjfTe9lW/PIwXiSC 4xtY+RLBVInRisZxTcxAkTSpbim0qHs5x28s8J0vfrx3538++KGi734w3btyiQoSYvzQEN1Oldz4 KKWaw7fuvo/f+9t3kFm1GNdLI/MHWGKdQp6N0/vGbWy9fgfrOoYpBwlMv47Xf5D6wBzEE5gLdahY 9J0z0WFAS9b1W9vNgT++7znvJYZXJaC1Fv9+5x/esHff4T+rpe3rlrz5OsuKtTL41JPkc4Pc/5W7 MXUrheIwQRCi5ppIxyJERZXV14WsWJbl+FNd7J0cZ6HpQaJLozQKmxkKR5F2icqEj+PNkxEG5+uS nBvQZCsma0YovdQMzL/cQq9Y4Auf+xf5wZuv/EAF+6/TXRvWtnS2i9xADbO1ALKGW3PxXZ9GPYfU Eq19vPpztC5OYNNGOjtLgImseww8NkeqN0FibJ5je0dZttxlsa8pFAKmCi6mFSG+2GbDEoEIJV5D 6WXLm4Kf5XlFAlpr8dG/uvGDbe+88o6eLdeu2LTlZiFwCc7Os/+R+xmbr+J7inSLJEgonLogE8+y +eYuGjHNoaMFktcsouFnsDstTIo0RpK0xDJYzvMsPFOn4AQUIikWb2yiWnFAB/i+JPQChAhDaQS1 n2UyXolApGfu/cGiFZ9a99b39HRu2C7Gpwvsuv8+5k/3U5qcIruulWK5RK5/HhWCU/FYe+USYqmA oUMew/0zrLqui1rNpFoNqeVcGsNF2rTJ5Kk8qY40bkIgkgampZDCwdQ+hAYChaHV+PKOti89+ezM zCsW+N6eO270k+m7xNqr1+jEKvH0fQ/Td889dKs6t77zWhqBSU7OseaaRWhHsXh5ms41cbbe2IJM V7ny8iYaOYdG3gc3ZD7v0NvRxOBTIzx3YATPDUmuT9AQBSKlAkHNxXQVUQz8UBBBaEvLHyXWWN/Y v6/ov8T1a63Qo0/dffU379/3sQXbXV+3Tov12TVc0WKw5Z9uoqXTJEGN48MWW5qupv/EAapewFu3 dzN4YoyzYw1WvSWL31amqd3iwHcmuPZ3lxJJxMhNlggCg7XXd1MtlBh5dgRd98jEBGagMIUATJQM EEY43xRN7P70nSM1eGGdhRD6ogJPD3157Zlp7286N1+/fZ0fEZPnTrPj9htobi4xHx6j4laZ3jfM Tw8OccOfv4Obrl7NVF+OgZ/MMT1f5NptK7ECi+mROkt6Y2SftRk6NENHU5K+ZyYoaM226w1sd5bl i0KqOahVFVGtsZJQCTwIVCij4feW9sT3QP7n+H6lwJ6Df5f5/mNHP9py9cabV36kV14uLmfXlyY5 qUZIzBQJhgtYYoFDe06RzaaZHTiLjDdhijmuee9STh+wMReKYCap1ALCoMaGNc08uvscU+kqrVdI nEGT6WN57JqDWlAkMBAWiEDhORZIX0dN87GEmfiPT/zrROUlNiGEvqjATHP4Pi+p35/uajWywiHC eRamRykdLtAZMwlnynjVKqUZn9b2BAvPF6h5U8ydn8JxM6SycObAHD2bQjLpKNWiw7n+HPmFGjve 2U33GsGe8Tn6n6mwuhuCosLxQBuCSAw8L9TxeGRvU0x89suPl09eiPGXCnx1561XMpP9k5ixkDaS LiXijNYmmRubojZwnHLaILMiieMI0klJWC/jBQ5hWKJSUpTPNkhnFhhxoO+xHNlsnAYNutdKljZS KLXAwklBW8Tn3ILBbCIgY0q0YWDZEifUqiktHlneEvv7ux/MP/vLOC/YQief/QfrmF+/vdC2+pb8 6KwxeuA4bjzPcN8ghpenpydGZXqOci7Pif050lkLIg1QDtG4wfRUFRuFFbpkYhajZ8tMNhy23baE TdsTDB4OGR+ogNtANzyiSiADTSZmIg1JIirCVMre3dPT9OnPf2v20K/akgtO4ERQ3jA/3/yueXna 6FrXwfkfHufcl04wNaDJrjZIr2ui8/JWsmmLajhByfWJhzbpBKSFy+pWi5HhIgtWSNeqBL1XtTET Vsm2xxk9UsBoaMZOKaINSUwqbFMRM6MIoZF23WltS37dsNv+8XP3Dp/5VfAXnMA31TfM4qy83V3U dMvizIgcPDKOtmbp6BCgTGrFGp1LM0QTEsd3sZXLwkiZ1ohNWK0zOVZhcDCkZJlsfm8z17ynmZlJ k6GBIpbvMXuqjDPv4VZ8YpZB6IDExI4pHYbueDpt//P6rjd9/jNfPTJ2MfgLTmCLuLXn2+EjO4YG d8sNmSHMoolvZEhmh1m/LcPgPo/zR0fIZCwiBuiiS3mywrEFh1iXzaot6wkWZln9dpPsWsHpvhLP H3QJSiG541WoephKkbQMLA+amzSmEYbxZORJyzbu2Xj99t1/8dGH/AvBXlQg13+r8ZVHd95ainKF 7bgiPzZNwk0yVbRR4QJBZZ6EZzA6ojgwUCbTHSfbY7PslnayS9OoWIzGnEVuosCifJzTjypm+j3G T9ZIpzSVMCBjCgwlSCcU2RalY1aQF17kq82L0vd88Ru5QR5+6Ndl/0UBe80n1lzmlG8dOfGUOXvi DGPzdVraGtTGHP7rbIDVZqEiUZwWg6Bd0fGWblb2tlCdKfH8nimcaoPWeJy4qjO53yVi+BBIuhdr DKnIRCW2BBUKkkLr9pT9fCYb/bc//aPt31m2fVf9FZG/mJdf6if0mHFwbPiTOtV1x6Ejh42+736W 6nyeVLJOuuGRrxlUIiaLWkziIcyP1PGx0FIiTY9kVGDHNDFbUJit4Vc00gOlQkJhIARYlkR5EJiB XtbdtH/buua7PnzX0JOvBvwXJqBIdB8+euJd1ehBw61GaF2xDGf0PJVpgZNWtDUr1KRPsWBgt0uW 9QoK+SoVF6pV8CqC0FWIUKFDjdQS2wADEywLrTSN0CcWC3RnZ2zvtmvXfebDH9//G8H/nEAHpc1b 1yxd6cokux/8NtWpacq1EEMI9KwkLCrSGY+YEsyMwYQPUmpicUHcU6hAAxopNKYpkUaIFqCFxDM0 vhfSltS6e3n6ic7Otjs//PH9B39TeHixRrW+x3yC8CPHh05tU7YlGpZNtTRHWK/jVMvELAhcQdUJ IRRopYlHIG6CaGiUq/E98JVA+RqJQAmBkgahkDQamozh6U290UObr0rdefsdYwcuBTyABDgavm1V bqR5ezjVLE8+9gM6WhMYQQzPMwhIU2uANBQ6FNT9F54Wy+WQQiWg2lD4gUYaYEowbYERlxi2RcSO oJTECnwiCSZK6czdH/jY1L5LBf+ywGxxpHssd76rc+ta1mzdwsCzD5CVZ1iU9EEEaC2oOxq3YSCF xDYNpBaESqAFNEJFw1WEgUaYBqEhcH1NsRxSKfmIUAWZZOLrN92y+geXEh5evAd6W5akzqTnRN/j D9CalYwPO3izdRKBh+UpDKmRcUWlAuVKgBVoTDShJVAGSCSWIYhZEkMYNHyB64aIICRphmRSxrne Tct33rxjn3cxoFcjIB4/8mT79IgbjTcvYvTMU+jpWSw3IJFURBMhbmAhA4gYPkoKhADDEFiGxlAa yxSYEYmUBr6GIAiQoQAd6kDrUCeip9pF2/Clhn9JgDN9c3bVESKRLdOajVDN+Jw9nccrmbg1D6Ul rq/QQpE2BZi8WJUCS0gs00AISRBoXDdEhSFaa621UvGYzC/uaJsJmlMJoHYRnlccCfD7t91W23bD Dao2OMDhPQfJz3sYdhxtaixfk/ICLKWIxiRRSyOUBgUGGqRAaf0CvKcIPaW1r5Q0tGtGZMm0o0MW 5qTKtGR5Db6Gm4CeeW7g3PG+Q+X8+HRLZdbAdzxCPxSeUghfoC31QjXWNQ2ttEQKQ2ptmgYIgR9o VOATeEorLQNhmaVY3JgzTHsslorvC3yeTKajs/o1MDABdCNy1s/5/V45vMqQWnqea6hGKFGgBWBo baCEpQRhILU0hTYM0FoqXxFqJFLIMB436nbcWlDSnJRaDsTjsYPpVPzA5K7+iQ/tGgo+dInhXxZ4 95t3nJ85fde3ssHKpvMRO56PFTKVsmc3qmWpdCBCLG2KkHhEakPqQAq0YUg/YkYbyhQ1gemFvixb EXM2akcmAuS5KBxrBOrk137QX4D/+aPymggIgT51atNDx4/Ppz1P9KaSi1qDgGi9OifcWtWoVmpS +UGQikaVbRl+KIJAaFWzrGhdSrseRoyKX/eKlmlPpdPxcc9wJpO56swXnhh2Xivwl/JzK7lz553d 09MLq0qlakvoa9P3PELPU5XSnPCdemiapo5FTIWUru+5Da2CQGnZkKYoeXW3Xq6Z1Qq5+iOPTDUA 9VrDv57X83r+H+S/AUqelu0Ucsx1AAAAAElFTkSuQmCC "
       id="image21" />
  </g>
  <g
     transform="matrix(0.09621154,0,0,0.09449347,-34.041566,-46.018318)"
     id="g27">
    <g
       color-rendering="auto"
       color-interpolation-filters="linearRGB"
       shape-rendering="auto"
       image-rendering="auto"
       text-rendering="auto"
       color-interpolation="sRGB"
       color="#000000"
       id="g15">
      <path
         fill="#da2c2c"
         d="m 389.57,517.8 v 28 h 22 v -28 h -14 z"
         id="path9" />
      <rect
         opacity="0.25"
         x="389.57001"
         y="544.79999"
         width="22"
         height="1"
         id="rect11" />
      <rect
         opacity="0.5"
         x="389.57001"
         y="517.79999"
         width="22"
         fill="#ffffff"
         height="1"
         id="rect13" />
    </g>
    <rect
       width="1"
       x="392.57001"
       y="518.79999"
       fill="#ffffff"
       height="26"
       fill-opacity="0.252"
       id="rect17" />
    <g
       color-rendering="auto"
       color-interpolation-filters="linearRGB"
       shape-rendering="auto"
       image-rendering="auto"
       text-rendering="auto"
       color-interpolation="sRGB"
       color="#000000"
       id="g25">
      <rect
         x="393.57001"
         y="518.79999"
         fill-opacity="0.083"
         width="1"
         height="26"
         id="rect19" />
      <path
         opacity="0.8"
         fill="#ffffff"
         d="m 398.43,525.8 c -0.162,0.01 -0.336,0 -0.527,0.132 -1.705,0.734 -0.561,2.747 1.612,4.279 0.013,-0.289 0.133,-0.917 0.13,-1.194 -1.854,-1.271 -2.939,-2.509 -1.757,-2.999 1.246,-0.517 1.633,0.895 1.655,2.944 0.116,0.12 0.92,0.654 1.042,0.739 -0.045,-1.869 -1.039,-3.777 -1.993,-3.885 -0.051,-0.01 -0.107,-0.01 -0.161,-0.01 m 1.736,3.252 -0.388,-0.151 -0.322,0.217 -0.065,0.682 0.406,0.312 0.169,0.226 c 1.251,0.83 2.317,1.469 3.718,1.997 l 0.874,0.13 h 0.575 c 0.53,-0.313 0.214,-0.433 2.141,-0.673 l -2.171,0.168 c -1.675,-0.649 -3.385,-1.582 -4.94,-2.6 m 3.822,2.72 c 0.251,0 2.211,-0.17 2.99,-0.242 0.772,-0.12 1.719,-0.156 1.54,0.746 0.204,-0.481 -0.261,-1.298 -0.922,-1.442 -1.023,-0.229 -2.646,0.398 -3.229,0.591 m 0.94,0.25 c -0.304,0.12 -0.999,0.207 -1.327,0.316 0.465,0.241 2.802,1.103 3.766,0.923 0.154,0 0.805,-0.468 0.821,-0.805 -0.05,0.613 -2.906,0.156 -3.26,-0.445 m 0.635,0.011 c -0.25,-0.12 -1.422,-0.114 -1.681,-0.211 -1.468,0.513 -3.442,1.719 -4.855,2.532 l -0.409,0.12 c -0.079,0.561 -0.425,0.755 -0.74,1.118 l 0.478,0.481 0.374,-0.613 c 1.654,-0.998 4.924,-2.611 6.832,-3.386 m -6.832,3.386 c -0.202,0.12 -0.395,0.241 -0.578,0.361 -0.424,1.204 -0.919,2.01 -1.391,1.98 0.729,0.349 2.301,-1.37 2.83,-2.986 m -2.83,2.986 c -1.113,-0.661 1.243,-1.867 1.77,-2.217 0.119,-0.337 -0.206,-0.895 -0.1,-1.292 -1.661,1.034 -2.643,2.531 -2.086,3.24 0.134,0.168 0.276,0.253 0.417,0.265 m 1.617,-2.52 c 0.077,-0.31 1.103,-1.015 1.289,-1.123 0.248,-1.954 0.26,-2.147 0.471,-3.666 -0.126,-0.12 -0.902,-0.725 -1.022,-0.809 -0.149,1.624 -0.429,3.824 -0.826,5.293"
         id="path21" />
      <path
         fill="url(#a)"
         d="m 389.57,517.8 v 28 h 22 v -28 h -17 z"
         id="path23"
         style="fill:url(#a-6)" />
    </g>
  </g>
</svg>
