<?xml version="1.0" encoding="UTF-8" standalone="no"?>
<svg
   xmlns:dc="http://purl.org/dc/elements/1.1/"
   xmlns:cc="http://creativecommons.org/ns#"
   xmlns:rdf="http://www.w3.org/1999/02/22-rdf-syntax-ns#"
   xmlns:svg="http://www.w3.org/2000/svg"
   xmlns="http://www.w3.org/2000/svg"
   xmlns:sodipodi="http://sodipodi.sourceforge.net/DTD/sodipodi-0.dtd"
   xmlns:inkscape="http://www.inkscape.org/namespaces/inkscape"
   width="48"
   height="48"
   version="1.1"
   viewBox="0 0 12.7 12.7"
   id="svg48"
   sodipodi:docname="sbPyPI48.svg"
   inkscape:version="1.0.2 (e86c870879, 2021-01-15)">
  <metadata
     id="metadata54">
    <rdf:RDF>
      <cc:Work
         rdf:about="">
        <dc:format>image/svg+xml</dc:format>
        <dc:type
           rdf:resource="http://purl.org/dc/dcmitype/StillImage" />
        <dc:title></dc:title>
      </cc:Work>
    </rdf:RDF>
  </metadata>
  <defs
     id="defs52" />
  <sodipodi:namedview
     pagecolor="#ffffff"
     bordercolor="#666666"
     borderopacity="1"
     objecttolerance="10"
     gridtolerance="10"
     guidetolerance="10"
     inkscape:pageopacity="0"
     inkscape:pageshadow="2"
     inkscape:window-width="1596"
     inkscape:window-height="1087"
     id="namedview50"
     showgrid="false"
     units="px"
     inkscape:zoom="16.250094"
     inkscape:cx="24.414017"
     inkscape:cy="23.660197"
     inkscape:window-x="0"
     inkscape:window-y="0"
     inkscape:window-maximized="0"
     inkscape:current-layer="svg48" />
  <g
     transform="matrix(1.8181194,0,0,1.8181961,-201.18919,-264.25631)"
     id="g46">
    <g
       transform="matrix(0.011642,0,0,0.013265,111.24,145.92)"
       id="g24">
      <path
         d="M 208,437.76 C 200.3943,435.5196 2.42,363.701 1.25,362.758 0.28588,361.98096 0,352.157 0,319.802 0,287.575 0.28971,277.564 1.25,276.605 1.9375,275.91835 15.325,270.7225 31,265.059 46.675,259.3952 61.862,253.882 64.75,252.807 L 70,250.853 v -41.306 c 0,-31.838 0.28652,-41.538 1.25,-42.318 0.6875,-0.55698 15.2,-6.0574 32.25,-12.223 17.05,-6.1656 32.462,-11.817 34.25,-12.559 l 3.25,-1.3482 v -15.429 c 0,-11.156 0.34617,-15.699 1.25,-16.404 0.6875,-0.53659 15.875,-6.2714 33.75,-12.744 17.875,-6.4726 33.288,-12.18 34.25,-12.682 1.5509,-0.80969 1.75,-2.6589 1.75,-16.256 0,-11.069 0.34814,-15.623 1.25,-16.351 1.6771,-1.3531 132.84,-48.665 139.45,-50.302 4.2356,-1.0485 5.9983,-1.0492 9.5,-0.003731 9.1438,2.73 63.416,22.338 65.524,23.673 2.1233,1.3449 2.2372,2.1206 2.5,17.035 l 0.27536,15.626 32.477,11.82 c 17.862,6.5012 33.5,12.368 34.75,13.037 l 2.273,1.2165 V 209.23457 c 0,99.397 -0.26316,126.16 -1.25,127.14 -1.0708,1.0576 -54.404,20.565 -238.25,87.141 -44.675,16.178 -45.334,16.357 -52.5,14.246 z m 41.389,-14.374 c 17.661,-6.385 32.674,-12.065 33.361,-12.622 0.96068,-0.77875 1.25,-9.8959 1.25,-39.391 0,-35.904 -0.11279,-38.374 -1.75,-38.323 -0.9625,0.0299 -16.15,5.3174 -33.75,11.75 l -32,11.696 -0.26161,39.25 c -0.14388,21.588 0.0311,39.25 0.38896,39.25 0.35781,0 15.101,-5.2241 32.762,-11.609 z m 215.36,-78.039 32.25,-11.683 v -39.441 c 0,-31.14 -0.2631,-39.341 -1.25,-38.966 -0.6875,0.2614 -13.4,4.8623 -28.25,10.224 -14.85,5.3617 -29.362,10.629 -32.25,11.704 l -5.25,1.9547 v 38.928 c 0,30.467 0.2717,38.932 1.25,38.945 0.6875,0.009 15.762,-5.2401 33.5,-11.666 z m -60.106,-5.4407 c 4.7499,-2.9356 8.4021,-9.5777 8.5209,-15.497 0.0818,-4.0741 -0.32443,-5.1545 -2.7093,-7.2059 -2.2364,-1.9236 -3.526,-2.2963 -6.3572,-1.8368 -9.4634,1.5357 -17.478,14.47 -14.068,22.703 2.209,5.3329 7.8158,6.0374 14.613,1.8364 z m -336.86,-71.809 -0.28498,-9.8982 -15,5.5064 c -8.25,3.0285 -19.95,7.3065 -26,9.5065 -6.05,2.2 -11.382,4.3558 -11.849,4.7906 -0.46686,0.43476 0.64337,1.1182 2.4672,1.5188 1.8238,0.40058 4.0058,1.0933 4.8488,1.5393 0.84305,0.44604 11.433,4.4085 23.533,8.8055 l 22,7.9945 0.28498,-9.9327 c 0.15674,-5.463 0.15674,-14.387 0,-19.831 z m 71,-57.97 -0.28498,-9.8681 -7.5,2.7939 c -4.125,1.5366 -15.934,5.8648 -26.243,9.6181 -10.309,3.7533 -18.746,7.0712 -18.75,7.3731 -0.0037,0.30191 5.9558,2.7062 13.243,5.3429 7.2875,2.6367 14.825,5.3986 16.75,6.1377 1.925,0.7391 7.775,2.9016 13,4.8055 l 9.5,3.4617 0.28498,-9.8984 c 0.15674,-5.4441 0.15674,-14.339 0,-19.766 z m -0.12054,-60.801 c -0.20834,-0.20835 -5.5056,1.478 -11.772,3.7473 -30.462,11.033 -41.842,15.305 -41.548,15.599 0.17684,0.17683 11.489,4.3871 25.139,9.3562 13.649,4.9691 25.537,9.438 26.417,9.9309 1.4387,0.80597 1.6273,-1.0758 1.8715,-18.679 0.1494,-10.767 0.10117,-19.746 -0.10718,-19.954 z m 71.336,-38.831 c 0,-10.725 -0.1281,-19.5 -0.28466,-19.5 -0.5525,0 -12.427,4.2439 -30.715,10.977 -10.175,3.7463 -19.805,7.2189 -21.4,7.717 -2.7122,0.84701 -2.292,1.1111 6.5,4.0847 5.1698,1.7485 17.275,6.0965 26.9,9.6622 9.625,3.5657 17.838,6.5001 18.25,6.521 0.4125,0.0209 0.75,-8.737 0.75,-19.462 z m 105.16,10.037 c 3.8637,-2.6254 8.8402,-11.229 8.8402,-15.283 0,-3.5142 -2.6277,-7.9234 -5.1086,-8.5722 -10.022,-2.6208 -22.593,13.417 -17.742,22.634 0.63234,1.2013 1.6448,2.5149 2.25,2.919 2.3399,1.5624 8.2098,0.71519 11.76,-1.6973 z"
         fill="#ecebe8"
         id="path2" />
      <path
         d="m 210.47,437.65 c -1.709,-1.1698 -46.702,-17.767 -65.473,-24.151 -3.575,-1.216 -10.325,-3.6679 -15,-5.4487 -4.675,-1.7808 -22,-8.105 -38.5,-14.054 -16.5,-5.9488 -43.115,-15.582 -59.146,-21.406 -16.03,-5.8245 -29.868,-10.59 -30.75,-10.59 -1.4474,0 -1.6045,-4.1591 -1.6045,-42.5 v -42.5 h 2.6398 c 1.4519,0 3.1394,0.64898 3.75,1.4422 1.3767,1.7883 61.636,23.755 63.36,23.098 1.5954,-0.60878 1.8266,-46.065 0.23928,-47.046 -0.64217,-0.39688 -0.4753,-1.3891 0.45763,-2.721 1.2308,-1.7572 1.4744,-8.6375 1.506,-42.522 0.02068,-22.234 0.29131,-40.836 0.60139,-41.338 0.88561,-1.433 4.4458,-1.0656 4.4458,0.45868 0,1.6609 61.32,24.104 63.535,23.254 1.2281,-0.47125 1.4652,-4.2799 1.4652,-23.535 0,-15.173 -0.36163,-23.196 -1.0651,-23.631 -0.70809,-0.43762 -0.54957,-1.228 0.47287,-2.3578 1.2157,-1.3433 1.5961,-4.935 1.8151,-17.138 0.24895,-13.869 0.45777,-15.473 2.0534,-15.78 0.97693,-0.18754 2.5519,0.53891 3.5,1.6144 1.7017,1.9303 58.981,23.201 62.477,23.201 1.6009,0 1.7192,-2.8174 1.6864,-40.167 -0.029,-32.968 0.21349,-40.415 1.3529,-41.555 0.76353,-0.76353 29.923,-11.734 64.798,-24.379 80.59,-29.22 77.488,-28.162 80.17,-27.349 10.092,3.0568 66.614,24.014 67.965,25.2 1.4692,1.2903 1.7661,3.8104 2,16.979 l 0.27472,15.464 70,25.445 0.25385,126.18 c 0.16887,83.945 -0.0822,126.18 -0.75,126.18 -0.65548,0 -1.0038,-14.229 -1.0038,-41 0,-34.162 -0.2298,-41 -1.3778,-41 -1.0428,0 -55.408,19.417 -65.904,23.539 -1.6752,0.65776 -1.7647,3.1692 -1.5,42.051 l 0.28156,41.352 -71.781,26.029 c -39.479,14.316 -71.992,26.029 -72.25,26.029 -0.25807,0 -0.46922,-18.198 -0.46922,-40.441 0,-23.822 -0.38177,-40.677 -0.92903,-41.015 -1.0049,-0.62103 -66.73,22.928 -68.81,24.655 -0.97438,0.80867 -1.2605,9.8579 -1.2605,39.867 0,37.972 0.0447,38.852 2.0451,40.253 1.7913,1.2547 1.8432,1.5099 0.41821,2.0567 -2.4339,0.93396 -3.8094,0.76728 -5.9908,-0.72596 z m 2.2891,-41.372 c 0.248,-37.162 0.16629,-39.246 -1.5756,-40.178 -4.3705,-2.339 -65.482,-24.035 -66.291,-23.534 -1.2168,0.75202 -1.1359,76.504 0.0837,78.435 1.0142,1.6052 63.505,24.932 66.022,24.644 1.2999,-0.14842 1.5349,-5.3993 1.7616,-39.366 z m -71.762,-26.155 v -39.877 l -33.225,-12.044 c -18.274,-6.6239 -33.574,-11.828 -34,-11.564 -0.42649,0.26359 -0.77543,17.948 -0.77543,39.298 0,31.913 0.24719,39.024 1.3894,39.972 1.4869,1.2341 63.264,23.957 65.361,24.042 0.97994,0.0393 1.25,-8.5651 1.25,-39.827 z m -71,-25.501 c 0,-30.327 -0.28731,-39.597 -1.25,-40.331 -1.8618,-1.4207 -62.966,-23.335 -65,-23.311 -1.6365,0.0188 -1.749,2.5338 -1.7347,38.77 0.00842,21.312 0.36403,39.299 0.79023,39.97 0.82488,1.2982 62.484,24.117 65.444,24.22 1.6381,0.0568 1.75,-2.458 1.75,-39.317 z m 335.62,-4.1481 c 9.1482,-6.9777 11.844,-20.232 5.0784,-24.971 -5.7021,-3.9939 -15.661,0.76266 -20.054,9.5781 -3.6482,7.3209 -3.5268,12.193 0.40145,16.121 2.657,2.657 3.5603,2.9796 7.0374,2.5132 2.194,-0.29428 5.5856,-1.7527 7.5369,-3.241 z m -264.62,-53.852 c 0,-30.318 -0.28758,-39.601 -1.25,-40.347 -1.8214,-1.4128 -62.93,-23.309 -65,-23.291 -1.6364,0.0146 -1.75,2.5395 -1.75,38.893 0,31.173 0.26417,39.097 1.333,39.984 1.4583,1.2103 63.39,24.02 65.417,24.093 0.9796,0.0354 1.25,-8.4729 1.25,-39.332 z m 0.76924,-66.066 c 0.14808,-12.605 -0.13031,-23.317 -0.61865,-23.806 -1.3201,-1.3201 -63.651,21.497 -63.651,23.3 0,0.96401 9.9298,5.0621 30.5,12.588 16.775,6.1371 31.175,11.086 32,10.997 1.2763,-0.13736 1.5402,-3.5799 1.7692,-23.079 z m -36.346,-13.849 c 17.008,-6.1847 31.081,-11.719 31.274,-12.299 0.42655,-1.2796 -61.208,-23.828 -62.668,-22.926 -1.7306,1.0696 -1.3483,46.992 0.3871,46.494 0.04583,-0.0131 13.999,-5.0841 31.006,-11.269 z m 71.697,-58.669 c 16.575,-6.0287 30.379,-11.204 30.675,-11.5 0.296,-0.296 0.32953,-0.74781 0.0739,-1.0034 -1.2792,-1.2792 -61.44,-22.53 -62.563,-22.099 -1.0209,0.39175 -1.3058,5.4167 -1.3058,23.032 0,19.304 0.21362,22.531 1.4915,22.531 0.82035,0 15.053,-4.9326 31.628,-10.961 z m 136.6,-25.708 c 7.1133,-3.3755 12.455,-14.257 10.261,-20.904 -1.3129,-3.978 -3.4957,-5.4288 -8.1602,-5.4235 -9.4005,0.0106 -18.805,13.438 -15.797,22.554 1.8496,5.6045 6.9034,6.9969 13.696,3.7735 z"
         fill="#d5d6d6"
         id="path4" />
      <path
         d="m 286.23,369.5 c 0.14938,-22.825 0.15298,-41.5 0.008,-41.5 -0.14496,1.8e-4 -1.045,0.4475 -2,0.99404 -3.509,2.0081 -68.367,25.006 -70.516,25.004 -1.2214,-10e-4 -17.521,-5.5483 -36.221,-12.327 l -34,-12.325 -0.43238,-165.85 2.2362,-1.6232 c 1.2299,-0.89276 15.952,-6.5842 32.716,-12.648 16.764,-6.0638 31.717,-11.593 33.23,-12.287 l 2.75,-1.2628 v -81.516 l 3.25,-1.9992 c 1.7875,-1.0995 17.875,-7.2212 35.75,-13.604 39.041,-13.94 31.893,-11.343 69.5,-25.251 17.115,-6.33 32.568,-11.478 34.5,-11.493 4.14,-0.033519 66.343,22.28 69.123,24.796 1.6773,1.5179 1.8786,3.3073 1.89,16.794 l 0.0127,15.095 33.237,11.9 c 18.281,6.5448 34.246,12.807 35.478,13.916 l 2.2409,2.0162 3.2e-4,82.304 c 3e-4,77.21 -0.10745,82.36 -1.7409,83.219 -2.3776,1.2503 -65.287,23.884 -67.559,24.307 -1.7243,0.32076 -1.8127,2.4764 -1.7199,41.941 0.0769,32.705 -0.17593,41.818 -1.1823,42.612 -1.0906,0.85993 -44.394,16.783 -64.78,23.82 -3.575,1.234 -21.35,7.6907 -39.5,14.348 -18.15,6.6574 -33.797,12.107 -34.772,12.111 -1.6714,0.006 -1.7562,-2.3392 -1.5,-41.494 z m 119.39,-29.025 c 9.1482,-6.9777 11.844,-20.232 5.0784,-24.971 -5.7021,-3.9939 -15.661,0.76266 -20.054,9.5781 -3.6482,7.3209 -3.5268,12.193 0.40145,16.121 2.657,2.657 3.5603,2.9796 7.0374,2.5132 2.194,-0.29428 5.5856,-1.7527 7.5369,-3.241 z m -118.1,-96.281 c -0.30789,-0.30789 -1.1148,-6.4e-4 -1.7931,0.68278 -0.98026,0.98762 -0.8654,1.1025 0.5598,0.5598 0.98622,-0.37553 1.5412,-0.93469 1.2333,-1.2426 z m 141.47,-51.423 c 0,-0.58531 -0.63541,-0.48812 -1.5,0.22943 -0.825,0.68469 -1.5,1.4007 -1.5,1.5911 0,0.1904 0.675,0.0872 1.5,-0.22943 0.825,-0.31659 1.5,-1.0326 1.5,-1.5911 z m -112.97,-70.79 c 8.444,-6.0126 11.927,-19.117 6.5179,-24.526 -8.9441,-8.9441 -27.163,7.4812 -23.403,21.099 0.51443,1.8631 1.9304,4.1066 3.1465,4.9854 2.9692,2.1457 9.5915,1.3944 13.739,-1.5586 z"
         fill="#e1cf92"
         id="path6" />
      <path
         d="m 287.46,408.75 c -0.26432,-0.68882 -0.3627,-18.772 -0.21861,-40.185 l 0.26197,-38.933 32.5,-11.807 c 17.875,-6.494 33.288,-11.811 34.25,-11.815 1.6372,-0.007 1.75,2.5312 1.75,39.37 0,30.318 -0.2876,39.601 -1.25,40.348 -1.0995,0.85386 -65.097,24.274 -66.331,24.274 -0.26489,0 -0.69788,-0.56358 -0.96221,-1.2524 z m 70.543,-64.125 c 0,-30.282 0.28872,-39.617 1.25,-40.415 1.522,-1.2627 64.432,-24.208 66.372,-24.208 1.9368,0 2.062,78.187 0.1278,79.792 -1.522,1.2627 -64.432,24.208 -66.372,24.208 -1.1471,0 -1.3778,-6.5941 -1.3778,-39.378 z m 41.831,-0.23858 c 4.044,-0.8088 10.735,-6.6115 13.204,-11.451 1.196,-2.3443 1.9655,-5.8561 1.9655,-8.9695 0,-4.322 -0.45401,-5.5708 -2.9231,-8.0398 -1.873,-1.873 -3.9386,-2.9152 -5.75,-2.9011 -4.788,0.0372 -11.003,3.5478 -14.273,8.0629 -6.133,8.4664 -6.4957,16.682 -0.94277,21.355 3.2574,2.7409 3.9567,2.8968 8.72,1.9441 z m -222.83,-2.7979 -33.5,-12.236 -0.43238,-165.85 2.2362,-1.6232 c 1.2299,-0.89276 15.952,-6.5842 32.716,-12.648 16.764,-6.0638 31.717,-11.593 33.23,-12.287 l 2.75,-1.2628 v -81.516 l 3.25,-1.9992 c 1.7875,-1.0995 17.875,-7.2212 35.75,-13.604 39.041,-13.94 31.893,-11.343 69.5,-25.251 17.115,-6.33 32.568,-11.478 34.5,-11.493 4.3592,-0.035293 66.713,22.453 69.227,24.967 1.7139,1.7139 1.8061,6.0366 1.7851,83.732 -0.0173,64.069 -0.29348,82.169 -1.267,83.047 -1.1055,0.99687 -23.632,9.3552 -59.245,21.982 -6.6,2.3401 -26.85,9.6494 -45,16.243 -18.15,6.5936 -33.809,12.151 -34.798,12.351 -1.6968,0.34251 -1.7937,2.6983 -1.7294,42.041 0.0534,32.671 -0.2065,41.853 -1.2025,42.486 -3.2511,2.0656 -69.189,25.326 -71.57,25.247 -1.4852,-0.049 -17.775,-5.5952 -36.2,-12.325 z m 139.03,-219.61 c 8.444,-6.0126 11.927,-19.117 6.5179,-24.526 -8.9441,-8.9441 -27.163,7.4812 -23.403,21.099 0.51443,1.8631 1.9304,4.1066 3.1465,4.9854 2.9692,2.1457 9.5915,1.3944 13.739,-1.5586 z m -29.028,164.64 c 0,-30.291 0.28845,-39.613 1.25,-40.399 1.462,-1.1945 64.702,-24.224 66.521,-24.224 1.876,0 1.7748,78.303 -0.10323,79.861 -1.6305,1.3532 -64.102,24.139 -66.182,24.139 -1.289,0 -1.4856,-5.2117 -1.4856,-39.378 z m 71,-26 c 0,-30.337 0.28699,-39.592 1.25,-40.312 0.6875,-0.51417 16.029,-6.2665 34.092,-12.783 26.794,-9.6664 33.006,-11.588 33.735,-10.438 1.4764,2.3322 1.1678,76.209 -0.32641,78.163 -1.3009,1.7015 -63.575,24.747 -66.872,24.747 -1.8053,0 -1.8778,-1.5208 -1.8778,-39.378 z m 71.496,13.229 c -0.28622,-0.74588 -0.40252,-18.905 -0.25843,-40.354 l 0.26197,-38.998 33.437,-12.193 c 18.39,-6.7064 33.803,-11.967 34.25,-11.691 0.44708,0.2763 0.81287,18.235 0.81287,39.908 0,37.624 -0.0855,39.452 -1.8909,40.418 -1.04,0.55658 -15.686,5.9945 -32.546,12.084 -16.86,6.0895 -31.306,11.322 -32.101,11.627 -0.79512,0.30512 -1.6798,-0.0555 -1.9661,-0.80139 z m 0.22811,-83.46 c -1.1458,-1.1458 -0.87929,-77.234 0.27813,-79.396 0.67028,-1.2524 0.67028,-2.079 0,-2.4933 -1.1767,-0.72723 -1.4177,-47.127 -0.2485,-47.85 1.1675,-0.72156 64.48,22.717 64.419,23.848 -0.0295,0.55 0.81941,1.323 1.8866,1.7178 1.8755,0.69378 1.9403,2.035 1.9403,40.128 0,30.326 -0.28813,39.641 -1.25,40.414 -1.0588,0.85021 -60.303,22.755 -64.775,23.949 -0.83898,0.22414 -1.8515,0.0815 -2.25,-0.31705 z"
         fill="#edce6d"
         id="path8" />
      <path
         d="m 288.45,407.72 c -0.2583,-0.67311 -0.35161,-18.312 -0.20737,-39.198 l 0.26227,-37.974 32,-11.71 c 17.6,-6.4404 32.562,-11.738 33.25,-11.773 0.97965,-0.0493 1.25,8.3489 1.25,38.83 0,36.111 -0.12518,38.942 -1.75,39.584 -1.5716,0.62062 -51.204,18.737 -60.543,22.099 -2.9492,1.0616 -3.8971,1.0931 -4.2623,0.14146 z m 70.793,-63.839 0.26161,-39.121 31,-11.233 c 17.05,-6.1784 32.018,-11.556 33.262,-11.95 l 2.2617,-0.71641 -0.52334,78.521 -32.5,11.793 c -17.875,6.4863 -32.843,11.801 -33.262,11.81 -0.41888,0.009 -0.64388,-17.588 -0.5,-39.104 z m 47.107,-1.6502 c 8.8766,-6.0768 12.557,-19.626 7.0946,-26.118 -6.5045,-7.7301 -19.215,-2.9672 -25.056,9.3893 -2.7391,5.7939 -2.9609,9.1819 -0.92072,14.065 2.814,6.7348 11.206,7.9188 18.882,2.6639 z M 177,341.58828 l -33.5,-12.236 -0.43238,-165.85 2.2362,-1.6232 c 1.2299,-0.89276 15.952,-6.5842 32.716,-12.648 16.764,-6.0638 31.717,-11.593 33.23,-12.287 l 2.75,-1.2628 v -81.516 l 3.25,-1.9992 c 1.7875,-1.0995 17.875,-7.2212 35.75,-13.604 39.041,-13.94 31.893,-11.343 69.5,-25.251 17.115,-6.33 32.568,-11.478 34.5,-11.493 4.3592,-0.035293 66.713,22.453 69.227,24.967 1.7139,1.7139 1.8061,6.0366 1.7851,83.732 -0.0173,64.069 -0.29348,82.169 -1.267,83.047 -1.1055,0.99687 -23.632,9.3552 -59.245,21.982 -6.6,2.3401 -26.85,9.6494 -45,16.243 -18.15,6.5936 -33.809,12.151 -34.798,12.351 -1.6968,0.34251 -1.7937,2.6983 -1.7294,42.041 0.0534,32.671 -0.2065,41.853 -1.2025,42.486 -3.2511,2.0656 -69.189,25.326 -71.57,25.247 -1.4852,-0.049 -17.775,-5.5952 -36.2,-12.325 z m 139.03,-219.61 c 8.444,-6.0126 11.927,-19.117 6.5179,-24.526 -8.9441,-8.9441 -27.163,7.4812 -23.403,21.099 0.51443,1.8631 1.9304,4.1066 3.1465,4.9854 2.9692,2.1457 9.5915,1.3944 13.739,-1.5586 z m -27.789,163.88 0.26161,-39.138 31,-11.217 c 17.05,-6.1692 32.018,-11.539 33.262,-11.933 l 2.2617,-0.7166 -0.52334,78.521 -32.5,11.793 c -17.875,6.4863 -32.843,11.801 -33.262,11.81 -0.41888,0.009 -0.64388,-17.595 -0.5,-39.121 z m 70.762,-25.753 v -38.891 l 11.25,-4.1069 c 39.614,-14.462 54.77,-19.758 55.228,-19.299 0.28689,0.28689 0.52162,17.756 0.52162,38.82 0,35.455 -0.1299,38.367 -1.75,39.223 -2.5284,1.3366 -63.075,23.145 -64.257,23.145 -0.63983,0 -0.99263,-13.823 -0.99263,-38.891 z m 71,-25.574 c 0,-36.117 0.11066,-38.524 1.8127,-39.435 2.6397,-1.4127 62.824,-23.1 64.105,-23.1 0.75784,0 1.0823,11.655 1.0823,38.877 v 38.877 l -32.088,11.623 c -17.648,6.3926 -32.723,11.623 -33.5,11.623 -1.1913,0 -1.4118,-6.008 -1.4118,-38.465 z m 0.4451,-45.818 c -0.2583,-0.67311 -0.35161,-18.312 -0.20737,-39.198 l 0.26227,-37.974 32,-11.71 c 17.6,-6.4404 32.562,-11.738 33.25,-11.773 0.97966,-0.04927 1.25,8.3528 1.25,38.85 v 38.913 l -6.75,2.5457 c -5.4217,2.0448 -33.872,12.394 -55.543,20.204 -2.9487,1.0627 -3.8971,1.0945 -4.2623,0.14303 z m -0.4451,-104.78 c 0,-21.524 0.11711,-23.028 1.75,-22.486 16.065,5.3349 60.568,22.312 60.432,23.054 -0.18412,1.0068 -58.283,22.5 -60.821,22.5 -1.1087,0 -1.361,-4.2766 -1.361,-23.067 z"
         fill="#fdd042"
         id="path10" />
      <path
         d="m 177,341.59 -33.5,-12.236 -0.43238,-165.85 2.2362,-1.6232 c 1.2299,-0.89276 15.952,-6.5842 32.716,-12.648 16.764,-6.0638 31.717,-11.593 33.23,-12.287 l 2.75,-1.2628 V 54.167 l 3.25,-1.9992 c 1.7875,-1.0995 17.875,-7.2212 35.75,-13.604 39.041,-13.94 31.893,-11.343 69.5,-25.251 17.115,-6.33 32.568,-11.478 34.5,-11.493 4.3592,-0.035293 66.713,22.453 69.227,24.967 1.7139,1.7139 1.8061,6.0366 1.7851,83.732 -0.0173,64.069 -0.29348,82.169 -1.267,83.047 -1.1055,0.99687 -23.632,9.3552 -59.245,21.982 -6.6,2.3401 -26.85,9.6494 -45,16.243 -18.15,6.5936 -33.809,12.151 -34.798,12.351 -1.6968,0.34251 -1.7937,2.6983 -1.7294,42.041 0.0534,32.671 -0.2065,41.853 -1.2025,42.486 -3.2511,2.0656 -69.189,25.326 -71.57,25.247 -1.4852,-0.049 -17.775,-5.5952 -36.2,-12.325 z M 316.03,121.98 c 8.444,-6.0126 11.927,-19.117 6.5179,-24.526 -8.9441,-8.9441 -27.163,7.4812 -23.403,21.099 0.51443,1.8631 1.9304,4.1066 3.1465,4.9854 2.9692,2.1457 9.5915,1.3944 13.739,-1.5586 z m 114.64,-16.647 c -0.92391,-0.9239 -0.84346,-42.11 0.0833,-42.661 0.55979,-0.3325 36.098,12.197 59.143,20.851 0.76622,0.28775 1.1661,0.75022 0.88861,1.0277 -0.60649,0.60651 -57.658,21.448 -58.712,21.448 -0.40492,0 -1.0362,-0.3 -1.4029,-0.66667 z"
         fill="#92a7b6"
         id="path12" />
      <path
         d="m 178,340.64 -33.5,-12.175 -0.26134,-40.232 c -0.23661,-36.423 -0.10894,-40.232 1.3485,-40.232 1.6512,0 61.311,21.373 64.913,23.254 1.1,0.57474 2.31,1.5222 2.689,2.1055 0.4554,0.70102 1.3029,0.50794 2.5,-0.56958 2.0288,-1.8261 64.495,-24.79 67.433,-24.79 1.8053,0 1.8778,1.5208 1.8778,39.378 0,30.31 -0.28783,39.604 -1.25,40.362 -2.7425,2.1593 -66.144,24.391 -68.101,23.879 -1.1249,-0.29415 -2.5186,-0.14554 -3.0972,0.33026 -0.633,0.52051 -14.396,-3.9843 -34.552,-11.31 z m 0.47484,-83.438 c -17.614,-6.4353 -32.576,-12.065 -33.25,-12.51 -0.93251,-0.61592 -1.2248,-10.342 -1.2248,-40.75 0,-39.274 0.0334,-39.941 2,-39.941 1.1,0 2,-0.63098 2,-1.4022 0,-0.7712 1.2375,-1.8451 2.75,-2.3864 1.5125,-0.5413 16.645,-6.0197 33.628,-12.174 22.08,-8.0012 31.625,-11.022 33.5,-10.6 2.3878,0.53731 2.4432,0.48484 0.62159,-0.58836 -1.1,-0.64805 -2.3306,-1.6667 -2.7347,-2.2637 -0.40408,-0.597 -0.74158,-18.762 -0.75,-40.367 -0.0142,-36.502 0.1085,-39.328 1.7347,-39.938 0.9625,-0.36115 2.2,-1.2241 2.75,-1.9177 1.3998,-1.7652 64.357,-24.355 67.89,-24.359 1.5894,-0.002 3.3894,-0.6534 4,-1.4475 0.98048,-1.275 63.378,-24.556 65.815,-24.556 1.2208,0 61.525,21.785 64.06,23.142 1.0396,0.5564 1.6758,1.5705 1.4137,2.2535 -0.29242,0.76205 0.35375,1.2154 1.6724,1.1733 l 2.149,-0.06855 0.26136,39.618 c 0.20404,30.929 -0.0153,39.844 -1,40.649 -1.4695,1.2008 -64.705,24.233 -66.532,24.233 -0.67622,0 -1.2395,-0.5625 -1.2517,-1.25 -0.0122,-0.6875 -0.82029,-0.2128 -1.7957,1.0549 -2.4246,3.1512 -66.923,26.795 -69.232,25.379 -1.0422,-0.63909 -2.138,-0.51979 -3.3472,0.36439 -0.98876,0.723 -2.5415,1.0362 -3.4506,0.696 -1.4215,-0.532 -1.4658,-0.38858 -0.31671,1.0249 0.73485,0.90389 1.0458,2.1131 0.69098,2.6872 -0.38392,0.6212 0.39095,1.0438 1.9139,1.0438 h 2.559 v 39.378 c 0,32.98 -0.23301,39.571 -1.4343,40.568 -0.78886,0.65469 -16.187,6.5336 -34.218,13.064 -24.763,8.969 -33.108,11.605 -34.108,10.774 -0.96668,-0.80227 -1.6375,-0.78653 -2.4823,0.0582 -0.63669,0.63669 -1.4051,1.1354 -1.7076,1.1082 -0.3025,-0.0272 -14.961,-5.3147 -32.575,-11.75 z m 37.296,-69.013 c 0.21982,-0.65946 -0.5166,-1.1875 -1.6561,-1.1875 -1.4381,0 -1.8749,0.46137 -1.4601,1.5423 0.65496,1.7068 2.499,1.4968 3.1162,-0.35476 z m 61.229,-30.097 c -0.825,-0.46674 -2.625,-1.1236 -4,-1.4597 -2.0838,-0.50933 -2.0006,-0.37052 0.5,0.83393 3.2047,1.5436 6.0083,2.0448 3.5,0.62574 z m -11,-4 c -0.825,-0.46674 -2.625,-1.1236 -4,-1.4597 -2.0838,-0.50933 -2.0006,-0.37052 0.5,0.83393 3.2047,1.5436 6.0083,2.0448 3.5,0.62574 z m -10,-3.4966 c 0,-0.60605 -9.2758,-3.6515 -9.7321,-3.1952 -0.21611,0.2161 1.5477,1.0793 3.9196,1.9181 4.6746,1.6533 5.8125,1.9033 5.8125,1.2771 z m -15,-5.5034 c -0.825,-0.46674 -2.625,-1.1236 -4,-1.4597 -2.0838,-0.50933 -2.0006,-0.37052 0.5,0.83393 3.2047,1.5436 6.0083,2.0448 3.5,0.62574 z m -11,-4 c -0.825,-0.46674 -2.625,-1.1236 -4,-1.4597 -2.0838,-0.50933 -2.0006,-0.37052 0.5,0.83393 3.2047,1.5436 6.0083,2.0448 3.5,0.62574 z m 83.541,-16.97 c 7.3743,-3.3497 12.459,-11.375 12.459,-19.665 0,-3.7609 -0.53791,-5.147 -2.9231,-7.5321 -4.9762,-4.9762 -12.153,-3.7331 -18.715,3.2416 -4.5006,4.7836 -6.362,9.0443 -6.362,14.563 0,9.6638 6.4124,13.539 15.541,9.3925 z m -27.695,-46.951 c -2.699,-0.44236 -3.4109,0.44596 -1.8575,2.3177 1.1379,1.3711 1.4133,1.3469 2.575,-0.22583 1.123,-1.5204 1.025,-1.8063 -0.71751,-2.0919 z m 73.835,-25.763 c -0.0999,-0.06787 -1.8691,-0.3838 -3.9316,-0.70207 -3.0897,-0.47678 -3.75,-0.27932 -3.75,1.1213 0,0.935 1.0125,2.1715 2.25,2.7478 1.8382,0.856 2.5578,0.67338 3.9316,-0.99793 0.92488,-1.1251 1.5999,-2.1012 1.5,-2.1691 z m -72.554,190.32 c -0.7971,-0.7971 -1.1278,-12.178 -1.1278,-38.817 0,-34.467 0.1496,-37.86 1.75,-39.686 2.5691,-2.9309 66.109,-25.766 67.585,-24.29 0.82218,0.82218 1.5185,0.5853 2.6406,-0.89833 1.6427,-2.1719 66.591,-26.423 68.163,-25.451 0.47339,0.29257 0.86072,18.265 0.86072,39.938 0,37.127 -0.10556,39.462 -1.8256,40.383 -1.0041,0.53736 -16.16,6.1875 -33.679,12.556 -21.667,7.8761 -32.18,11.252 -32.874,10.558 -1.4829,-1.4829 -2.3252,-1.2588 -2.8529,0.75906 -0.34169,1.3066 -7.3515,4.2704 -26.367,11.148 -14.246,5.1524 -29.331,10.619 -33.523,12.148 -5.6571,2.0632 -7.913,2.4892 -8.75,1.6522 z m 143.54,-136.39 c -0.92391,-0.9239 -0.84346,-42.11 0.0833,-42.661 0.55979,-0.3325 36.098,12.197 59.143,20.851 0.76622,0.28775 1.1661,0.75022 0.88861,1.0277 -0.60649,0.60651 -57.658,21.448 -58.712,21.448 -0.40492,0 -1.0362,-0.3 -1.4029,-0.66667 z"
         fill="#fdc81e"
         id="path14" />
      <path
         d="m 178,340.64 -33.5,-12.175 -0.26134,-40.232 c -0.23661,-36.423 -0.10894,-40.232 1.3485,-40.232 1.6512,0 61.311,21.373 64.913,23.254 1.1,0.57474 2.31,1.5222 2.689,2.1055 0.4554,0.70102 1.3029,0.50794 2.5,-0.56958 2.0288,-1.8261 64.495,-24.79 67.433,-24.79 1.8053,0 1.8778,1.5208 1.8778,39.378 0,30.31 -0.28783,39.604 -1.25,40.362 -2.7425,2.1593 -66.144,24.391 -68.101,23.879 -1.1249,-0.29415 -2.5186,-0.14554 -3.0972,0.33026 -0.633,0.52051 -14.396,-3.9843 -34.552,-11.31 z m 0.47484,-83.438 c -17.614,-6.4353 -32.576,-12.065 -33.25,-12.51 -0.93251,-0.61592 -1.2248,-10.342 -1.2248,-40.75 0,-39.274 0.0334,-39.941 2,-39.941 1.1,0 2,-0.63098 2,-1.4022 0,-0.7712 1.2375,-1.8451 2.75,-2.3864 1.5125,-0.5413 16.645,-6.0197 33.628,-12.174 22.08,-8.0012 31.625,-11.022 33.5,-10.6 2.3878,0.53731 2.4432,0.48484 0.62159,-0.58836 -1.1,-0.64805 -2.3306,-1.6667 -2.7347,-2.2637 -0.40408,-0.597 -0.74158,-18.762 -0.75,-40.367 -0.0142,-36.502 0.1085,-39.328 1.7347,-39.938 0.9625,-0.36115 2.2,-1.2241 2.75,-1.9177 1.3998,-1.7652 64.357,-24.355 67.89,-24.359 1.5894,-0.002 3.3894,-0.6534 4,-1.4475 0.98048,-1.275 63.378,-24.556 65.815,-24.556 1.2208,0 61.525,21.785 64.06,23.142 1.0396,0.5564 1.6758,1.5705 1.4137,2.2535 -0.29242,0.76205 0.35375,1.2154 1.6724,1.1733 l 2.149,-0.06855 0.26136,39.618 c 0.20404,30.929 -0.0153,39.844 -1,40.649 -1.4695,1.2008 -64.705,24.233 -66.532,24.233 -0.67622,0 -1.2395,-0.5625 -1.2517,-1.25 -0.0122,-0.6875 -0.82029,-0.2128 -1.7957,1.0549 -2.4246,3.1512 -66.923,26.795 -69.232,25.379 -1.0422,-0.63909 -2.138,-0.51979 -3.3472,0.36439 -0.98876,0.723 -2.5415,1.0362 -3.4506,0.696 -1.4215,-0.532 -1.4658,-0.38858 -0.31671,1.0249 0.73485,0.90389 1.0458,2.1131 0.69098,2.6872 -0.38392,0.6212 0.39095,1.0438 1.9139,1.0438 h 2.559 v 39.378 c 0,32.98 -0.23301,39.571 -1.4343,40.568 -0.78886,0.65469 -16.187,6.5336 -34.218,13.064 -24.763,8.969 -33.108,11.605 -34.108,10.774 -0.96668,-0.80227 -1.6375,-0.78653 -2.4823,0.0582 -0.63669,0.63669 -1.4051,1.1354 -1.7076,1.1082 -0.3025,-0.0272 -14.961,-5.3147 -32.575,-11.75 z m 37.296,-69.013 c 0.21982,-0.65946 -0.5166,-1.1875 -1.6561,-1.1875 -1.4381,0 -1.8749,0.46137 -1.4601,1.5423 0.65496,1.7068 2.499,1.4968 3.1162,-0.35476 z m 61.229,-30.097 c -0.825,-0.46674 -2.625,-1.1236 -4,-1.4597 -2.0838,-0.50933 -2.0006,-0.37052 0.5,0.83393 3.2047,1.5436 6.0083,2.0448 3.5,0.62574 z m -11,-4 c -0.825,-0.46674 -2.625,-1.1236 -4,-1.4597 -2.0838,-0.50933 -2.0006,-0.37052 0.5,0.83393 3.2047,1.5436 6.0083,2.0448 3.5,0.62574 z m -10,-3.4966 c 0,-0.60605 -9.2758,-3.6515 -9.7321,-3.1952 -0.21611,0.2161 1.5477,1.0793 3.9196,1.9181 4.6746,1.6533 5.8125,1.9033 5.8125,1.2771 z m -15,-5.5034 c -0.825,-0.46674 -2.625,-1.1236 -4,-1.4597 -2.0838,-0.50933 -2.0006,-0.37052 0.5,0.83393 3.2047,1.5436 6.0083,2.0448 3.5,0.62574 z m -11,-4 c -0.825,-0.46674 -2.625,-1.1236 -4,-1.4597 -2.0838,-0.50933 -2.0006,-0.37052 0.5,0.83393 3.2047,1.5436 6.0083,2.0448 3.5,0.62574 z m 83.541,-16.97 c 7.3743,-3.3497 12.459,-11.375 12.459,-19.665 0,-3.7609 -0.53791,-5.147 -2.9231,-7.5321 -4.9762,-4.9762 -12.153,-3.7331 -18.715,3.2416 -4.5006,4.7836 -6.362,9.0443 -6.362,14.563 0,9.6638 6.4124,13.539 15.541,9.3925 z m -27.695,-46.951 c -2.699,-0.44236 -3.4109,0.44596 -1.8575,2.3177 1.1379,1.3711 1.4133,1.3469 2.575,-0.22583 1.123,-1.5204 1.025,-1.8063 -0.71751,-2.0919 z m 73.835,-25.763 c -0.0999,-0.06787 -1.8691,-0.3838 -3.9316,-0.70207 -3.0897,-0.47678 -3.75,-0.27932 -3.75,1.1213 0,0.935 1.0125,2.1715 2.25,2.7478 1.8382,0.856 2.5578,0.67338 3.9316,-0.99793 0.92488,-1.1251 1.5999,-2.1012 1.5,-2.1691 z m -72.554,190.32 c -0.7971,-0.7971 -1.1278,-12.178 -1.1278,-38.817 0,-34.467 0.1496,-37.86 1.75,-39.686 2.5691,-2.9309 66.109,-25.766 67.585,-24.29 0.82218,0.82218 1.5185,0.5853 2.6406,-0.89833 1.6427,-2.1719 66.591,-26.423 68.163,-25.451 0.47339,0.29257 0.86072,18.265 0.86072,39.938 0,37.127 -0.10556,39.462 -1.8256,40.383 -1.0041,0.53736 -16.16,6.1875 -33.679,12.556 -21.667,7.8761 -32.18,11.252 -32.874,10.558 -1.4829,-1.4829 -2.3252,-1.2588 -2.8529,0.75906 -0.34169,1.3066 -7.3515,4.2704 -26.367,11.148 -14.246,5.1524 -29.331,10.619 -33.523,12.148 -5.6571,2.0632 -7.913,2.4892 -8.75,1.6522 z"
         fill="#6a8fae"
         id="path16" />
      <path
         d="m 182,341.42 c -15.675,-5.7232 -30.412,-11.121 -32.75,-11.996 L 145,327.8338 v -39.417 c 0,-31.128 0.26618,-39.417 1.2657,-39.417 1.3958,0 61.019,21.547 63.922,23.1 1.7033,0.91158 1.8127,3.3525 1.8127,40.435 0,21.706 -0.3375,39.426 -0.75,39.378 -0.4125,-0.0476 -13.575,-4.7693 -29.25,-10.493 z m 34.238,-29.622 0.26161,-39.201 32.5,-11.798 c 17.875,-6.4891 33.068,-11.799 33.762,-11.799 0.99845,-5.6e-4 1.207,8.1617 1,39.131 L 283.5,327.262 251,339.112 c -17.875,6.5177 -33.068,11.859 -33.762,11.869 -0.99871,0.0145 -1.2071,-8.1503 -1,-39.182 z m -38.738,-55.771 -32,-11.759 -0.26147,-39.634 c -0.20708,-31.389 9.5e-4,-39.625 1,-39.591 0.69381,0.0236 15.661,5.3111 33.261,11.75 l 32,11.707 0.26147,39.75 c 0.20727,31.509 -6e-5,39.728 -1,39.644 -0.69381,-0.0586 -15.661,-5.3981 -33.261,-11.866 z m 38.738,-28.124 0.26161,-39.097 31.477,-11.441 c 17.312,-6.2927 32.505,-11.699 33.762,-12.015 l 2.2852,-0.57353 -0.52342,78.723 -32,11.707 c -17.6,6.4389 -32.793,11.726 -33.762,11.75 -1.6572,0.0403 -1.7461,-2.2747 -1.5,-39.054 z m 72,-26.025 0.26161,-39.121 31,-11.233 c 17.05,-6.1784 32.012,-11.554 33.25,-11.946 l 2.25,-0.71271 v 38.945 c 0,29.981 -0.28773,39.164 -1.25,39.899 -1.5898,1.2131 -62.819,23.338 -64.512,23.311 -0.99816,-0.0159 -1.207,-8.1892 -1,-39.141 z M 359,176.635 v -39.364 l 4.25,-1.5903 c 2.3375,-0.87464 16.625,-6.0729 31.75,-11.552 15.125,-5.4788 28.288,-10.273 29.25,-10.653 1.6488,-0.65109 1.75,1.5933 1.75,38.809 0,36.691 -0.12447,39.549 -1.75,40.187 -4.1232,1.6196 -64.529,23.527 -64.872,23.527 -0.20779,0 -0.3778,-17.714 -0.3778,-39.364 z m -177.47,-2.1238 c -17.031,-6.2174 -31.11,-11.738 -31.286,-12.268 -0.1766,-0.5298 14.321,-6.2764 32.218,-12.77 l 32.539,-11.807 31.694,11.506 c 17.432,6.3282 31.834,11.927 32.006,12.441 0.29413,0.88239 -63.071,24.492 -65.205,24.295 -0.55,-0.0508 -14.934,-5.1793 -31.965,-11.397 z m 67.465,-27.849 c -16.775,-6.158 -31.062,-11.553 -31.75,-11.989 -0.96557,-0.61224 -1.25,-9.7916 -1.25,-40.341 0,-31.216 0.26336,-39.452 1.25,-39.091 0.6875,0.2516 15.353,5.5475 32.59,11.769 17.237,6.2212 31.98,11.951 32.762,12.733 1.1884,1.1884 1.3786,7.6795 1.1597,39.588 -0.25616,37.344 -0.30489,38.171 -2.2618,38.347 -1.1,0.099 -15.725,-4.8584 -32.5,-11.016 z m 38,-27.605 c 0,-28.999 0.30342,-39.129 1.1885,-39.676 2.4997,-1.5449 65.349,-24.073 66.062,-23.68 0.4125,0.22794 0.75,17.883 0.75,39.234 v 38.82 l -2.75,1.098 c -6.1385,2.451 -63.804,23.142 -64.5,23.143 -0.4125,7e-4 -0.75,-17.522 -0.75,-38.94 z m 28.15,5.3468 c 4.0909,-2.0895 9.4795,-9.0094 10.863,-13.95 4.3502,-15.537 -9.7175,-23.214 -21.526,-11.746 -14.446,14.029 -6.06,34.237 10.663,25.696 z m 43.85,-31.347 c 0,-30.064 0.28495,-39.121 1.25,-39.732 1.91,-1.2093 63.073,-23.324 64.512,-23.325 0.99848,-0.0011 1.207,8.1721 1,39.188 l -0.26161,39.19 -32.5,11.793 c -17.875,6.4863 -32.838,11.801 -33.25,11.81 -0.4125,0.009 -0.75,-17.506 -0.75,-38.924 z M 251.765,64.681 c -16.903,-6.1509 -30.594,-11.625 -30.423,-12.165 0.39652,-1.2533 61.318,-23.522 64.656,-23.633 2.2573,-0.07554 62.446,21.227 63.799,22.58 0.31212,0.31212 0.14749,0.94995 -0.36585,1.4174 -1.5412,1.4034 -62.772,23.153 -64.933,23.065 -1.1,-0.04484 -15.83,-5.1141 -32.733,-11.265 z m 72,-26 C 306.862,32.5301 293.174,27.048 293.347,26.498 293.73604,25.2647 354.664,2.98 357.474,3.044 c 2.9912,0.0675 64.057,22.54 63.839,23.493 -0.25024,1.0941 -62.263,23.479 -64.809,23.394 -1.1026,-0.03664 -15.835,-5.0991 -32.738,-11.25 z"
         fill="#4779a3"
         id="path18" />
      <path
         d="m 179.55,339.48 c -17.023,-6.186 -31.76,-11.753 -32.75,-12.371 -1.681,-1.0498 -1.7998,-3.5951 -1.7998,-38.556 0,-24.407 0.35553,-37.652 1.0217,-38.064 0.92381,-0.57094 62.433,20.966 64.24,22.493 0.41905,0.35409 0.64405,17.992 0.5,39.195 l -0.26192,38.551 z M 217,311.629 v -38.373 l 32.25,-11.641 c 17.738,-6.4025 32.588,-11.635 33,-11.627 0.4125,0.008 0.75,17.261 0.75,38.341 v 38.327 l -32.298,11.673 c -17.764,6.4199 -32.614,11.673 -33,11.673 -0.386,0 -0.70229,-17.268 -0.70229,-38.373 z m -39,-56.35 c -17.325,-6.3312 -31.831,-12.021 -32.235,-12.644 -1.0622,-1.6384 -0.94029,-75.407 0.12572,-76.066 0.49007,-0.30288 15.34,4.6757 33,11.063 l 32.109,11.614 v 38.878 c 0,21.383 -0.3375,38.83 -0.75,38.772 -0.4125,-0.058 -14.925,-5.2856 -32.25,-11.617 z m 39,-27.053 V 189.5 l 31.75,-11.428 c 17.462,-6.2852 32.312,-11.621 33,-11.856 0.98578,-0.33797 1.25,7.7114 1.25,38.081 v 38.509 l -2.75,0.98909 c -8.7438,3.1449 -58.198,21.206 -60.5,22.095 l -2.75,1.0622 z m 72,-26.525 V 163.4 l 31.646,-11.449 c 17.405,-6.2972 32.035,-11.601 32.512,-11.787 0.48206,-0.18768 0.75018,16.852 0.60449,38.415 l -0.26182,38.752 -31,11.284 c -17.05,6.2063 -31.562,11.307 -32.25,11.335 -0.97913,0.0399 -1.25,-8.2487 -1.25,-38.25 z m 71.238,-25.446 0.26174,-38.734 25.5,-9.2112 c 14.025,-5.0662 28.538,-10.331 32.25,-11.7 l 6.75,-2.4884 -0.012,77.379 -24.744,8.9141 c -13.609,4.9028 -28.237,10.187 -32.506,11.744 l -7.7617,2.8297 0.26174,-38.734 z m -177.99,-2.5086 c -16.638,-6.0949 -30.25,-11.363 -30.25,-11.707 0,-0.64917 61.152,-23.039 62.925,-23.039 0.55284,0 13.508,4.5489 28.79,10.109 15.282,5.5598 29.056,10.566 30.611,11.124 1.5542,0.55853 2.4542,1.3816 2,1.829 -0.96225,0.94797 -61.66,22.98 -62.955,22.852 -0.47897,-0.0476 -14.483,-5.0733 -31.121,-11.168 z m 66.25,-28.265 -31,-11.343 -0.52314,-78.057 3.7616,1.3543 c 35.221,12.681 59.987,21.922 60.997,22.76 0.97926,0.81271 1.265,9.6058 1.265,38.927 0,35.441 -0.11257,37.872 -1.75,37.789 -0.9625,-0.0487 -15.7,-5.1927 -32.75,-11.431 z m 39.738,-27.049 0.26174,-38.569 65,-23.571 0.26206,38.043 c 0.14413,20.923 -0.0895,38.394 -0.51921,38.824 -0.65916,0.65916 -63.744,23.843 -64.879,23.843 -0.2132,0 -0.26985,-17.356 -0.12589,-38.569 z m 25.086,7.6362 c 9.7626,-3.7117 16.911,-17.783 13.356,-26.291 -5.5301,-13.235 -24.697,-6.8016 -29.724,9.9777 -2.6425,8.8199 2.1957,17.246 9.9023,17.246 2.2065,0 5.1161,-0.41986 6.4658,-0.93301 z m 46.914,-33.552 0.26185,-38.708 31.373,-11.403 c 17.255,-6.2719 31.767,-11.403 32.25,-11.403 0.48802,0 0.87746,17.013 0.87746,38.332 v 38.332 l -31.25,11.321 c -17.188,6.2268 -31.818,11.528 -32.512,11.78 -1.0048,0.36494 -1.2085,-7.4268 -1,-38.25 z m -107.24,-28.453 c -16.225,-5.9236 -29.415,-11.135 -29.31,-11.581 0.10443,-0.44609 14.187,-5.899 31.295,-12.118 l 31.105,-11.307 30.951,11.222 c 17.023,6.1721 30.953,11.499 30.955,11.838 0.005,0.93934 -61.21,22.939 -63.497,22.82 -1.1,-0.05735 -15.275,-4.9508 -31.5,-10.874 z m 72.182,-25.962 c -16.125,-5.8978 -29.253,-11.145 -29.174,-11.661 0.17315,-1.1238 58.33,-22.438 61.223,-22.438 1.8339,0 58.375,20.121 61.578,21.913 1.5038,0.84158 -58.962,23.15 -62.335,22.998 -1.0857,-0.04886 -15.167,-4.9143 -31.292,-10.812 z"
         fill="#3674a8"
         id="path20" />
      <path
         d="m 179.55,339.48 c -17.023,-6.186 -31.76,-11.753 -32.75,-12.371 -1.681,-1.0498 -1.7998,-3.5951 -1.7998,-38.556 0,-24.407 0.35553,-37.652 1.0217,-38.064 0.92381,-0.57094 62.433,20.966 64.24,22.493 0.41905,0.35409 0.64405,17.992 0.5,39.195 l -0.26192,38.551 z m -1.5498,-84.201 c -17.325,-6.3312 -31.831,-12.021 -32.235,-12.644 -1.0622,-1.6384 -0.94029,-75.407 0.12572,-76.066 0.49007,-0.30288 15.34,4.6757 33,11.063 l 32.109,11.614 v 38.878 c 0,21.383 -0.3375,38.83 -0.75,38.772 -0.4125,-0.058 -14.925,-5.2856 -32.25,-11.617 z m 4.25,-81.532 c -16.638,-6.0949 -30.25,-11.363 -30.25,-11.707 0,-0.64917 61.152,-23.039 62.925,-23.039 0.55284,0 13.508,4.5489 28.79,10.109 15.282,5.5598 29.056,10.566 30.611,11.124 1.5542,0.55853 2.4542,1.3816 2,1.829 -0.96225,0.94797 -61.66,22.98 -62.955,22.852 -0.47897,-0.0476 -14.483,-5.0733 -31.121,-11.168 z m 66.25,-28.265 -31,-11.343 -0.52314,-78.057 3.7616,1.3543 c 35.221,12.681 59.987,21.922 60.997,22.76 0.97926,0.81271 1.265,9.6058 1.265,38.927 0,35.441 -0.11257,37.872 -1.75,37.789 -0.9625,-0.0487 -15.7,-5.1927 -32.75,-11.431 z m 4.5,-81.419 c -16.225,-5.9236 -29.415,-11.135 -29.31,-11.581 0.10443,-0.44609 14.187,-5.899 31.295,-12.118 l 31.105,-11.307 30.951,11.222 c 17.023,6.1721 30.953,11.499 30.955,11.838 0.005,0.93934 -61.21,22.939 -63.497,22.82 -1.1,-0.05735 -15.275,-4.9508 -31.5,-10.874 z m 72.182,-25.962 c -16.125,-5.8978 -29.253,-11.145 -29.174,-11.661 0.17315,-1.1238 58.33,-22.438 61.223,-22.438 1.8339,0 58.375,20.121 61.578,21.913 1.5038,0.84158 -58.962,23.15 -62.335,22.998 -1.0857,-0.04886 -15.167,-4.9143 -31.292,-10.812 z"
         fill="#2e6390"
         id="path22" />
    </g>
    <g
       fill="#ffffff"
       id="g44">
      <path
         d="m 113.77,151.17 c 0,-0.29037 0.005,-0.52796 0.011,-0.52796 0.006,0 0.1782,-0.0679 0.38251,-0.15099 l 0.37147,-0.15098 v 1.026 l -0.11459,0.0546 c -0.063,0.03 -0.23515,0.10469 -0.38251,0.16597 l -0.26792,0.11142 z"
         stroke-width="0.035506"
         id="path26" />
      <path
         d="m 116.26,150.13 v -0.50745 l 0.34093,-0.14219 c 0.18752,-0.0782 0.36008,-0.15034 0.38348,-0.16029 0.0335,-0.0143 0.0406,0.093 0.0333,0.50679 l -0.009,0.52488 -0.33262,0.13963 c -0.18294,0.0768 -0.35133,0.14108 -0.37419,0.14285 -0.0313,0.002 -0.0416,-0.12181 -0.0416,-0.50422 z"
         stroke-width="0.035506"
         id="path28" />
      <g
         stroke-width="0.017753"
         id="g42">
        <path
           d="m 111.73,149.75 c -0.14635,-0.0621 -0.28065,-0.11957 -0.29844,-0.12761 -0.0243,-0.011 0.0354,-0.043 0.24115,-0.12919 0.15042,-0.063 0.29033,-0.12049 0.31092,-0.12774 l 0.0374,-0.0132 v 0.2571 c 0,0.14141 -0.006,0.25632 -0.0125,0.25535 -0.007,-9.6e-4 -0.13221,-0.0526 -0.27857,-0.11473 z"
           id="path30" />
        <path
           d="m 112.54,148.97 c -0.14635,-0.0624 -0.27225,-0.12042 -0.27976,-0.12888 -0.008,-0.008 0.10848,-0.0669 0.25778,-0.12986 0.14929,-0.063 0.28454,-0.12039 0.30055,-0.12763 0.0269,-0.0121 0.0291,0.007 0.0291,0.2447 0,0.19437 -0.005,0.25752 -0.0208,0.25651 -0.0114,-7.5e-4 -0.14053,-0.0524 -0.28688,-0.11484 z"
           id="path32" />
        <path
           d="m 112.53,148.29 c -0.15386,-0.066 -0.28286,-0.12348 -0.28666,-0.12782 -0.004,-0.004 0.0472,-0.0301 0.11343,-0.0572 0.0662,-0.0271 0.20455,-0.0839 0.30745,-0.12628 l 0.1871,-0.077 v 0.25553 c 0,0.19254 -0.005,0.25517 -0.0208,0.25409 -0.0114,-7.8e-4 -0.14667,-0.0554 -0.30053,-0.12135 z"
           id="path34" />
        <path
           d="m 113.35,147.51 c -0.15321,-0.0631 -0.27854,-0.11986 -0.27851,-0.12611 4e-5,-0.0112 0.57842,-0.24985 0.60282,-0.24878 0.007,3e-4 0.0125,0.1114 0.0125,0.2469 0,0.22267 -0.003,0.24618 -0.0291,0.24454 -0.016,-9.9e-4 -0.15446,-0.0534 -0.30768,-0.11655 z"
           id="path36" />
        <path
           d="m 114.76,147.52 c -0.0332,-0.054 -0.0342,-0.0977 -0.004,-0.16443 0.047,-0.10297 0.15552,-0.1786 0.20282,-0.14137 0.0499,0.0392 0.0585,0.0986 0.0264,0.18044 -0.0383,0.0976 -0.0803,0.14244 -0.14761,0.15778 -0.041,0.009 -0.0561,0.003 -0.0779,-0.0324 z"
           id="path38" />
        <path
           d="m 115.81,150.44 c -0.0507,-0.0502 -0.0544,-0.10156 -0.0139,-0.1932 0.0257,-0.058 0.0571,-0.0955 0.10026,-0.11954 0.0584,-0.0325 0.0658,-0.0328 0.10395,-0.004 0.049,0.0366 0.0545,0.11519 0.0147,0.2106 -0.0444,0.10649 -0.14972,0.16118 -0.20507,0.10644 z"
           id="path40" />
      </g>
    </g>
  </g>
</svg>
