<?xml version="1.0" encoding="UTF-8" standalone="no"?>
<svg
   viewBox="0 0 96 96"
   version="1.1"
   id="svg6"
   sodipodi:docname="sbLogViewerNew96.svg"
   width="96"
   height="96"
   inkscape:version="1.2.2 (b0a8486541, 2022-12-01)"
   xmlns:inkscape="http://www.inkscape.org/namespaces/inkscape"
   xmlns:sodipodi="http://sodipodi.sourceforge.net/DTD/sodipodi-0.dtd"
   xmlns="http://www.w3.org/2000/svg"
   xmlns:svg="http://www.w3.org/2000/svg">
  <sodipodi:namedview
     id="namedview8"
     pagecolor="#ffffff"
     bordercolor="#666666"
     borderopacity="1.0"
     inkscape:pageshadow="2"
     inkscape:pageopacity="0.0"
     inkscape:pagecheckerboard="0"
     showgrid="false"
     inkscape:zoom="7.1590909"
     inkscape:cx="40.996825"
     inkscape:cy="54.266667"
     inkscape:window-width="2580"
     inkscape:window-height="1080"
     inkscape:window-x="334"
     inkscape:window-y="0"
     inkscape:window-maximized="0"
     inkscape:current-layer="svg6"
     inkscape:showpageshadow="2"
     inkscape:deskcolor="#d1d1d1" />
  <defs
     id="defs3051">
    <style
       type="text/css"
       id="current-color-scheme">
      .ColorScheme-Text {
        color:#eff0f1;
      }
      </style>
  </defs>
  <path
     style="fill:currentColor;fill-opacity:1;stroke:none;stroke-width:5.24999"
     d="m 6,6 v 5.25 H 90 V 6 Z m 0,10.5 v 5.25 H 53.25 V 16.5 Z m 0,21 v 5.25 H 90 V 37.5 Z M 6,48 v 5.25 H 58.5 V 48 Z m 0,21 v 5.25 H 90 V 69 Z m 0,10.5 v 5.25 H 74.25 V 79.5 Z m 73.5,5.25 V 90 H 90 v -5.25 z"
     class="ColorScheme-Text"
     id="path4" />
  <circle
     style="fill:#ffcc00;stroke:none;stroke-linecap:square;stroke-linejoin:round;stroke-opacity:1;fill-opacity:1"
     id="path840"
     cx="76"
     cy="20"
     r="16" />
</svg>
