<?xml version="1.0" encoding="UTF-8" standalone="no"?>
<svg
   xmlns:dc="http://purl.org/dc/elements/1.1/"
   xmlns:cc="http://creativecommons.org/ns#"
   xmlns:rdf="http://www.w3.org/1999/02/22-rdf-syntax-ns#"
   xmlns:svg="http://www.w3.org/2000/svg"
   xmlns="http://www.w3.org/2000/svg"
   xmlns:sodipodi="http://sodipodi.sourceforge.net/DTD/sodipodi-0.dtd"
   xmlns:inkscape="http://www.inkscape.org/namespaces/inkscape"
   version="1.1"
   viewBox="0 0 96 96"
   id="svg8"
   sodipodi:docname="sbSymbolsViewer96.svg"
   width="96"
   height="96"
   inkscape:version="0.92.0 r15299">
  <metadata
     id="metadata12">
    <rdf:RDF>
      <cc:Work
         rdf:about="">
        <dc:format>image/svg+xml</dc:format>
        <dc:type
           rdf:resource="http://purl.org/dc/dcmitype/StillImage" />
        <dc:title></dc:title>
      </cc:Work>
    </rdf:RDF>
  </metadata>
  <sodipodi:namedview
     pagecolor="#ffffff"
     bordercolor="#666666"
     borderopacity="1"
     objecttolerance="10"
     gridtolerance="10"
     guidetolerance="10"
     inkscape:pageopacity="0"
     inkscape:pageshadow="2"
     inkscape:window-width="1573"
     inkscape:window-height="1018"
     id="namedview10"
     showgrid="false"
     inkscape:zoom="16.25"
     inkscape:cx="24.424637"
     inkscape:cy="21.152507"
     inkscape:window-x="0"
     inkscape:window-y="0"
     inkscape:window-maximized="0"
     inkscape:current-layer="svg8"
     inkscape:document-rotation="0" />
  <defs
     id="defs4">
    <style
       type="text/css"
       id="style2">.ColorScheme-Text {
        color:#eff0f1;
      }</style>
  </defs>
  <path
     class="ColorScheme-Text"
     d="M 6,6 V 66.375 C 6,79.42272 16.57728,90 29.625,90 42.67272,90 53.25,79.42272 53.25,66.375 V 30.9375 L 79.00776,89.9979 H 90 v -63 H 79.5 V 65.0604 L 53.74224,6 H 42.75 V 66.375 C 42.75,73.62378 36.87378,79.5 29.625,79.5 22.37622,79.5 16.5,73.62378 16.5,66.375 V 6 Z M 79.5,6 V 16.5 H 90 V 6 Z"
     id="path6"
     style="color:#eff0f1;fill:currentColor;stroke-width:4.19997883"
     inkscape:connector-curvature="0" />
</svg>
