<?xml version="1.0" encoding="UTF-8" standalone="no"?>
<!-- Created with Inkscape (http://www.inkscape.org/) -->
<svg
   xmlns:dc="http://purl.org/dc/elements/1.1/"
   xmlns:cc="http://web.resource.org/cc/"
   xmlns:rdf="http://www.w3.org/1999/02/22-rdf-syntax-ns#"
   xmlns:svg="http://www.w3.org/2000/svg"
   xmlns="http://www.w3.org/2000/svg"
   xmlns:xlink="http://www.w3.org/1999/xlink"
   xmlns:sodipodi="http://inkscape.sourceforge.net/DTD/sodipodi-0.dtd"
   xmlns:inkscape="http://www.inkscape.org/namespaces/inkscape"
   width="128.00000px"
   height="128.00000px"
   id="svg2"
   sodipodi:version="0.32"
   inkscape:version="0.42"
   sodipodi:docbase="/home/silvestre/Desktop/nuevos"
   sodipodi:docname="gnome-mime-application-rhythmbox-playlist.svg">
  <defs
     id="defs4">
    <linearGradient
       id="linearGradient3152">
      <stop
         style="stop-color:#000000;stop-opacity:0.18750000;"
         offset="0.0000000"
         id="stop3154" />
      <stop
         style="stop-color:#3f3f3f;stop-opacity:0;"
         offset="1"
         id="stop3156" />
    </linearGradient>
    <linearGradient
       id="linearGradient3146">
      <stop
         id="stop3148"
         offset="0.0000000"
         style="stop-color:#000000;stop-opacity:0.18750000;" />
      <stop
         id="stop3150"
         offset="1"
         style="stop-color:#3f3f3f;stop-opacity:0;" />
    </linearGradient>
    <linearGradient
       id="linearGradient3140">
      <stop
         style="stop-color:#000000;stop-opacity:0.18750000;"
         offset="0.0000000"
         id="stop3142" />
      <stop
         style="stop-color:#3f3f3f;stop-opacity:0;"
         offset="1"
         id="stop3144" />
    </linearGradient>
    <linearGradient
       id="linearGradient3134">
      <stop
         id="stop3136"
         offset="0.0000000"
         style="stop-color:#000000;stop-opacity:0.18750000;" />
      <stop
         id="stop3138"
         offset="1"
         style="stop-color:#3f3f3f;stop-opacity:0;" />
    </linearGradient>
    <linearGradient
       id="linearGradient3126">
      <stop
         style="stop-color:#000000;stop-opacity:0.18750000;"
         offset="0.0000000"
         id="stop3128" />
      <stop
         style="stop-color:#3f3f3f;stop-opacity:0;"
         offset="1"
         id="stop3130" />
    </linearGradient>
    <linearGradient
       id="linearGradient3120">
      <stop
         id="stop3122"
         offset="0.0000000"
         style="stop-color:#000000;stop-opacity:0.18750000;" />
      <stop
         id="stop3124"
         offset="1"
         style="stop-color:#3f3f3f;stop-opacity:0;" />
    </linearGradient>
    <linearGradient
       id="linearGradient3114">
      <stop
         style="stop-color:#000000;stop-opacity:0.18750000;"
         offset="0.0000000"
         id="stop3116" />
      <stop
         style="stop-color:#3f3f3f;stop-opacity:0;"
         offset="1"
         id="stop3118" />
    </linearGradient>
    <linearGradient
       id="linearGradient3108">
      <stop
         id="stop3110"
         offset="0.0000000"
         style="stop-color:#000000;stop-opacity:0.18750000;" />
      <stop
         id="stop3112"
         offset="1"
         style="stop-color:#3f3f3f;stop-opacity:0;" />
    </linearGradient>
    <linearGradient
       id="linearGradient3102">
      <stop
         style="stop-color:#000000;stop-opacity:0.18750000;"
         offset="0.0000000"
         id="stop3104" />
      <stop
         style="stop-color:#3f3f3f;stop-opacity:0;"
         offset="1"
         id="stop3106" />
    </linearGradient>
    <linearGradient
       id="linearGradient3096">
      <stop
         id="stop3098"
         offset="0.0000000"
         style="stop-color:#000000;stop-opacity:0.18750000;" />
      <stop
         id="stop3100"
         offset="1"
         style="stop-color:#3f3f3f;stop-opacity:0;" />
    </linearGradient>
    <linearGradient
       id="linearGradient3088">
      <stop
         style="stop-color:#000000;stop-opacity:0.18750000;"
         offset="0.0000000"
         id="stop3090" />
      <stop
         style="stop-color:#3f3f3f;stop-opacity:0;"
         offset="1"
         id="stop3092" />
    </linearGradient>
    <linearGradient
       id="linearGradient3082">
      <stop
         id="stop3084"
         offset="0.0000000"
         style="stop-color:#000000;stop-opacity:0.18750000;" />
      <stop
         id="stop3086"
         offset="1"
         style="stop-color:#3f3f3f;stop-opacity:0;" />
    </linearGradient>
    <linearGradient
       id="linearGradient3076">
      <stop
         style="stop-color:#000000;stop-opacity:0.18750000;"
         offset="0.0000000"
         id="stop3078" />
      <stop
         style="stop-color:#3f3f3f;stop-opacity:0;"
         offset="1"
         id="stop3080" />
    </linearGradient>
    <linearGradient
       id="linearGradient3070">
      <stop
         id="stop3072"
         offset="0.0000000"
         style="stop-color:#000000;stop-opacity:0.18750000;" />
      <stop
         id="stop3074"
         offset="1"
         style="stop-color:#3f3f3f;stop-opacity:0;" />
    </linearGradient>
    <linearGradient
       id="linearGradient3062">
      <stop
         style="stop-color:#000000;stop-opacity:0.18750000;"
         offset="0.0000000"
         id="stop3064" />
      <stop
         style="stop-color:#3f3f3f;stop-opacity:0;"
         offset="1"
         id="stop3066" />
    </linearGradient>
    <linearGradient
       id="linearGradient3056">
      <stop
         id="stop3058"
         offset="0.0000000"
         style="stop-color:#ffffff;stop-opacity:1.0000000;" />
      <stop
         id="stop3060"
         offset="1.0000000"
         style="stop-color:#ffffff;stop-opacity:0.0000000;" />
    </linearGradient>
    <linearGradient
       id="linearGradient3050">
      <stop
         style="stop-color:#ffffff;stop-opacity:1.0000000;"
         offset="0.0000000"
         id="stop3052" />
      <stop
         style="stop-color:#ffffff;stop-opacity:0.0000000;"
         offset="1.0000000"
         id="stop3054" />
    </linearGradient>
    <linearGradient
       id="linearGradient3044">
      <stop
         id="stop3046"
         offset="0.0000000"
         style="stop-color:#ffffff;stop-opacity:1.0000000;" />
      <stop
         id="stop3048"
         offset="1.0000000"
         style="stop-color:#ffffff;stop-opacity:0.0000000;" />
    </linearGradient>
    <linearGradient
       id="linearGradient3038">
      <stop
         style="stop-color:#ffffff;stop-opacity:1.0000000;"
         offset="0.0000000"
         id="stop3040" />
      <stop
         style="stop-color:#ffffff;stop-opacity:0.0000000;"
         offset="1.0000000"
         id="stop3042" />
    </linearGradient>
    <linearGradient
       id="linearGradient3031">
      <stop
         id="stop3033"
         offset="0.0000000"
         style="stop-color:#ffffff;stop-opacity:1.0000000;" />
      <stop
         id="stop3035"
         offset="1.0000000"
         style="stop-color:#ffffff;stop-opacity:0.0000000;" />
    </linearGradient>
    <linearGradient
       id="linearGradient3025">
      <stop
         id="stop3027"
         offset="0.0000000"
         style="stop-color:#ffffff;stop-opacity:1.0000000;" />
      <stop
         id="stop3029"
         offset="1.0000000"
         style="stop-color:#ffffff;stop-opacity:0.0000000;" />
    </linearGradient>
    <linearGradient
       id="linearGradient3019">
      <stop
         style="stop-color:#ffffff;stop-opacity:1.0000000;"
         offset="0.0000000"
         id="stop3021" />
      <stop
         style="stop-color:#ffffff;stop-opacity:0.0000000;"
         offset="1.0000000"
         id="stop3023" />
    </linearGradient>
    <linearGradient
       id="linearGradient3013">
      <stop
         id="stop3015"
         offset="0.0000000"
         style="stop-color:#ffffff;stop-opacity:1.0000000;" />
      <stop
         id="stop3017"
         offset="1.0000000"
         style="stop-color:#ffffff;stop-opacity:0.0000000;" />
    </linearGradient>
    <linearGradient
       id="linearGradient3007">
      <stop
         style="stop-color:#ffffff;stop-opacity:1.0000000;"
         offset="0.0000000"
         id="stop3009" />
      <stop
         style="stop-color:#ffffff;stop-opacity:0.0000000;"
         offset="1.0000000"
         id="stop3011" />
    </linearGradient>
    <linearGradient
       id="linearGradient3001">
      <stop
         id="stop3003"
         offset="0.0000000"
         style="stop-color:#ffffff;stop-opacity:1.0000000;" />
      <stop
         id="stop3005"
         offset="1.0000000"
         style="stop-color:#ffffff;stop-opacity:0.0000000;" />
    </linearGradient>
    <linearGradient
       id="linearGradient2995">
      <stop
         style="stop-color:#ffffff;stop-opacity:1.0000000;"
         offset="0.0000000"
         id="stop2997" />
      <stop
         style="stop-color:#ffffff;stop-opacity:0.0000000;"
         offset="1.0000000"
         id="stop2999" />
    </linearGradient>
    <linearGradient
       id="linearGradient2989">
      <stop
         style="stop-color:#aadf00;stop-opacity:1.0000000;"
         offset="0.0000000"
         id="stop2991" />
      <stop
         style="stop-color:#4dc721;stop-opacity:1.0000000;"
         offset="1.0000000"
         id="stop2993" />
    </linearGradient>
    <linearGradient
       id="linearGradient2983">
      <stop
         id="stop2985"
         offset="0.0000000"
         style="stop-color:#aadf00;stop-opacity:1.0000000;" />
      <stop
         id="stop2987"
         offset="1.0000000"
         style="stop-color:#4dc721;stop-opacity:1.0000000;" />
    </linearGradient>
    <linearGradient
       id="linearGradient2977">
      <stop
         style="stop-color:#aadf00;stop-opacity:1.0000000;"
         offset="0.0000000"
         id="stop2979" />
      <stop
         style="stop-color:#4dc721;stop-opacity:1.0000000;"
         offset="1.0000000"
         id="stop2981" />
    </linearGradient>
    <linearGradient
       id="linearGradient2971">
      <stop
         id="stop2973"
         offset="0.0000000"
         style="stop-color:#aadf00;stop-opacity:1.0000000;" />
      <stop
         id="stop2975"
         offset="1.0000000"
         style="stop-color:#4dc721;stop-opacity:1.0000000;" />
    </linearGradient>
    <linearGradient
       id="linearGradient2965">
      <stop
         style="stop-color:#aadf00;stop-opacity:1.0000000;"
         offset="0.0000000"
         id="stop2967" />
      <stop
         style="stop-color:#4dc721;stop-opacity:1.0000000;"
         offset="1.0000000"
         id="stop2969" />
    </linearGradient>
    <linearGradient
       id="linearGradient2959">
      <stop
         id="stop2961"
         offset="0.0000000"
         style="stop-color:#aadf00;stop-opacity:1.0000000;" />
      <stop
         id="stop2963"
         offset="1.0000000"
         style="stop-color:#4dc721;stop-opacity:1.0000000;" />
    </linearGradient>
    <linearGradient
       id="linearGradient2953">
      <stop
         id="stop2955"
         offset="0.0000000"
         style="stop-color:#ffffff;stop-opacity:1.0000000;" />
      <stop
         id="stop2957"
         offset="1.0000000"
         style="stop-color:#ffffff;stop-opacity:0.0000000;" />
    </linearGradient>
    <linearGradient
       id="linearGradient2947">
      <stop
         style="stop-color:#ffffff;stop-opacity:1.0000000;"
         offset="0.0000000"
         id="stop2949" />
      <stop
         style="stop-color:#ffffff;stop-opacity:0.0000000;"
         offset="1.0000000"
         id="stop2951" />
    </linearGradient>
    <linearGradient
       id="linearGradient2941">
      <stop
         id="stop2943"
         offset="0.0000000"
         style="stop-color:#ffffff;stop-opacity:1.0000000;" />
      <stop
         id="stop2945"
         offset="1.0000000"
         style="stop-color:#ffffff;stop-opacity:0.0000000;" />
    </linearGradient>
    <linearGradient
       id="linearGradient2935">
      <stop
         style="stop-color:#ffffff;stop-opacity:1.0000000;"
         offset="0.0000000"
         id="stop2937" />
      <stop
         style="stop-color:#ffffff;stop-opacity:0.0000000;"
         offset="1.0000000"
         id="stop2939" />
    </linearGradient>
    <linearGradient
       id="linearGradient2909">
      <stop
         id="stop2911"
         offset="0.0000000"
         style="stop-color:#5f5f5f;stop-opacity:1.0000000;" />
      <stop
         id="stop2913"
         offset="1.0000000"
         style="stop-color:#353535;stop-opacity:1.0000000;" />
    </linearGradient>
    <linearGradient
       id="linearGradient2903">
      <stop
         style="stop-color:#5f5f5f;stop-opacity:1.0000000;"
         offset="0.0000000"
         id="stop2905" />
      <stop
         style="stop-color:#353535;stop-opacity:1.0000000;"
         offset="1.0000000"
         id="stop2907" />
    </linearGradient>
    <linearGradient
       id="linearGradient2897">
      <stop
         id="stop2899"
         offset="0.0000000"
         style="stop-color:#5f5f5f;stop-opacity:1.0000000;" />
      <stop
         id="stop2901"
         offset="1.0000000"
         style="stop-color:#353535;stop-opacity:1.0000000;" />
    </linearGradient>
    <linearGradient
       id="linearGradient2891">
      <stop
         style="stop-color:#5f5f5f;stop-opacity:1.0000000;"
         offset="0.0000000"
         id="stop2893" />
      <stop
         style="stop-color:#353535;stop-opacity:1.0000000;"
         offset="1.0000000"
         id="stop2895" />
    </linearGradient>
    <linearGradient
       id="linearGradient2885">
      <stop
         id="stop2887"
         offset="0.0000000"
         style="stop-color:#5f5f5f;stop-opacity:1.0000000;" />
      <stop
         id="stop2889"
         offset="1.0000000"
         style="stop-color:#353535;stop-opacity:1.0000000;" />
    </linearGradient>
    <linearGradient
       id="linearGradient2879">
      <stop
         style="stop-color:#5f5f5f;stop-opacity:1.0000000;"
         offset="0.0000000"
         id="stop2881" />
      <stop
         style="stop-color:#353535;stop-opacity:1.0000000;"
         offset="1.0000000"
         id="stop2883" />
    </linearGradient>
    <linearGradient
       id="linearGradient2873">
      <stop
         id="stop2875"
         offset="0.0000000"
         style="stop-color:#5f5f5f;stop-opacity:1.0000000;" />
      <stop
         id="stop2877"
         offset="1.0000000"
         style="stop-color:#353535;stop-opacity:1.0000000;" />
    </linearGradient>
    <linearGradient
       id="linearGradient2867">
      <stop
         style="stop-color:#5f5f5f;stop-opacity:1.0000000;"
         offset="0.0000000"
         id="stop2869" />
      <stop
         style="stop-color:#353535;stop-opacity:1.0000000;"
         offset="1.0000000"
         id="stop2871" />
    </linearGradient>
    <linearGradient
       id="linearGradient2861">
      <stop
         id="stop2863"
         offset="0.0000000"
         style="stop-color:#5f5f5f;stop-opacity:1.0000000;" />
      <stop
         id="stop2865"
         offset="1.0000000"
         style="stop-color:#353535;stop-opacity:1.0000000;" />
    </linearGradient>
    <linearGradient
       id="linearGradient2855">
      <stop
         style="stop-color:#5f5f5f;stop-opacity:1.0000000;"
         offset="0.0000000"
         id="stop2857" />
      <stop
         style="stop-color:#353535;stop-opacity:1.0000000;"
         offset="1.0000000"
         id="stop2859" />
    </linearGradient>
    <linearGradient
       inkscape:collect="always"
       id="linearGradient2831">
      <stop
         style="stop-color:#000000;stop-opacity:0.39600000"
         offset="0"
         id="stop2833" />
      <stop
         style="stop-color:#000000;stop-opacity:0;"
         offset="1"
         id="stop2835" />
    </linearGradient>
    <linearGradient
       id="linearGradient6859">
      <stop
         style="stop-color:#000000;stop-opacity:0.68750000;"
         offset="0.0000000"
         id="stop6861" />
      <stop
         style="stop-color:#000000;stop-opacity:0;"
         offset="1"
         id="stop6863" />
    </linearGradient>
    <linearGradient
       id="linearGradient6853">
      <stop
         id="stop6855"
         offset="0.0000000"
         style="stop-color:#000000;stop-opacity:0.68750000;" />
      <stop
         id="stop6857"
         offset="1"
         style="stop-color:#000000;stop-opacity:0;" />
    </linearGradient>
    <linearGradient
       id="linearGradient6847">
      <stop
         style="stop-color:#000000;stop-opacity:0.68750000;"
         offset="0.0000000"
         id="stop6849" />
      <stop
         style="stop-color:#000000;stop-opacity:0;"
         offset="1"
         id="stop6851" />
    </linearGradient>
    <linearGradient
       id="linearGradient6841">
      <stop
         id="stop6843"
         offset="0.0000000"
         style="stop-color:#000000;stop-opacity:0.68750000;" />
      <stop
         id="stop6845"
         offset="1"
         style="stop-color:#000000;stop-opacity:0;" />
    </linearGradient>
    <linearGradient
       id="linearGradient6835">
      <stop
         style="stop-color:#000000;stop-opacity:0.68750000;"
         offset="0.0000000"
         id="stop6837" />
      <stop
         style="stop-color:#000000;stop-opacity:0;"
         offset="1"
         id="stop6839" />
    </linearGradient>
    <linearGradient
       id="linearGradient6829">
      <stop
         id="stop6831"
         offset="0.0000000"
         style="stop-color:#000000;stop-opacity:0.68750000;" />
      <stop
         id="stop6833"
         offset="1"
         style="stop-color:#000000;stop-opacity:0;" />
    </linearGradient>
    <linearGradient
       id="linearGradient6823">
      <stop
         style="stop-color:#ff003c;stop-opacity:1;"
         offset="0"
         id="stop6825" />
      <stop
         style="stop-color:#aa0028;stop-opacity:1.0000000;"
         offset="1.0000000"
         id="stop6827" />
    </linearGradient>
    <linearGradient
       id="linearGradient6817">
      <stop
         id="stop6819"
         offset="0"
         style="stop-color:#ff003c;stop-opacity:1;" />
      <stop
         id="stop6821"
         offset="1.0000000"
         style="stop-color:#aa0028;stop-opacity:1.0000000;" />
    </linearGradient>
    <linearGradient
       id="linearGradient6811">
      <stop
         style="stop-color:#ff003c;stop-opacity:1;"
         offset="0"
         id="stop6813" />
      <stop
         style="stop-color:#aa0028;stop-opacity:1.0000000;"
         offset="1.0000000"
         id="stop6815" />
    </linearGradient>
    <linearGradient
       id="linearGradient6805">
      <stop
         id="stop6807"
         offset="0"
         style="stop-color:#ff003c;stop-opacity:1;" />
      <stop
         id="stop6809"
         offset="1.0000000"
         style="stop-color:#aa0028;stop-opacity:1.0000000;" />
    </linearGradient>
    <linearGradient
       id="linearGradient6799">
      <stop
         style="stop-color:#ff003c;stop-opacity:1;"
         offset="0"
         id="stop6801" />
      <stop
         style="stop-color:#aa0028;stop-opacity:1.0000000;"
         offset="1.0000000"
         id="stop6803" />
    </linearGradient>
    <linearGradient
       id="linearGradient6793">
      <stop
         id="stop6795"
         offset="0"
         style="stop-color:#ff003c;stop-opacity:1;" />
      <stop
         id="stop6797"
         offset="1.0000000"
         style="stop-color:#aa0028;stop-opacity:1.0000000;" />
    </linearGradient>
    <linearGradient
       id="linearGradient6787">
      <stop
         style="stop-color:#ff003c;stop-opacity:1;"
         offset="0"
         id="stop6789" />
      <stop
         style="stop-color:#aa0028;stop-opacity:1.0000000;"
         offset="1.0000000"
         id="stop6791" />
    </linearGradient>
    <linearGradient
       id="linearGradient6781">
      <stop
         id="stop6783"
         offset="0"
         style="stop-color:#ff003c;stop-opacity:1;" />
      <stop
         id="stop6785"
         offset="1.0000000"
         style="stop-color:#aa0028;stop-opacity:1.0000000;" />
    </linearGradient>
    <linearGradient
       id="linearGradient6775">
      <stop
         style="stop-color:#e2e2e2;stop-opacity:1;"
         offset="0"
         id="stop6777" />
      <stop
         style="stop-color:#979797;stop-opacity:1.0000000;"
         offset="1.0000000"
         id="stop6779" />
    </linearGradient>
    <linearGradient
       id="linearGradient6769">
      <stop
         id="stop6771"
         offset="0"
         style="stop-color:#e2e2e2;stop-opacity:1;" />
      <stop
         id="stop6773"
         offset="1.0000000"
         style="stop-color:#979797;stop-opacity:1.0000000;" />
    </linearGradient>
    <linearGradient
       id="linearGradient6763">
      <stop
         style="stop-color:#e2e2e2;stop-opacity:1;"
         offset="0"
         id="stop6765" />
      <stop
         style="stop-color:#979797;stop-opacity:1.0000000;"
         offset="1.0000000"
         id="stop6767" />
    </linearGradient>
    <linearGradient
       id="linearGradient6757">
      <stop
         id="stop6759"
         offset="0"
         style="stop-color:#e2e2e2;stop-opacity:1;" />
      <stop
         id="stop6761"
         offset="1.0000000"
         style="stop-color:#979797;stop-opacity:1.0000000;" />
    </linearGradient>
    <linearGradient
       id="linearGradient6751">
      <stop
         style="stop-color:#e2e2e2;stop-opacity:1;"
         offset="0"
         id="stop6753" />
      <stop
         style="stop-color:#979797;stop-opacity:1.0000000;"
         offset="1.0000000"
         id="stop6755" />
    </linearGradient>
    <linearGradient
       id="linearGradient6745">
      <stop
         id="stop6747"
         offset="0"
         style="stop-color:#e2e2e2;stop-opacity:1;" />
      <stop
         id="stop6749"
         offset="1.0000000"
         style="stop-color:#979797;stop-opacity:1.0000000;" />
    </linearGradient>
    <linearGradient
       id="linearGradient6739">
      <stop
         id="stop6741"
         offset="0"
         style="stop-color:#ffe000;stop-opacity:1;" />
      <stop
         id="stop6743"
         offset="1.0000000"
         style="stop-color:#ff9500;stop-opacity:1.0000000;" />
    </linearGradient>
    <linearGradient
       id="linearGradient6733">
      <stop
         style="stop-color:#ffe000;stop-opacity:1;"
         offset="0"
         id="stop6735" />
      <stop
         style="stop-color:#ff9500;stop-opacity:1.0000000;"
         offset="1.0000000"
         id="stop6737" />
    </linearGradient>
    <linearGradient
       id="linearGradient6727">
      <stop
         id="stop6729"
         offset="0"
         style="stop-color:#ffe000;stop-opacity:1;" />
      <stop
         id="stop6731"
         offset="1.0000000"
         style="stop-color:#ff9500;stop-opacity:1.0000000;" />
    </linearGradient>
    <linearGradient
       id="linearGradient6721">
      <stop
         style="stop-color:#ffe000;stop-opacity:1;"
         offset="0"
         id="stop6723" />
      <stop
         style="stop-color:#ff9500;stop-opacity:1.0000000;"
         offset="1.0000000"
         id="stop6725" />
    </linearGradient>
    <linearGradient
       id="linearGradient6715">
      <stop
         id="stop6717"
         offset="0"
         style="stop-color:#ffe000;stop-opacity:1;" />
      <stop
         id="stop6719"
         offset="1.0000000"
         style="stop-color:#ff9500;stop-opacity:1.0000000;" />
    </linearGradient>
    <linearGradient
       id="linearGradient6709">
      <stop
         style="stop-color:#ffe000;stop-opacity:1;"
         offset="0"
         id="stop6711" />
      <stop
         style="stop-color:#ff9500;stop-opacity:1.0000000;"
         offset="1.0000000"
         id="stop6713" />
    </linearGradient>
    <linearGradient
       id="linearGradient6703">
      <stop
         id="stop6705"
         offset="0"
         style="stop-color:#ffe000;stop-opacity:1;" />
      <stop
         id="stop6707"
         offset="1.0000000"
         style="stop-color:#ff9500;stop-opacity:1.0000000;" />
    </linearGradient>
    <linearGradient
       inkscape:collect="always"
       id="linearGradient6697">
      <stop
         style="stop-color:#ffffff;stop-opacity:1;"
         offset="0"
         id="stop6699" />
      <stop
         style="stop-color:#ffffff;stop-opacity:0;"
         offset="1"
         id="stop6701" />
    </linearGradient>
    <linearGradient
       id="linearGradient5922">
      <stop
         style="stop-color:#000000;stop-opacity:0.57291669;"
         offset="0.0000000"
         id="stop5924" />
      <stop
         style="stop-color:#000000;stop-opacity:0;"
         offset="1"
         id="stop5926" />
    </linearGradient>
    <linearGradient
       inkscape:collect="always"
       id="linearGradient5912">
      <stop
         style="stop-color:#000000;stop-opacity:1;"
         offset="0"
         id="stop5914" />
      <stop
         style="stop-color:#000000;stop-opacity:0;"
         offset="1"
         id="stop5916" />
    </linearGradient>
    <linearGradient
       id="linearGradient5904">
      <stop
         id="stop5906"
         offset="0.0000000"
         style="stop-color:#000000;stop-opacity:0.19791669;" />
      <stop
         id="stop5908"
         offset="1"
         style="stop-color:#000000;stop-opacity:0;" />
    </linearGradient>
    <linearGradient
       inkscape:collect="always"
       id="linearGradient5856">
      <stop
         style="stop-color:#ffffff;stop-opacity:1;"
         offset="0"
         id="stop5858" />
      <stop
         style="stop-color:#ffffff;stop-opacity:0;"
         offset="1"
         id="stop5860" />
    </linearGradient>
    <linearGradient
       id="linearGradient5846">
      <stop
         style="stop-color:#e2e2e2;stop-opacity:1;"
         offset="0"
         id="stop5848" />
      <stop
         style="stop-color:#979797;stop-opacity:1.0000000;"
         offset="1.0000000"
         id="stop5850" />
    </linearGradient>
    <linearGradient
       id="linearGradient5836">
      <stop
         style="stop-color:#ff003c;stop-opacity:1;"
         offset="0"
         id="stop5838" />
      <stop
         style="stop-color:#aa0028;stop-opacity:1.0000000;"
         offset="1.0000000"
         id="stop5840" />
    </linearGradient>
    <linearGradient
       id="linearGradient5100">
      <stop
         style="stop-color:#000000;stop-opacity:0.68750000;"
         offset="0.0000000"
         id="stop5102" />
      <stop
         style="stop-color:#000000;stop-opacity:0;"
         offset="1"
         id="stop5104" />
    </linearGradient>
    <linearGradient
       id="linearGradient2906">
      <stop
         style="stop-color:#ffe000;stop-opacity:1;"
         offset="0"
         id="stop2908" />
      <stop
         style="stop-color:#ff9500;stop-opacity:1.0000000;"
         offset="1.0000000"
         id="stop2910" />
    </linearGradient>
    <linearGradient
       id="linearGradient2065">
      <stop
         style="stop-color:#ffffff;stop-opacity:1;"
         offset="0"
         id="stop2067" />
      <stop
         style="stop-color:#bfbfbf;stop-opacity:1.0000000;"
         offset="1.0000000"
         id="stop2069" />
    </linearGradient>
    <linearGradient
       id="linearGradient2057">
      <stop
         style="stop-color:#f0f0f0;stop-opacity:1;"
         offset="0"
         id="stop2059" />
      <stop
         style="stop-color:#dddddd;stop-opacity:1.0000000;"
         offset="1.0000000"
         id="stop2061" />
    </linearGradient>
    <linearGradient
       inkscape:collect="always"
       id="linearGradient2049">
      <stop
         style="stop-color:#0a0a0a;stop-opacity:1;"
         offset="0"
         id="stop2051" />
      <stop
         style="stop-color:#0a0a0a;stop-opacity:0;"
         offset="1"
         id="stop2053" />
    </linearGradient>
    <linearGradient
       inkscape:collect="always"
       xlink:href="#linearGradient2049"
       id="linearGradient2055"
       x1="69.606209"
       y1="-2.7867124"
       x2="82.630730"
       y2="34.129730"
       gradientUnits="userSpaceOnUse"
       gradientTransform="translate(0.975845,-1.951691)" />
    <linearGradient
       inkscape:collect="always"
       xlink:href="#linearGradient2057"
       id="linearGradient2063"
       x1="57.903072"
       y1="65.225105"
       x2="85.999580"
       y2="114.99323"
       gradientUnits="userSpaceOnUse" />
    <linearGradient
       inkscape:collect="always"
       xlink:href="#linearGradient2065"
       id="linearGradient2071"
       x1="80.507256"
       y1="19.193230"
       x2="84.654594"
       y2="10.410620"
       gradientUnits="userSpaceOnUse" />
    <linearGradient
       inkscape:collect="always"
       xlink:href="#linearGradient2906"
       id="linearGradient2912"
       x1="-47.589424"
       y1="58.896137"
       x2="-63.938179"
       y2="76.461357"
       gradientUnits="userSpaceOnUse" />
    <linearGradient
       inkscape:collect="always"
       xlink:href="#linearGradient5100"
       id="linearGradient5106"
       x1="-20.528118"
       y1="107.24106"
       x2="-8.1039801"
       y2="92.060463"
       gradientUnits="userSpaceOnUse"
       gradientTransform="translate(-20.00000,0.000000)" />
    <linearGradient
       inkscape:collect="always"
       xlink:href="#linearGradient5836"
       id="linearGradient5842"
       x1="-85.481979"
       y1="27.451311"
       x2="-94.657013"
       y2="43.796722"
       gradientUnits="userSpaceOnUse" />
    <linearGradient
       inkscape:collect="always"
       xlink:href="#linearGradient5846"
       id="linearGradient5852"
       x1="-80.819405"
       y1="33.768192"
       x2="-90.566032"
       y2="44.636120"
       gradientUnits="userSpaceOnUse" />
    <linearGradient
       inkscape:collect="always"
       xlink:href="#linearGradient5856"
       id="linearGradient5862"
       x1="-54.719166"
       y1="44.506268"
       x2="-69.467331"
       y2="60.721901"
       gradientUnits="userSpaceOnUse" />
    <linearGradient
       inkscape:collect="always"
       xlink:href="#linearGradient2906"
       id="linearGradient5873"
       gradientUnits="userSpaceOnUse"
       x1="-47.589424"
       y1="58.896137"
       x2="-63.938179"
       y2="76.461357" />
    <linearGradient
       inkscape:collect="always"
       xlink:href="#linearGradient5100"
       id="linearGradient5875"
       gradientUnits="userSpaceOnUse"
       gradientTransform="translate(-20.00000,2.685789e-14)"
       x1="-20.528118"
       y1="107.24106"
       x2="-8.1039801"
       y2="92.060463" />
    <linearGradient
       inkscape:collect="always"
       xlink:href="#linearGradient5836"
       id="linearGradient5877"
       gradientUnits="userSpaceOnUse"
       x1="-85.481979"
       y1="27.451311"
       x2="-94.657013"
       y2="43.796722" />
    <linearGradient
       inkscape:collect="always"
       xlink:href="#linearGradient5846"
       id="linearGradient5879"
       gradientUnits="userSpaceOnUse"
       x1="-80.819405"
       y1="33.768192"
       x2="-90.566032"
       y2="44.636120" />
    <linearGradient
       inkscape:collect="always"
       xlink:href="#linearGradient5856"
       id="linearGradient5881"
       gradientUnits="userSpaceOnUse"
       x1="-54.719166"
       y1="44.506268"
       x2="-69.467331"
       y2="60.721901" />
    <linearGradient
       inkscape:collect="always"
       xlink:href="#linearGradient2057"
       id="linearGradient5888"
       gradientUnits="userSpaceOnUse"
       x1="57.903072"
       y1="65.225105"
       x2="85.999580"
       y2="114.99323" />
    <linearGradient
       inkscape:collect="always"
       xlink:href="#linearGradient2049"
       id="linearGradient5890"
       gradientUnits="userSpaceOnUse"
       gradientTransform="translate(0.975845,-1.951691)"
       x1="69.606209"
       y1="-2.7867124"
       x2="82.630730"
       y2="34.129730" />
    <linearGradient
       inkscape:collect="always"
       xlink:href="#linearGradient2065"
       id="linearGradient5892"
       gradientUnits="userSpaceOnUse"
       x1="80.507256"
       y1="19.193230"
       x2="84.654594"
       y2="10.410620" />
    <radialGradient
       inkscape:collect="always"
       xlink:href="#linearGradient5904"
       id="radialGradient5902"
       cx="60.502419"
       cy="115.07005"
       fx="60.502419"
       fy="115.07005"
       r="56.111115"
       gradientTransform="matrix(1.000000,0.000000,0.000000,0.213043,0.000000,90.55513)"
       gradientUnits="userSpaceOnUse" />
    <linearGradient
       inkscape:collect="always"
       xlink:href="#linearGradient5912"
       id="linearGradient5918"
       x1="71.236717"
       y1="152.15218"
       x2="88.314011"
       y2="99.212555"
       gradientUnits="userSpaceOnUse" />
    <linearGradient
       inkscape:collect="always"
       xlink:href="#linearGradient5922"
       id="linearGradient5928"
       x1="-2.4150949"
       y1="148.70081"
       x2="95.913750"
       y2="93.498650"
       gradientUnits="userSpaceOnUse" />
    <linearGradient
       inkscape:collect="always"
       xlink:href="#linearGradient6697"
       id="linearGradient5937"
       gradientUnits="userSpaceOnUse"
       x1="-54.719166"
       y1="44.506268"
       x2="-69.467331"
       y2="60.721901"
       gradientTransform="matrix(-0.940957,0.000000,0.000000,0.940957,96.92630,28.53497)" />
    <linearGradient
       inkscape:collect="always"
       xlink:href="#linearGradient6775"
       id="linearGradient5940"
       gradientUnits="userSpaceOnUse"
       x1="-80.819405"
       y1="33.768192"
       x2="-90.566032"
       y2="44.636120"
       gradientTransform="matrix(-0.940957,0.000000,0.000000,0.940957,96.92630,28.53497)" />
    <linearGradient
       inkscape:collect="always"
       xlink:href="#linearGradient6823"
       id="linearGradient5943"
       gradientUnits="userSpaceOnUse"
       x1="-85.481979"
       y1="27.451311"
       x2="-94.657013"
       y2="43.796722"
       gradientTransform="matrix(-0.940957,0.000000,0.000000,0.940957,96.92630,28.53497)" />
    <linearGradient
       inkscape:collect="always"
       xlink:href="#linearGradient6859"
       id="linearGradient5946"
       gradientUnits="userSpaceOnUse"
       gradientTransform="matrix(-0.940957,0.000000,0.000000,0.940957,115.7454,28.53497)"
       x1="-20.528118"
       y1="107.24106"
       x2="-8.1039801"
       y2="92.060463" />
    <linearGradient
       inkscape:collect="always"
       xlink:href="#linearGradient6739"
       id="linearGradient5951"
       gradientUnits="userSpaceOnUse"
       x1="-47.589424"
       y1="58.896137"
       x2="-63.938179"
       y2="76.461357"
       gradientTransform="matrix(-0.940957,0.000000,0.000000,0.940957,96.92630,28.53497)" />
    <linearGradient
       inkscape:collect="always"
       xlink:href="#linearGradient6739"
       id="linearGradient6874"
       gradientUnits="userSpaceOnUse"
       gradientTransform="matrix(-0.940957,0.000000,0.000000,0.940957,96.92630,28.53497)"
       x1="-47.589424"
       y1="58.896137"
       x2="-63.938179"
       y2="76.461357" />
    <linearGradient
       inkscape:collect="always"
       xlink:href="#linearGradient6859"
       id="linearGradient6876"
       gradientUnits="userSpaceOnUse"
       gradientTransform="matrix(-0.940957,0.000000,0.000000,0.940957,115.7454,28.53497)"
       x1="-20.528118"
       y1="107.24106"
       x2="-8.1039801"
       y2="92.060463" />
    <linearGradient
       inkscape:collect="always"
       xlink:href="#linearGradient6823"
       id="linearGradient6878"
       gradientUnits="userSpaceOnUse"
       gradientTransform="matrix(-0.940957,0.000000,0.000000,0.940957,96.92630,28.53497)"
       x1="-85.481979"
       y1="27.451311"
       x2="-94.657013"
       y2="43.796722" />
    <linearGradient
       inkscape:collect="always"
       xlink:href="#linearGradient6775"
       id="linearGradient6880"
       gradientUnits="userSpaceOnUse"
       gradientTransform="matrix(-0.940957,0.000000,0.000000,0.940957,96.92630,28.53497)"
       x1="-80.819405"
       y1="33.768192"
       x2="-90.566032"
       y2="44.636120" />
    <linearGradient
       inkscape:collect="always"
       xlink:href="#linearGradient6697"
       id="linearGradient6882"
       gradientUnits="userSpaceOnUse"
       gradientTransform="matrix(-0.940957,0.000000,0.000000,0.940957,96.92630,28.53497)"
       x1="-54.719166"
       y1="44.506268"
       x2="-69.467331"
       y2="60.721901" />
    <radialGradient
       r="62.455009"
       fy="115.64259"
       fx="62.788994"
       cy="115.64259"
       cx="62.788994"
       gradientTransform="matrix(1.000000,0.000000,0.000000,0.160428,-7.219224e-14,97.09030)"
       gradientUnits="userSpaceOnUse"
       id="radialGradient4310"
       xlink:href="#linearGradient4296"
       inkscape:collect="always" />
    <radialGradient
       r="62.455009"
       fy="115.64259"
       fx="62.788994"
       cy="115.64259"
       cx="62.788994"
       gradientTransform="matrix(1.000000,0.000000,0.000000,0.160428,-1.237418e-13,97.09030)"
       gradientUnits="userSpaceOnUse"
       id="radialGradient4306"
       xlink:href="#linearGradient4296"
       inkscape:collect="always" />
    <radialGradient
       gradientUnits="userSpaceOnUse"
       gradientTransform="matrix(1.000000,0.000000,0.000000,0.160428,-3.819166e-14,97.09030)"
       r="62.455009"
       fy="115.64259"
       fx="62.788994"
       cy="115.64259"
       cx="62.788994"
       id="radialGradient4302"
       xlink:href="#linearGradient4296"
       inkscape:collect="always" />
    <linearGradient
       y2="84.142044"
       x2="161.74821"
       y1="108.61332"
       x1="147.57317"
       gradientTransform="matrix(0.592168,0.000000,0.000000,0.615855,91.69440,-5.679809)"
       gradientUnits="userSpaceOnUse"
       id="linearGradient3566"
       xlink:href="#linearGradient2423"
       inkscape:collect="always" />
    <linearGradient
       y2="84.142044"
       x2="161.74821"
       y1="108.61332"
       x1="147.57317"
       gradientTransform="matrix(0.592168,0.000000,0.000000,0.615855,60.33530,0.325134)"
       gradientUnits="userSpaceOnUse"
       id="linearGradient3564"
       xlink:href="#linearGradient2447"
       inkscape:collect="always" />
    <linearGradient
       y2="46.608990"
       x2="132.50201"
       y1="21.914911"
       x1="130.02267"
       gradientTransform="matrix(0.881821,0.000000,0.000000,0.413564,60.33530,0.325134)"
       gradientUnits="userSpaceOnUse"
       id="linearGradient3562"
       xlink:href="#linearGradient2383"
       inkscape:collect="always" />
    <linearGradient
       y2="81.863159"
       x2="177.10718"
       y1="15.598222"
       x1="206.98412"
       gradientTransform="matrix(0.571304,0.000000,0.000000,0.638345,60.33530,0.325134)"
       gradientUnits="userSpaceOnUse"
       id="linearGradient3560"
       xlink:href="#linearGradient2403"
       inkscape:collect="always" />
    <linearGradient
       id="linearGradient8655">
      <stop
         style="stop-color:#000000;stop-opacity:0.30208334;"
         offset="0.0000000"
         id="stop8657" />
      <stop
         style="stop-color:#000000;stop-opacity:0;"
         offset="1"
         id="stop8659" />
    </linearGradient>
    <linearGradient
       id="linearGradient7917">
      <stop
         style="stop-color:#000000;stop-opacity:0.16666669;"
         offset="0.0000000"
         id="stop7919" />
      <stop
         style="stop-color:#000000;stop-opacity:0;"
         offset="1"
         id="stop7921" />
    </linearGradient>
    <linearGradient
       id="linearGradient6455">
      <stop
         style="stop-color:#e2e5ff;stop-opacity:1.0000000;"
         offset="0.0000000"
         id="stop6457" />
      <stop
         style="stop-color:#b5c6e7;stop-opacity:1.0000000;"
         offset="1.0000000"
         id="stop6459" />
    </linearGradient>
    <linearGradient
       id="linearGradient5703">
      <stop
         id="stop5705"
         offset="0.0000000"
         style="stop-color:#ffffff;stop-opacity:0.83333325;" />
      <stop
         id="stop5707"
         offset="1"
         style="stop-color:#ffffff;stop-opacity:0.0000000" />
    </linearGradient>
    <linearGradient
       id="linearGradient5691">
      <stop
         style="stop-color:#ffffff;stop-opacity:0.83333325;"
         offset="0.0000000"
         id="stop5693" />
      <stop
         style="stop-color:#ffffff;stop-opacity:0.0000000"
         offset="1"
         id="stop5695" />
    </linearGradient>
    <linearGradient
       y2="84.142044"
       x2="161.74821"
       y1="108.61332"
       x1="147.57317"
       gradientTransform="matrix(0.592168,0.000000,0.000000,0.615855,91.69440,-5.679809)"
       gradientUnits="userSpaceOnUse"
       id="linearGradient2493"
       xlink:href="#linearGradient2423"
       inkscape:collect="always" />
    <linearGradient
       y2="84.142044"
       x2="161.74821"
       y1="108.61332"
       x1="147.57317"
       gradientTransform="matrix(0.592168,0.000000,0.000000,0.615855,60.33530,0.325134)"
       gradientUnits="userSpaceOnUse"
       id="linearGradient2491"
       xlink:href="#linearGradient2447"
       inkscape:collect="always" />
    <linearGradient
       y2="46.608990"
       x2="132.50201"
       y1="21.914911"
       x1="130.02267"
       gradientTransform="matrix(0.881821,0.000000,0.000000,0.413564,60.33530,0.325134)"
       gradientUnits="userSpaceOnUse"
       id="linearGradient2489"
       xlink:href="#linearGradient2383"
       inkscape:collect="always" />
    <linearGradient
       y2="81.863159"
       x2="177.10718"
       y1="15.598222"
       x1="206.98412"
       gradientTransform="matrix(0.571304,0.000000,0.000000,0.638345,60.33530,0.325134)"
       gradientUnits="userSpaceOnUse"
       id="linearGradient2487"
       xlink:href="#linearGradient2403"
       inkscape:collect="always" />
    <linearGradient
       y2="81.863159"
       x2="177.10718"
       y1="15.598222"
       x1="206.98412"
       gradientTransform="matrix(0.571304,0.000000,0.000000,0.638345,60.33530,0.325134)"
       gradientUnits="userSpaceOnUse"
       id="linearGradient2478"
       xlink:href="#linearGradient2403"
       inkscape:collect="always" />
    <linearGradient
       y2="46.608990"
       x2="132.50201"
       y1="21.914911"
       x1="130.02267"
       gradientTransform="matrix(0.881821,0.000000,0.000000,0.413564,60.33530,0.325134)"
       gradientUnits="userSpaceOnUse"
       id="linearGradient2475"
       xlink:href="#linearGradient2383"
       inkscape:collect="always" />
    <linearGradient
       y2="84.142044"
       x2="161.74821"
       y1="108.61332"
       x1="147.57317"
       gradientTransform="matrix(0.592168,0.000000,0.000000,0.615855,60.33530,0.325134)"
       gradientUnits="userSpaceOnUse"
       id="linearGradient2472"
       xlink:href="#linearGradient2447"
       inkscape:collect="always" />
    <linearGradient
       y2="84.142044"
       x2="161.74821"
       y1="108.61332"
       x1="147.57317"
       gradientTransform="matrix(0.592168,0.000000,0.000000,0.615855,91.69440,-5.679809)"
       gradientUnits="userSpaceOnUse"
       id="linearGradient2469"
       xlink:href="#linearGradient2423"
       inkscape:collect="always" />
    <linearGradient
       y2="84.142044"
       x2="161.74821"
       y1="108.61332"
       x1="147.57317"
       gradientTransform="matrix(0.592168,0.000000,0.000000,0.615855,149.6998,-6.024822)"
       gradientUnits="userSpaceOnUse"
       id="linearGradient2466"
       xlink:href="#linearGradient2423"
       inkscape:collect="always" />
    <linearGradient
       y2="84.142044"
       x2="161.74821"
       y1="108.61332"
       x1="147.57317"
       gradientTransform="matrix(0.592168,0.000000,0.000000,0.615855,118.3407,-1.987874e-2)"
       gradientUnits="userSpaceOnUse"
       id="linearGradient2464"
       xlink:href="#linearGradient2447"
       inkscape:collect="always" />
    <linearGradient
       y2="46.608990"
       x2="132.50201"
       y1="21.914911"
       x1="130.02267"
       gradientTransform="matrix(0.881821,0.000000,0.000000,0.413564,118.3407,-1.987874e-2)"
       gradientUnits="userSpaceOnUse"
       id="linearGradient2462"
       xlink:href="#linearGradient2383"
       inkscape:collect="always" />
    <linearGradient
       y2="81.863159"
       x2="177.10718"
       y1="15.598222"
       x1="206.98412"
       gradientTransform="matrix(0.571304,0.000000,0.000000,0.638345,118.3407,-1.987874e-2)"
       gradientUnits="userSpaceOnUse"
       id="linearGradient2460"
       xlink:href="#linearGradient2403"
       inkscape:collect="always" />
    <linearGradient
       y2="81.863159"
       x2="177.10718"
       y1="15.598222"
       x1="206.98412"
       gradientTransform="matrix(0.571304,0.000000,0.000000,0.638345,118.3407,-1.987874e-2)"
       gradientUnits="userSpaceOnUse"
       id="linearGradient1648"
       xlink:href="#linearGradient2403"
       inkscape:collect="always" />
    <linearGradient
       y2="46.608990"
       x2="132.50201"
       y1="21.914911"
       x1="130.02267"
       gradientTransform="matrix(0.881821,0.000000,0.000000,0.413564,118.3407,-1.987874e-2)"
       gradientUnits="userSpaceOnUse"
       id="linearGradient1645"
       xlink:href="#linearGradient2383"
       inkscape:collect="always" />
    <linearGradient
       y2="84.142044"
       x2="161.74821"
       y1="108.61332"
       x1="147.57317"
       gradientTransform="matrix(0.592168,0.000000,0.000000,0.615855,118.3407,-1.987874e-2)"
       gradientUnits="userSpaceOnUse"
       id="linearGradient1642"
       xlink:href="#linearGradient2447"
       inkscape:collect="always" />
    <linearGradient
       y2="84.142044"
       x2="161.74821"
       y1="108.61332"
       x1="147.57317"
       gradientTransform="matrix(0.592168,0.000000,0.000000,0.615855,149.6998,-6.024822)"
       gradientUnits="userSpaceOnUse"
       id="linearGradient1639"
       xlink:href="#linearGradient2423"
       inkscape:collect="always" />
    <linearGradient
       id="linearGradient2406">
      <stop
         id="stop2407"
         offset="0.0000000"
         style="stop-color:#ffffff;stop-opacity:1.0000000;" />
      <stop
         id="stop2408"
         offset="1.0000000"
         style="stop-color:#ffffff;stop-opacity:0.0000000;" />
    </linearGradient>
    <linearGradient
       id="linearGradient1774">
      <stop
         id="stop1775"
         offset="0.0000000"
         style="stop-color:#aadf00;stop-opacity:1.0000000;" />
      <stop
         id="stop1776"
         offset="1.0000000"
         style="stop-color:#4dc721;stop-opacity:1.0000000;" />
    </linearGradient>
    <linearGradient
       id="linearGradient9590">
      <stop
         id="stop9591"
         offset="0.0000000"
         style="stop-color:#ffffff;stop-opacity:0.0000000;" />
      <stop
         id="stop9592"
         offset="1.0000000"
         style="stop-color:#ffffff;stop-opacity:1.0000000;" />
    </linearGradient>
    <linearGradient
       id="linearGradient583">
      <stop
         id="stop584"
         offset="0.0000000"
         style="stop-color:#000000;stop-opacity:1.0000000;" />
      <stop
         id="stop585"
         offset="1.0000000"
         style="stop-color:#000000;stop-opacity:0.0000000;" />
    </linearGradient>
    <linearGradient
       id="linearGradient2023">
      <stop
         id="stop2024"
         offset="0.0000000"
         style="stop-color:#006aff;stop-opacity:0.68627453;" />
      <stop
         id="stop2025"
         offset="1.0000000"
         style="stop-color:#001d8f;stop-opacity:0.0000000;" />
    </linearGradient>
    <linearGradient
       id="linearGradient1753">
      <stop
         id="stop1754"
         offset="0.0000000"
         style="stop-color:#0043e3;stop-opacity:1.0000000;" />
      <stop
         id="stop1755"
         offset="1.0000000"
         style="stop-color:#0054cb;stop-opacity:0.0000000;" />
    </linearGradient>
    <linearGradient
       id="linearGradient1601">
      <stop
         id="stop1602"
         offset="0.0000000"
         style="stop-color:#ffffff;stop-opacity:1.0000000;" />
      <stop
         id="stop1603"
         offset="1.0000000"
         style="stop-color:#ffffff;stop-opacity:0.0000000;" />
    </linearGradient>
    <linearGradient
       gradientTransform="matrix(-0.438649,-0.487911,-0.443615,0.493434,668.1330,236.8853)"
       gradientUnits="userSpaceOnUse"
       xlink:href="#linearGradient1811"
       id="linearGradient5832"
       y2="92.948952"
       x2="83.587624"
       y1="173.71150"
       x1="2.8250780" />
    <linearGradient
       id="linearGradient1811">
      <stop
         id="stop1812"
         offset="0.0000000"
         style="stop-color:#ffffff;stop-opacity:1.0000000;" />
      <stop
         id="stop1813"
         offset="1.0000000"
         style="stop-color:#ffffff;stop-opacity:0.0000000;" />
    </linearGradient>
    <linearGradient
       gradientTransform="matrix(-0.594078,-0.660796,-0.327552,0.364337,668.1330,236.8853)"
       gradientUnits="userSpaceOnUse"
       xlink:href="#linearGradient1811"
       id="linearGradient5831"
       y2="72.632477"
       x2="35.051991"
       y1="8.7856636"
       x1="98.898788" />
    <linearGradient
       id="linearGradient2386">
      <stop
         id="stop2387"
         offset="0.0000000"
         style="stop-color:#ffffff;stop-opacity:1.0000000;" />
      <stop
         id="stop2414"
         offset="0.50000000"
         style="stop-color:#46a046;stop-opacity:1.0000000;" />
      <stop
         id="stop2388"
         offset="1.0000000"
         style="stop-color:#267726;stop-opacity:1.0000000;" />
    </linearGradient>
    <linearGradient
       gradientTransform="matrix(-0.438670,-0.487934,-0.443594,0.493411,672.0580,236.4030)"
       gradientUnits="userSpaceOnUse"
       xlink:href="#linearGradient2386"
       id="linearGradient5830"
       y2="60.913353"
       x2="93.901772"
       y1="81.311424"
       x1="17.775131" />
    <linearGradient
       id="MaterialSoftShadow">
      <stop
         id="stop2619"
         offset="0.0000000"
         style="stop-color:#000000;stop-opacity:0.21500000;" />
      <stop
         id="stop2621"
         offset="0.50000000"
         style="stop-color:#000000;stop-opacity:0.097999997;" />
      <stop
         id="stop2620"
         offset="1.0000000"
         style="stop-color:#000000;stop-opacity:0.0000000;" />
    </linearGradient>
    <linearGradient
       gradientTransform="scale(0.970220,1.030694)"
       gradientUnits="userSpaceOnUse"
       xlink:href="#linearGradient583"
       id="linearGradient586"
       y2="220.08650"
       x2="585.33655"
       y1="221.22455"
       x1="649.97528" />
    <radialGradient
       gradientTransform="matrix(-0.449651,0.000000,0.000000,5.655982e-2,64.27940,129.8452)"
       gradientUnits="userSpaceOnUse"
       xlink:href="#MaterialSoftShadow"
       id="radialGradient95"
       fy="598.36652"
       fx="-289.09140"
       r="125.20509"
       cy="598.36652"
       cx="-289.09140" />
    <linearGradient
       gradientTransform="matrix(0.910642,0.000000,0.000000,0.888804,-3.847705,-6.943422)"
       gradientUnits="userSpaceOnUse"
       xlink:href="#linearGradient2023"
       id="linearGradient96"
       y2="77.293716"
       x2="127.76123"
       y1="267.64246"
       x1="127.76123" />
    <linearGradient
       gradientTransform="matrix(0.910641,0.000000,0.000000,0.888804,-4.670978,-2.468720)"
       gradientUnits="userSpaceOnUse"
       xlink:href="#linearGradient2023"
       id="linearGradient97"
       y2="87.374298"
       x2="98.614998"
       y1="-205.98883"
       x1="98.614998" />
    <linearGradient
       gradientTransform="matrix(-0.430713,2.937544e-2,-3.675125e-2,-0.513205,22.90210,291.8808)"
       gradientUnits="userSpaceOnUse"
       xlink:href="#linearGradient2023"
       id="linearGradient98"
       y2="347.80743"
       x2="-72.849289"
       y1="537.68445"
       x1="-219.76663" />
    <linearGradient
       gradientTransform="matrix(0.428786,-2.924403e-2,3.073985e-2,0.429260,148.0792,-150.3121)"
       gradientUnits="userSpaceOnUse"
       xlink:href="#linearGradient1601"
       id="linearGradient99"
       y2="383.04846"
       x2="-145.86057"
       y1="535.93958"
       x1="-265.25351" />
    <linearGradient
       gradientTransform="matrix(0.442094,-3.015165e-2,3.580514e-2,0.499992,155.7400,-169.5112)"
       gradientUnits="userSpaceOnUse"
       xlink:href="#linearGradient1753"
       id="linearGradient100"
       y2="372.94662"
       x2="-144.87398"
       y1="621.11951"
       x1="-326.93723" />
    <linearGradient
       gradientTransform="matrix(0.280505,0.369294,-0.388182,0.280812,285.5433,-24.72836)"
       gradientUnits="userSpaceOnUse"
       xlink:href="#linearGradient1601"
       id="linearGradient101"
       y2="396.03964"
       x2="-32.234215"
       y1="566.04218"
       x1="-118.47699" />
    <linearGradient
       gradientTransform="matrix(0.222505,0.292936,-0.375406,0.271571,260.8323,-14.83148)"
       gradientUnits="userSpaceOnUse"
       xlink:href="#linearGradient1601"
       id="linearGradient102"
       y2="391.66238"
       x2="-116.46814"
       y1="294.64520"
       x1="-36.098957" />
    <linearGradient
       gradientTransform="matrix(-0.226455,-0.298138,0.382071,-0.276392,-159.6213,107.6789)"
       gradientUnits="userSpaceOnUse"
       xlink:href="#linearGradient1601"
       id="linearGradient103"
       y2="411.96460"
       x2="-214.04250"
       y1="287.63867"
       x1="-95.537170" />
    <linearGradient
       gradientTransform="matrix(1.763197e-3,0.371427,-0.475996,2.152011e-3,272.9158,114.4792)"
       gradientUnits="userSpaceOnUse"
       xlink:href="#linearGradient1601"
       id="linearGradient104"
       y2="391.21393"
       x2="-117.35160"
       y1="276.70309"
       x1="-2.8407426" />
    <linearGradient
       gradientTransform="matrix(-1.728076e-3,-0.364029,0.462670,-2.091762e-3,-138.7624,-27.74102)"
       gradientUnits="userSpaceOnUse"
       xlink:href="#linearGradient9590"
       id="linearGradient105"
       y2="346.77014"
       x2="-150.65967"
       y1="392.99152"
       x1="-192.84351" />
    <linearGradient
       gradientTransform="matrix(0.878166,0.000000,0.000000,0.857671,-3.778146,-6.825558)"
       gradientUnits="userSpaceOnUse"
       xlink:href="#linearGradient1601"
       id="linearGradient106"
       y2="62.444679"
       x2="68.670418"
       y1="96.111839"
       x1="95.640572" />
    <linearGradient
       gradientTransform="matrix(0.910641,0.000000,0.000000,0.888804,-4.670978,-4.968720)"
       gradientUnits="userSpaceOnUse"
       xlink:href="#linearGradient2023"
       id="linearGradient1760"
       y2="87.374298"
       x2="98.614998"
       y1="-205.98883"
       x1="98.614998" />
    <linearGradient
       gradientTransform="scale(0.946032,1.057047)"
       gradientUnits="userSpaceOnUse"
       xlink:href="#linearGradient1774"
       id="linearGradient1777"
       y2="81.863159"
       x2="177.10718"
       y1="15.598222"
       x1="206.98412" />
    <linearGradient
       gradientTransform="scale(1.460222,0.684827)"
       gradientUnits="userSpaceOnUse"
       xlink:href="#linearGradient2406"
       id="linearGradient2405"
       y2="46.608990"
       x2="132.50201"
       y1="21.914911"
       x1="130.02267" />
    <linearGradient
       gradientTransform="scale(0.980581,1.019804)"
       gradientUnits="userSpaceOnUse"
       xlink:href="#linearGradient2406"
       id="linearGradient3034"
       y2="84.142044"
       x2="161.74821"
       y1="108.61332"
       x1="147.57317" />
    <linearGradient
       gradientTransform="matrix(0.980581,0.000000,0.000000,1.019804,51.92815,-9.943688)"
       gradientUnits="userSpaceOnUse"
       xlink:href="#linearGradient2406"
       id="linearGradient3037"
       y2="84.142044"
       x2="161.74821"
       y1="108.61332"
       x1="147.57317" />
    <linearGradient
       gradientTransform="scale(0.946032,1.057047)"
       gradientUnits="userSpaceOnUse"
       xlink:href="#linearGradient1774"
       id="linearGradient3670"
       y2="81.863159"
       x2="177.10718"
       y1="15.598222"
       x1="206.98412" />
    <linearGradient
       gradientTransform="scale(1.460222,0.684827)"
       gradientUnits="userSpaceOnUse"
       xlink:href="#linearGradient2406"
       id="linearGradient3671"
       y2="46.608990"
       x2="132.50201"
       y1="21.914911"
       x1="130.02267" />
    <linearGradient
       gradientTransform="scale(0.980581,1.019804)"
       gradientUnits="userSpaceOnUse"
       xlink:href="#linearGradient2406"
       id="linearGradient3672"
       y2="84.142044"
       x2="161.74821"
       y1="108.61332"
       x1="147.57317" />
    <linearGradient
       gradientTransform="matrix(0.980581,0.000000,0.000000,1.019804,51.92815,-9.943688)"
       gradientUnits="userSpaceOnUse"
       xlink:href="#linearGradient2406"
       id="linearGradient3673"
       y2="84.142044"
       x2="161.74821"
       y1="108.61332"
       x1="147.57317" />
    <linearGradient
       gradientTransform="translate(2.975845,0.975845)"
       gradientUnits="userSpaceOnUse"
       y2="84.962090"
       x2="86.772820"
       y1="177.41431"
       x1="59.867424"
       id="linearGradient3206"
       xlink:href="#linearGradient8655"
       inkscape:collect="always" />
    <radialGradient
       gradientUnits="userSpaceOnUse"
       gradientTransform="matrix(1.000000,0.000000,0.000000,0.228426,0.000000,85.02033)"
       r="48.060390"
       fy="110.19082"
       fx="51.231888"
       cy="110.19082"
       cx="51.231888"
       id="radialGradient3204"
       xlink:href="#linearGradient7917"
       inkscape:collect="always" />
    <linearGradient
       gradientTransform="translate(2.000000,0.000000)"
       gradientUnits="userSpaceOnUse"
       y2="75.682442"
       x2="54.294334"
       y1="33.477123"
       x1="21.100939"
       id="linearGradient3202"
       xlink:href="#linearGradient6455"
       inkscape:collect="always" />
    <linearGradient
       gradientTransform="translate(2.000000,0.000000)"
       y2="78.300934"
       x2="33.750458"
       y1="95.622185"
       x1="59.902058"
       gradientUnits="userSpaceOnUse"
       id="linearGradient3200"
       xlink:href="#linearGradient5703"
       inkscape:collect="always" />
    <linearGradient
       gradientTransform="translate(2.000000,0.000000)"
       gradientUnits="userSpaceOnUse"
       y2="61.223637"
       x2="48.388142"
       y1="33.899960"
       x1="31.114616"
       id="linearGradient3198"
       xlink:href="#linearGradient5691"
       inkscape:collect="always" />
    <linearGradient
       id="linearGradient3192">
      <stop
         id="stop3194"
         offset="0.0000000"
         style="stop-color:#ffffff;stop-opacity:0.83333325;" />
      <stop
         id="stop3196"
         offset="1"
         style="stop-color:#ffffff;stop-opacity:0.0000000" />
    </linearGradient>
    <linearGradient
       id="linearGradient3186">
      <stop
         style="stop-color:#ffffff;stop-opacity:0.83333325;"
         offset="0.0000000"
         id="stop3188" />
      <stop
         style="stop-color:#ffffff;stop-opacity:0.0000000"
         offset="1"
         id="stop3190" />
    </linearGradient>
    <linearGradient
       id="linearGradient3180">
      <stop
         id="stop3182"
         offset="0.0000000"
         style="stop-color:#ddf7ff;stop-opacity:1.0000000;" />
      <stop
         id="stop3184"
         offset="1.0000000"
         style="stop-color:#cad9ed;stop-opacity:1.0000000;" />
    </linearGradient>
    <linearGradient
       id="linearGradient3174">
      <stop
         id="stop3176"
         offset="0.0000000"
         style="stop-color:#000000;stop-opacity:0.16666669;" />
      <stop
         id="stop3178"
         offset="1"
         style="stop-color:#000000;stop-opacity:0;" />
    </linearGradient>
    <linearGradient
       id="linearGradient3168">
      <stop
         id="stop3170"
         offset="0.0000000"
         style="stop-color:#000000;stop-opacity:0.30208334;" />
      <stop
         id="stop3172"
         offset="1"
         style="stop-color:#000000;stop-opacity:0;" />
    </linearGradient>
    <linearGradient
       id="linearGradient2377">
      <stop
         style="stop-color:#ffffff;stop-opacity:1.0000000;"
         offset="0.0000000"
         id="stop2379" />
      <stop
         style="stop-color:#ffffff;stop-opacity:0.0000000;"
         offset="1.0000000"
         id="stop2381" />
    </linearGradient>
    <linearGradient
       id="linearGradient2383">
      <stop
         id="stop2385"
         offset="0.0000000"
         style="stop-color:#ffffff;stop-opacity:1.0000000;" />
      <stop
         id="stop2389"
         offset="1.0000000"
         style="stop-color:#ffffff;stop-opacity:0.0000000;" />
    </linearGradient>
    <linearGradient
       id="linearGradient2391">
      <stop
         style="stop-color:#aadf00;stop-opacity:1.0000000;"
         offset="0.0000000"
         id="stop2393" />
      <stop
         style="stop-color:#4dc721;stop-opacity:1.0000000;"
         offset="1.0000000"
         id="stop2395" />
    </linearGradient>
    <linearGradient
       id="linearGradient2397">
      <stop
         id="stop2399"
         offset="0.0000000"
         style="stop-color:#aadf00;stop-opacity:1.0000000;" />
      <stop
         id="stop2401"
         offset="1.0000000"
         style="stop-color:#4dc721;stop-opacity:1.0000000;" />
    </linearGradient>
    <linearGradient
       id="linearGradient2403">
      <stop
         style="stop-color:#aadf00;stop-opacity:1.0000000;"
         offset="0.0000000"
         id="stop2405" />
      <stop
         style="stop-color:#4dc721;stop-opacity:1.0000000;"
         offset="1.0000000"
         id="stop2409" />
    </linearGradient>
    <linearGradient
       id="linearGradient2411">
      <stop
         style="stop-color:#ffffff;stop-opacity:1.0000000;"
         offset="0.0000000"
         id="stop2413" />
      <stop
         style="stop-color:#ffffff;stop-opacity:0.0000000;"
         offset="1.0000000"
         id="stop2415" />
    </linearGradient>
    <linearGradient
       id="linearGradient2417">
      <stop
         id="stop2419"
         offset="0.0000000"
         style="stop-color:#ffffff;stop-opacity:1.0000000;" />
      <stop
         id="stop2421"
         offset="1.0000000"
         style="stop-color:#ffffff;stop-opacity:0.0000000;" />
    </linearGradient>
    <linearGradient
       id="linearGradient2423">
      <stop
         style="stop-color:#ffffff;stop-opacity:1.0000000;"
         offset="0.0000000"
         id="stop2425" />
      <stop
         style="stop-color:#ffffff;stop-opacity:0.0000000;"
         offset="1.0000000"
         id="stop2427" />
    </linearGradient>
    <linearGradient
       id="linearGradient2429">
      <stop
         style="stop-color:#ffffff;stop-opacity:1.0000000;"
         offset="0.0000000"
         id="stop2431" />
      <stop
         style="stop-color:#ffffff;stop-opacity:0.0000000;"
         offset="1.0000000"
         id="stop2433" />
    </linearGradient>
    <linearGradient
       id="linearGradient2435">
      <stop
         id="stop2437"
         offset="0.0000000"
         style="stop-color:#ffffff;stop-opacity:1.0000000;" />
      <stop
         id="stop2439"
         offset="1.0000000"
         style="stop-color:#ffffff;stop-opacity:0.0000000;" />
    </linearGradient>
    <linearGradient
       id="linearGradient2441">
      <stop
         style="stop-color:#ffffff;stop-opacity:1.0000000;"
         offset="0.0000000"
         id="stop2443" />
      <stop
         style="stop-color:#ffffff;stop-opacity:0.0000000;"
         offset="1.0000000"
         id="stop2445" />
    </linearGradient>
    <linearGradient
       id="linearGradient2447">
      <stop
         id="stop2449"
         offset="0.0000000"
         style="stop-color:#ffffff;stop-opacity:1.0000000;" />
      <stop
         id="stop2451"
         offset="1.0000000"
         style="stop-color:#ffffff;stop-opacity:0.0000000;" />
    </linearGradient>
    <linearGradient
       inkscape:collect="always"
       xlink:href="#linearGradient8655"
       id="linearGradient3299"
       gradientUnits="userSpaceOnUse"
       gradientTransform="translate(2.975845,0.975845)"
       x1="59.867424"
       y1="177.41431"
       x2="86.772820"
       y2="84.962090" />
    <radialGradient
       inkscape:collect="always"
       xlink:href="#linearGradient7917"
       id="radialGradient3301"
       gradientUnits="userSpaceOnUse"
       gradientTransform="matrix(1.000000,0.000000,0.000000,0.228426,0.000000,85.02033)"
       cx="51.231888"
       cy="110.19082"
       fx="51.231888"
       fy="110.19082"
       r="48.060390" />
    <linearGradient
       inkscape:collect="always"
       xlink:href="#linearGradient6455"
       id="linearGradient3303"
       gradientUnits="userSpaceOnUse"
       gradientTransform="translate(2.000000,0.000000)"
       x1="21.100939"
       y1="33.477123"
       x2="54.294334"
       y2="75.682442" />
    <linearGradient
       inkscape:collect="always"
       xlink:href="#linearGradient5691"
       id="linearGradient3305"
       gradientUnits="userSpaceOnUse"
       gradientTransform="translate(2.000000,0.000000)"
       x1="31.114616"
       y1="33.899960"
       x2="48.388142"
       y2="61.223637" />
    <linearGradient
       inkscape:collect="always"
       xlink:href="#linearGradient5703"
       id="linearGradient3307"
       gradientUnits="userSpaceOnUse"
       gradientTransform="translate(2.000000,0.000000)"
       x1="59.902058"
       y1="95.622185"
       x2="33.750458"
       y2="78.300934" />
    <linearGradient
       inkscape:collect="always"
       xlink:href="#linearGradient5703"
       id="linearGradient3315"
       gradientUnits="userSpaceOnUse"
       gradientTransform="translate(-151.7530,-42.76745)"
       x1="59.902058"
       y1="95.622185"
       x2="33.750458"
       y2="78.300934" />
    <linearGradient
       inkscape:collect="always"
       xlink:href="#linearGradient5691"
       id="linearGradient3318"
       gradientUnits="userSpaceOnUse"
       gradientTransform="translate(-151.7530,-42.76745)"
       x1="31.114616"
       y1="33.899960"
       x2="48.388142"
       y2="61.223637" />
    <linearGradient
       inkscape:collect="always"
       xlink:href="#linearGradient6455"
       id="linearGradient3322"
       gradientUnits="userSpaceOnUse"
       gradientTransform="translate(-151.7530,-42.76745)"
       x1="21.100939"
       y1="33.477123"
       x2="54.294334"
       y2="75.682442" />
    <linearGradient
       inkscape:collect="always"
       xlink:href="#linearGradient8655"
       id="linearGradient3326"
       gradientUnits="userSpaceOnUse"
       gradientTransform="translate(-150.7772,-41.79160)"
       x1="59.867424"
       y1="177.41431"
       x2="86.772820"
       y2="84.962090" />
    <radialGradient
       r="13.721804"
       fy="78.988319"
       fx="16.343327"
       cy="78.988319"
       cx="16.343327"
       gradientTransform="matrix(0.884614,0.000000,0.000000,1.650291,1.277019,-43.81916)"
       gradientUnits="userSpaceOnUse"
       id="radialGradient2990"
       xlink:href="#linearGradient2972"
       inkscape:collect="always" />
    <radialGradient
       r="13.721804"
       fy="78.988319"
       fx="16.343327"
       cy="78.988319"
       cx="16.343327"
       gradientTransform="matrix(-0.959901,0.000000,0.000000,1.940072,124.7212,-67.80191)"
       gradientUnits="userSpaceOnUse"
       id="radialGradient2988"
       xlink:href="#linearGradient2972"
       inkscape:collect="always" />
    <linearGradient
       id="linearGradient2972">
      <stop
         id="stop2974"
         offset="0.0000000"
         style="stop-color:#5f5f5f;stop-opacity:1.0000000;" />
      <stop
         id="stop2976"
         offset="1.0000000"
         style="stop-color:#353535;stop-opacity:1.0000000;" />
    </linearGradient>
    <linearGradient
       id="linearGradient4296">
      <stop
         id="stop4298"
         offset="0.0000000"
         style="stop-color:#000000;stop-opacity:0.18750000;" />
      <stop
         id="stop4300"
         offset="1"
         style="stop-color:#3f3f3f;stop-opacity:0;" />
    </linearGradient>
    <linearGradient
       inkscape:collect="always"
       xlink:href="#linearGradient2831"
       id="linearGradient2837"
       x1="67.797653"
       y1="161.46631"
       x2="84.481789"
       y2="104.98338"
       gradientUnits="userSpaceOnUse" />
    <radialGradient
       inkscape:collect="always"
       xlink:href="#linearGradient2909"
       id="radialGradient2847"
       gradientUnits="userSpaceOnUse"
       gradientTransform="matrix(-0.581760,0.000000,0.000000,1.363126,-98.23960,-8.073837)"
       cx="16.343327"
       cy="78.988319"
       fx="16.343327"
       fy="78.988319"
       r="13.721804" />
    <radialGradient
       inkscape:collect="always"
       xlink:href="#linearGradient2873"
       id="radialGradient2850"
       gradientUnits="userSpaceOnUse"
       gradientTransform="matrix(0.536132,0.000000,0.000000,1.159521,-173.0546,8.776827)"
       cx="16.343327"
       cy="78.988319"
       fx="16.343327"
       fy="78.988319"
       r="13.721804" />
    <linearGradient
       inkscape:collect="always"
       xlink:href="#linearGradient2403"
       id="linearGradient2915"
       gradientUnits="userSpaceOnUse"
       gradientTransform="matrix(0.571304,0.000000,0.000000,0.638345,60.33530,0.325134)"
       x1="206.98412"
       y1="15.598222"
       x2="177.10718"
       y2="81.863159" />
    <linearGradient
       inkscape:collect="always"
       xlink:href="#linearGradient2383"
       id="linearGradient2917"
       gradientUnits="userSpaceOnUse"
       gradientTransform="matrix(0.881821,0.000000,0.000000,0.413564,60.33530,0.325134)"
       x1="130.02267"
       y1="21.914911"
       x2="132.50201"
       y2="46.608990" />
    <linearGradient
       inkscape:collect="always"
       xlink:href="#linearGradient2447"
       id="linearGradient2919"
       gradientUnits="userSpaceOnUse"
       gradientTransform="matrix(0.592168,0.000000,0.000000,0.615855,60.33530,0.325134)"
       x1="147.57317"
       y1="108.61332"
       x2="161.74821"
       y2="84.142044" />
    <linearGradient
       inkscape:collect="always"
       xlink:href="#linearGradient2423"
       id="linearGradient2921"
       gradientUnits="userSpaceOnUse"
       gradientTransform="matrix(0.592168,0.000000,0.000000,0.615855,91.69440,-5.679809)"
       x1="147.57317"
       y1="108.61332"
       x2="161.74821"
       y2="84.142044" />
    <linearGradient
       inkscape:collect="always"
       xlink:href="#linearGradient3056"
       id="linearGradient2924"
       gradientUnits="userSpaceOnUse"
       gradientTransform="matrix(0.372672,0.000000,0.000000,0.484704,-167.7062,41.28573)"
       x1="147.57317"
       y1="108.61332"
       x2="161.74821"
       y2="84.142044" />
    <linearGradient
       inkscape:collect="always"
       xlink:href="#linearGradient3025"
       id="linearGradient2927"
       gradientUnits="userSpaceOnUse"
       gradientTransform="matrix(0.372672,0.000000,0.000000,0.484704,-187.4416,46.01187)"
       x1="147.57317"
       y1="108.61332"
       x2="161.74821"
       y2="84.142044" />
    <linearGradient
       inkscape:collect="always"
       xlink:href="#linearGradient2953"
       id="linearGradient2930"
       gradientUnits="userSpaceOnUse"
       gradientTransform="matrix(0.554961,0.000000,0.000000,0.325492,-187.4416,46.01187)"
       x1="130.02267"
       y1="21.914911"
       x2="132.50201"
       y2="46.608990" />
    <linearGradient
       inkscape:collect="always"
       xlink:href="#linearGradient2989"
       id="linearGradient2933"
       gradientUnits="userSpaceOnUse"
       gradientTransform="matrix(0.359542,0.000000,0.000000,0.502404,-187.4416,46.01187)"
       x1="206.98412"
       y1="15.598222"
       x2="177.10718"
       y2="81.863159" />
    <radialGradient
       inkscape:collect="always"
       xlink:href="#linearGradient3082"
       id="radialGradient3068"
       gradientUnits="userSpaceOnUse"
       gradientTransform="matrix(1.000000,0.000000,0.000000,0.160428,-9.733879e-14,97.09030)"
       cx="62.788994"
       cy="115.64259"
       fx="62.788994"
       fy="115.64259"
       r="62.455009" />
    <radialGradient
       inkscape:collect="always"
       xlink:href="#linearGradient3120"
       id="radialGradient3094"
       gradientUnits="userSpaceOnUse"
       gradientTransform="matrix(1.000000,0.000000,0.000000,0.160428,-9.446610e-14,97.09030)"
       cx="62.788994"
       cy="115.64259"
       fx="62.788994"
       fy="115.64259"
       r="62.455009" />
    <radialGradient
       inkscape:collect="always"
       xlink:href="#linearGradient3152"
       id="radialGradient3132"
       gradientUnits="userSpaceOnUse"
       gradientTransform="matrix(1.000000,0.000000,0.000000,0.160428,-3.089940e-14,97.09030)"
       cx="62.788994"
       cy="115.64259"
       fx="62.788994"
       fy="115.64259"
       r="62.455009" />
    <radialGradient
       inkscape:collect="always"
       xlink:href="#linearGradient3120"
       id="radialGradient3171"
       gradientUnits="userSpaceOnUse"
       gradientTransform="matrix(1.000000,0.000000,0.000000,0.160428,-4.696662e-13,97.09030)"
       cx="62.788994"
       cy="115.64259"
       fx="62.788994"
       fy="115.64259"
       r="62.455009" />
    <radialGradient
       inkscape:collect="always"
       xlink:href="#linearGradient2873"
       id="radialGradient3173"
       gradientUnits="userSpaceOnUse"
       gradientTransform="matrix(0.536132,0.000000,0.000000,1.159521,-173.0546,8.776827)"
       cx="16.343327"
       cy="78.988319"
       fx="16.343327"
       fy="78.988319"
       r="13.721804" />
    <radialGradient
       inkscape:collect="always"
       xlink:href="#linearGradient2909"
       id="radialGradient3175"
       gradientUnits="userSpaceOnUse"
       gradientTransform="matrix(-0.581760,0.000000,0.000000,1.363126,-98.23960,-8.073837)"
       cx="16.343327"
       cy="78.988319"
       fx="16.343327"
       fy="78.988319"
       r="13.721804" />
    <linearGradient
       inkscape:collect="always"
       xlink:href="#linearGradient2989"
       id="linearGradient3177"
       gradientUnits="userSpaceOnUse"
       gradientTransform="matrix(0.359542,0.000000,0.000000,0.502404,-187.4416,46.01187)"
       x1="206.98412"
       y1="15.598222"
       x2="177.10718"
       y2="81.863159" />
    <linearGradient
       inkscape:collect="always"
       xlink:href="#linearGradient2953"
       id="linearGradient3179"
       gradientUnits="userSpaceOnUse"
       gradientTransform="matrix(0.554961,0.000000,0.000000,0.325492,-187.4416,46.01187)"
       x1="130.02267"
       y1="21.914911"
       x2="132.50201"
       y2="46.608990" />
    <linearGradient
       inkscape:collect="always"
       xlink:href="#linearGradient3025"
       id="linearGradient3181"
       gradientUnits="userSpaceOnUse"
       gradientTransform="matrix(0.372672,0.000000,0.000000,0.484704,-187.4416,46.01187)"
       x1="147.57317"
       y1="108.61332"
       x2="161.74821"
       y2="84.142044" />
    <linearGradient
       inkscape:collect="always"
       xlink:href="#linearGradient3056"
       id="linearGradient3183"
       gradientUnits="userSpaceOnUse"
       gradientTransform="matrix(0.372672,0.000000,0.000000,0.484704,-167.7062,41.28573)"
       x1="147.57317"
       y1="108.61332"
       x2="161.74821"
       y2="84.142044" />
    <radialGradient
       inkscape:collect="always"
       xlink:href="#linearGradient3152"
       id="radialGradient3185"
       gradientUnits="userSpaceOnUse"
       gradientTransform="matrix(1.000000,0.000000,0.000000,0.160428,-3.411511e-13,97.09030)"
       cx="62.788994"
       cy="115.64259"
       fx="62.788994"
       fy="115.64259"
       r="62.455009" />
    <radialGradient
       inkscape:collect="always"
       xlink:href="#linearGradient3082"
       id="radialGradient3187"
       gradientUnits="userSpaceOnUse"
       gradientTransform="matrix(1.000000,0.000000,0.000000,0.160428,7.902016e-14,97.09030)"
       cx="62.788994"
       cy="115.64259"
       fx="62.788994"
       fy="115.64259"
       r="62.455009" />
  </defs>
  <sodipodi:namedview
     id="base"
     pagecolor="#ffffff"
     bordercolor="#666666"
     borderopacity="1.0"
     inkscape:pageopacity="0.0"
     inkscape:pageshadow="2"
     inkscape:zoom="2.0495048"
     inkscape:cx="64.723208"
     inkscape:cy="30.784162"
     inkscape:document-units="px"
     inkscape:current-layer="layer1"
     inkscape:window-width="844"
     inkscape:window-height="548"
     inkscape:window-x="0"
     inkscape:window-y="25"
     showguides="true"
     inkscape:guide-bbox="true" />
  <metadata
     id="metadata7">
    <rdf:RDF>
      <cc:Work
         rdf:about="">
        <dc:format>image/svg+xml</dc:format>
        <dc:type
           rdf:resource="http://purl.org/dc/dcmitype/StillImage" />
      </cc:Work>
    </rdf:RDF>
  </metadata>
  <g
     inkscape:label="Layer 1"
     inkscape:groupmode="layer"
     id="layer1">
    <path
       style="fill:url(#linearGradient5918);fill-opacity:1.0;fill-rule:evenodd;stroke:none;stroke-width:0.25000000pt;stroke-linecap:butt;stroke-linejoin:miter;stroke-opacity:1.0000000"
       d="M 96.120779,122.14493 L 127.34783,104.57971 L 78.555561,95.309177 L 96.120779,122.14493 z "
       id="path5910" />
    <path
       sodipodi:type="arc"
       style="opacity:1.0000000;color:#000000;fill:url(#radialGradient5902);fill-opacity:1.0000000;fill-rule:evenodd;stroke:none;stroke-width:2.0000000;stroke-linecap:round;stroke-linejoin:round;marker:none;marker-start:none;marker-mid:none;marker-end:none;stroke-miterlimit:4.0000000;stroke-dasharray:none;stroke-dashoffset:0.0000000;stroke-opacity:1.0000000;visibility:visible;display:inline;overflow:visible"
       id="path5894"
       sodipodi:cx="60.502419"
       sodipodi:cy="115.07005"
       sodipodi:rx="56.111115"
       sodipodi:ry="11.954107"
       d="M 116.61353 115.07005 A 56.111115 11.954107 0 1 1  4.3913040,115.07005 A 56.111115 11.954107 0 1 1  116.61353 115.07005 z"
       transform="translate(-4.879227,0.487923)" />
    <g
       id="g5883"
       transform="matrix(0.983988,0.000000,0.000000,0.983988,-4.195292,-0.907282)">
      <path
         sodipodi:nodetypes="cccccc"
         id="path1306"
         d="M 14.086358,113.28281 C 16.041434,83.381642 17.996510,46.580205 13.741344,11.158821 L 66.183392,5.8111122 C 75.383751,5.1785874 102.06480,14.953971 102.06480,23.579308 C 105.97495,60.035733 105.05491,93.732050 101.37477,124.66826 L 14.086358,113.28281 z "
         style="fill:url(#linearGradient5888);fill-opacity:1.0000000;fill-rule:evenodd;stroke:#bababa;stroke-width:3.0000000;stroke-linecap:round;stroke-linejoin:round;stroke-miterlimit:4.0000000;stroke-dasharray:none;stroke-opacity:1.0000000" />
      <path
         sodipodi:nodetypes="cccc"
         id="path2039"
         d="M 70.410069,10.112239 C 64.487338,19.025088 66.327409,32.423111 72.307643,37.195798 C 82.313033,26.730389 89.040795,21.267676 100.42624,23.222752 C 94.359754,14.942429 81.091111,8.6890580 70.410069,10.112239 z "
         style="fill:url(#linearGradient5890);fill-opacity:1.0000000;fill-rule:evenodd;stroke:none;stroke-width:0.25000000pt;stroke-linecap:butt;stroke-linejoin:miter;stroke-opacity:1.0000000" />
      <path
         sodipodi:nodetypes="cccc"
         id="path2037"
         d="M 63.940805,7.5361796 C 58.018074,16.449028 59.858145,29.847051 65.838379,34.619738 C 75.843769,24.154329 89.126787,21.106710 100.51223,23.061786 C 97.895880,15.126477 74.621847,6.1129987 63.940805,7.5361796 z "
         style="fill:url(#linearGradient5892);fill-opacity:1.0000000;fill-rule:evenodd;stroke:#bababa;stroke-width:1.0000000;stroke-linecap:butt;stroke-linejoin:miter;stroke-miterlimit:4.0000000;stroke-dasharray:none;stroke-opacity:1.0000000" />
    </g>
    <path
       style="fill:url(#linearGradient2837);fill-opacity:1.0;fill-rule:evenodd;stroke:none;stroke-width:0.15837563pt;stroke-linecap:butt;stroke-linejoin:miter;stroke-opacity:1.0000000"
       d="M 75.564678,109.81357 C 64.337101,109.81722 48.253181,112.96953 36.553225,117.15590 C 30.900464,117.15590 22.691726,118.52390 18.200538,120.21052 C 13.709334,121.89714 14.632586,123.26514 20.285350,123.26514 C 25.938113,123.26514 30.751600,121.97516 35.242785,120.28854 C 38.496397,119.06667 40.658602,117.97855 39.472251,117.46796 C 60.720564,110.37617 83.498697,109.71445 79.151600,116.81383 C 73.395244,117.31229 66.445417,118.76896 62.159333,120.37855 C 56.879504,122.36134 57.650768,123.80525 63.784620,123.80525 C 69.918474,123.80525 79.418203,122.69409 84.481788,120.21052 C 83.194903,116.91677 84.213451,117.78161 83.490020,116.63979 C 82.590300,108.99492 79.759707,110.84512 75.564678,109.81357 z "
       id="path2035"
       sodipodi:nodetypes="ccsssccssccc" />
    <g
       id="g3189">
      <g
         transform="translate(180.0000,0.000000)"
         id="g3158">
        <path
           sodipodi:type="arc"
           style="opacity:1.0000000;color:#000000;fill:url(#radialGradient3171);fill-opacity:1.0000000;fill-rule:evenodd;stroke:none;stroke-width:3.0000000;stroke-linecap:round;stroke-linejoin:round;marker:none;marker-start:none;marker-mid:none;marker-end:none;stroke-miterlimit:4.0000000;stroke-dasharray:none;stroke-dashoffset:0.0000000;stroke-opacity:1.0000000;visibility:visible;display:inline;overflow:visible"
           id="path3568"
           sodipodi:cx="62.788994"
           sodipodi:cy="115.64259"
           sodipodi:rx="62.455009"
           sodipodi:ry="10.019521"
           d="M 125.24400 115.64259 A 62.455009 10.019521 0 1 1  0.33398438,115.64259 A 62.455009 10.019521 0 1 1  125.24400 115.64259 z"
           transform="matrix(0.606063,0.000000,0.000000,0.702616,-173.2212,39.79953)" />
        <path
           style="fill:#000000;fill-opacity:1.0000000;fill-rule:evenodd;stroke:#000000;stroke-width:0.15837563pt;stroke-linecap:butt;stroke-linejoin:miter;stroke-opacity:1.0000000"
           d="M -158.86702,90.645555 C -159.01015,44.512553 -112.63626,44.356170 -112.92253,90.645555 C -112.92253,91.844492 -116.55890,93.043429 -116.55890,94.242366 C -117.27455,48.370002 -154.80125,51.289153 -155.23064,94.085982 C -155.23064,92.939173 -158.86702,91.792364 -158.86702,90.645555 z "
           id="path1509"
           sodipodi:nodetypes="ccccc" />
        <path
           style="fill:none;fill-opacity:0.75000000;fill-rule:evenodd;stroke:#696969;stroke-width:2.6102247;stroke-linecap:butt;stroke-linejoin:round;stroke-miterlimit:4.0000000;stroke-dasharray:none;stroke-opacity:1.0000000"
           d="M -154.67476,102.86191 L -144.06710,102.86191 L -139.52096,90.564324 L -134.27542,121.51099 L -131.82750,98.402343 L -129.02987,108.80799 L -127.86420,102.86191 L -117.83938,102.86191"
           id="path4312"
           sodipodi:nodetypes="cccccccc" />
        <path
           style="color:#000000;fill:url(#radialGradient3173);fill-opacity:1.0000000;fill-rule:evenodd;stroke:#212121;stroke-width:1.7777795;stroke-linecap:round;stroke-linejoin:round;marker:none;marker-start:none;marker-mid:none;marker-end:none;stroke-miterlimit:4.0000000;stroke-dashoffset:0.0000000;stroke-opacity:1.0000000;visibility:visible;display:inline;overflow:visible"
           d="M -151.69800,105.13461 C -151.69800,113.91733 -153.06990,120.65138 -158.72266,120.65138 C -164.37542,120.65138 -168.96317,113.52337 -168.96317,104.74065 C -168.96317,95.957934 -164.37542,88.829931 -158.72266,88.829931 C -153.06990,88.829931 -151.69800,96.351892 -151.69800,105.13461 z "
           id="path1504"
           sodipodi:nodetypes="csssc" />
        <path
           style="color:#000000;fill:url(#radialGradient3175);fill-opacity:1.0000000;fill-rule:evenodd;stroke:#212121;stroke-width:2.0079038;stroke-linecap:round;stroke-linejoin:round;marker:none;marker-start:none;marker-mid:none;marker-end:none;stroke-miterlimit:4.0000000;stroke-dashoffset:0.0000000;stroke-opacity:1.0000000;visibility:visible;display:inline;overflow:visible"
           d="M -124.55155,105.62755 C -124.55155,115.95246 -119.92511,123.44521 -113.79126,123.44521 C -107.65741,123.44521 -102.67920,115.06556 -102.67920,104.74065 C -102.67920,94.415741 -107.65741,86.036104 -113.79126,86.036104 C -119.92511,86.036104 -124.55155,95.302640 -124.55155,105.62755 z "
           id="path2986"
           sodipodi:nodetypes="csssc" />
        <path
           d="M -102.96311,50.764782 L -126.30069,56.230625 L -126.30069,65.677028 L -126.30069,81.257653 C -127.02621,80.840010 -127.82543,80.589275 -128.67602,80.589275 C -131.82831,80.589275 -134.38868,83.791254 -134.38868,87.733488 C -134.38868,91.675724 -131.82831,94.877702 -128.67602,94.877702 C -125.52373,94.877702 -122.96336,91.675724 -122.96336,87.733488 C -122.96336,87.591184 -122.99242,87.457862 -122.99899,87.317609 L -122.93961,87.317609 L -122.93961,64.889828 L -106.32420,60.998385 L -106.32420,76.385922 C -107.04950,75.968578 -107.84925,75.732397 -108.69952,75.732397 C -111.85182,75.732397 -114.40031,78.919525 -114.40031,82.861758 C -114.40031,86.803993 -111.85182,90.005973 -108.69952,90.005972 C -105.54723,90.005972 -102.98687,86.803995 -102.98687,82.861758 C -102.98687,82.717988 -103.01578,82.587556 -103.02249,82.445879 L -102.96311,82.445879 L -102.96311,60.211185 L -102.96311,51.997567 L -102.96311,50.764782 z "
           style="fill:url(#linearGradient3177);fill-opacity:1.0000000;stroke:#3cb30c;stroke-width:1.5273725;stroke-linejoin:round;stroke-miterlimit:4.0000000;stroke-dashoffset:0.0000000;stroke-opacity:1.0000000"
           id="path1139" />
        <path
           d="M -125.46401,65.048976 L -125.29605,57.277096 L -103.62908,52.025826 L -103.79705,59.587654 L -125.46401,65.048976 z "
           style="fill:url(#linearGradient3179);fill-opacity:1.0000000;fill-rule:evenodd;stroke:none;stroke-width:0.25000000pt;stroke-linecap:butt;stroke-linejoin:miter;stroke-opacity:1.0000000"
           id="path1778" />
        <path
           d="M -124.28828,87.734464 C -124.28828,90.749113 -125.32964,93.825936 -128.65527,93.825936 C -130.97313,93.825936 -133.52613,90.749113 -133.52613,87.734464 C -133.52613,84.719815 -131.30905,82.273143 -128.99119,82.273143 C -126.67332,82.273143 -124.28828,84.719815 -124.28828,87.734464 z "
           style="fill:url(#linearGradient3181);fill-opacity:1.0000000;stroke:none;stroke-width:3.5937152;stroke-linejoin:round;stroke-miterlimit:4.0000000;stroke-dashoffset:0.0000000;stroke-opacity:1.0000000"
           id="path2409" />
        <path
           d="M -104.55287,83.008321 C -104.55287,86.022971 -105.59423,89.099792 -108.91986,89.099792 C -111.23772,89.099792 -113.79072,86.022971 -113.79072,83.008321 C -113.79072,79.993672 -111.57364,77.547001 -109.25578,77.547001 C -106.93791,77.547001 -104.55287,79.993672 -104.55287,83.008321 z "
           style="fill:url(#linearGradient3183);fill-opacity:1.0000000;stroke:none;stroke-width:3.5937152;stroke-linejoin:round;stroke-miterlimit:4.0000000;stroke-dashoffset:0.0000000;stroke-opacity:1.0000000"
           id="path3036" />
        <path
           sodipodi:type="arc"
           style="opacity:1.0000000;color:#000000;fill:url(#radialGradient3185);fill-opacity:1.0000000;fill-rule:evenodd;stroke:none;stroke-width:3.0000000;stroke-linecap:round;stroke-linejoin:round;marker:none;marker-start:none;marker-mid:none;marker-end:none;stroke-miterlimit:4.0000000;stroke-dasharray:none;stroke-dashoffset:0.0000000;stroke-opacity:1.0000000;visibility:visible;display:inline;overflow:visible"
           id="path4304"
           sodipodi:cx="62.788994"
           sodipodi:cy="115.64259"
           sodipodi:rx="62.455009"
           sodipodi:ry="10.019521"
           d="M 125.24400 115.64259 A 62.455009 10.019521 0 1 1  0.33398438,115.64259 A 62.455009 10.019521 0 1 1  125.24400 115.64259 z"
           transform="matrix(0.282830,0.000000,0.000000,0.327888,-173.9770,84.30737)" />
        <path
           sodipodi:type="arc"
           style="opacity:1.0000000;color:#000000;fill:url(#radialGradient3187);fill-opacity:1.0000000;fill-rule:evenodd;stroke:none;stroke-width:3.0000000;stroke-linecap:round;stroke-linejoin:round;marker:none;marker-start:none;marker-mid:none;marker-end:none;stroke-miterlimit:4.0000000;stroke-dasharray:none;stroke-dashoffset:0.0000000;stroke-opacity:1.0000000;visibility:visible;display:inline;overflow:visible"
           id="path4308"
           sodipodi:cx="62.788994"
           sodipodi:cy="115.64259"
           sodipodi:rx="62.455009"
           sodipodi:ry="10.019521"
           d="M 125.24400 115.64259 A 62.455009 10.019521 0 1 1  0.33398438,115.64259 A 62.455009 10.019521 0 1 1  125.24400 115.64259 z"
           transform="matrix(0.282830,0.000000,0.000000,0.327888,-133.4939,83.83799)" />
      </g>
      <path
         transform="matrix(1.186047,0.000000,0.000000,1.000000,-3.574500,-0.862534)"
         d="M 25.703505 105.74663 A 3.7088950 14.145553 0 1 1  18.285715,105.74663 A 3.7088950 14.145553 0 1 1  25.703505 105.74663 z"
         sodipodi:ry="14.145553"
         sodipodi:rx="3.7088950"
         sodipodi:cy="105.74663"
         sodipodi:cx="21.994610"
         id="path2029"
         style="opacity:1.0000000;color:#000000;fill:#000000;fill-opacity:1.0000000;fill-rule:evenodd;stroke:none;stroke-width:2.9999990;stroke-linecap:round;stroke-linejoin:round;marker:none;marker-start:none;marker-mid:none;marker-end:none;stroke-miterlimit:4.0000000;stroke-dasharray:none;stroke-dashoffset:0.0000000;stroke-opacity:0.65882355;visibility:visible;display:inline;overflow:visible"
         sodipodi:type="arc" />
    </g>
  </g>
</svg>
