<?xml version="1.0" encoding="UTF-8" standalone="no"?>
<!-- Created with Inkscape (http://www.inkscape.org/) -->
<svg
   xmlns:dc="http://purl.org/dc/elements/1.1/"
   xmlns:cc="http://web.resource.org/cc/"
   xmlns:rdf="http://www.w3.org/1999/02/22-rdf-syntax-ns#"
   xmlns:svg="http://www.w3.org/2000/svg"
   xmlns="http://www.w3.org/2000/svg"
   xmlns:xlink="http://www.w3.org/1999/xlink"
   xmlns:sodipodi="http://inkscape.sourceforge.net/DTD/sodipodi-0.dtd"
   xmlns:inkscape="http://www.inkscape.org/namespaces/inkscape"
   width="128.00000px"
   height="128.00000px"
   id="svg2"
   sodipodi:version="0.32"
   inkscape:version="0.42"
   sodipodi:docbase="/home/silvestre/nuevos"
   sodipodi:docname="gnome-fs-regular.svg">
  <defs
     id="defs4">
    <linearGradient
       id="linearGradient6859">
      <stop
         style="stop-color:#000000;stop-opacity:0.68750000;"
         offset="0.0000000"
         id="stop6861" />
      <stop
         style="stop-color:#000000;stop-opacity:0;"
         offset="1"
         id="stop6863" />
    </linearGradient>
    <linearGradient
       id="linearGradient6853">
      <stop
         id="stop6855"
         offset="0.0000000"
         style="stop-color:#000000;stop-opacity:0.68750000;" />
      <stop
         id="stop6857"
         offset="1"
         style="stop-color:#000000;stop-opacity:0;" />
    </linearGradient>
    <linearGradient
       id="linearGradient6847">
      <stop
         style="stop-color:#000000;stop-opacity:0.68750000;"
         offset="0.0000000"
         id="stop6849" />
      <stop
         style="stop-color:#000000;stop-opacity:0;"
         offset="1"
         id="stop6851" />
    </linearGradient>
    <linearGradient
       id="linearGradient6841">
      <stop
         id="stop6843"
         offset="0.0000000"
         style="stop-color:#000000;stop-opacity:0.68750000;" />
      <stop
         id="stop6845"
         offset="1"
         style="stop-color:#000000;stop-opacity:0;" />
    </linearGradient>
    <linearGradient
       id="linearGradient6835">
      <stop
         style="stop-color:#000000;stop-opacity:0.68750000;"
         offset="0.0000000"
         id="stop6837" />
      <stop
         style="stop-color:#000000;stop-opacity:0;"
         offset="1"
         id="stop6839" />
    </linearGradient>
    <linearGradient
       id="linearGradient6829">
      <stop
         id="stop6831"
         offset="0.0000000"
         style="stop-color:#000000;stop-opacity:0.68750000;" />
      <stop
         id="stop6833"
         offset="1"
         style="stop-color:#000000;stop-opacity:0;" />
    </linearGradient>
    <linearGradient
       id="linearGradient6823">
      <stop
         style="stop-color:#ff003c;stop-opacity:1;"
         offset="0"
         id="stop6825" />
      <stop
         style="stop-color:#aa0028;stop-opacity:1.0000000;"
         offset="1.0000000"
         id="stop6827" />
    </linearGradient>
    <linearGradient
       id="linearGradient6817">
      <stop
         id="stop6819"
         offset="0"
         style="stop-color:#ff003c;stop-opacity:1;" />
      <stop
         id="stop6821"
         offset="1.0000000"
         style="stop-color:#aa0028;stop-opacity:1.0000000;" />
    </linearGradient>
    <linearGradient
       id="linearGradient6811">
      <stop
         style="stop-color:#ff003c;stop-opacity:1;"
         offset="0"
         id="stop6813" />
      <stop
         style="stop-color:#aa0028;stop-opacity:1.0000000;"
         offset="1.0000000"
         id="stop6815" />
    </linearGradient>
    <linearGradient
       id="linearGradient6805">
      <stop
         id="stop6807"
         offset="0"
         style="stop-color:#ff003c;stop-opacity:1;" />
      <stop
         id="stop6809"
         offset="1.0000000"
         style="stop-color:#aa0028;stop-opacity:1.0000000;" />
    </linearGradient>
    <linearGradient
       id="linearGradient6799">
      <stop
         style="stop-color:#ff003c;stop-opacity:1;"
         offset="0"
         id="stop6801" />
      <stop
         style="stop-color:#aa0028;stop-opacity:1.0000000;"
         offset="1.0000000"
         id="stop6803" />
    </linearGradient>
    <linearGradient
       id="linearGradient6793">
      <stop
         id="stop6795"
         offset="0"
         style="stop-color:#ff003c;stop-opacity:1;" />
      <stop
         id="stop6797"
         offset="1.0000000"
         style="stop-color:#aa0028;stop-opacity:1.0000000;" />
    </linearGradient>
    <linearGradient
       id="linearGradient6787">
      <stop
         style="stop-color:#ff003c;stop-opacity:1;"
         offset="0"
         id="stop6789" />
      <stop
         style="stop-color:#aa0028;stop-opacity:1.0000000;"
         offset="1.0000000"
         id="stop6791" />
    </linearGradient>
    <linearGradient
       id="linearGradient6781">
      <stop
         id="stop6783"
         offset="0"
         style="stop-color:#ff003c;stop-opacity:1;" />
      <stop
         id="stop6785"
         offset="1.0000000"
         style="stop-color:#aa0028;stop-opacity:1.0000000;" />
    </linearGradient>
    <linearGradient
       id="linearGradient6775">
      <stop
         style="stop-color:#e2e2e2;stop-opacity:1;"
         offset="0"
         id="stop6777" />
      <stop
         style="stop-color:#979797;stop-opacity:1.0000000;"
         offset="1.0000000"
         id="stop6779" />
    </linearGradient>
    <linearGradient
       id="linearGradient6769">
      <stop
         id="stop6771"
         offset="0"
         style="stop-color:#e2e2e2;stop-opacity:1;" />
      <stop
         id="stop6773"
         offset="1.0000000"
         style="stop-color:#979797;stop-opacity:1.0000000;" />
    </linearGradient>
    <linearGradient
       id="linearGradient6763">
      <stop
         style="stop-color:#e2e2e2;stop-opacity:1;"
         offset="0"
         id="stop6765" />
      <stop
         style="stop-color:#979797;stop-opacity:1.0000000;"
         offset="1.0000000"
         id="stop6767" />
    </linearGradient>
    <linearGradient
       id="linearGradient6757">
      <stop
         id="stop6759"
         offset="0"
         style="stop-color:#e2e2e2;stop-opacity:1;" />
      <stop
         id="stop6761"
         offset="1.0000000"
         style="stop-color:#979797;stop-opacity:1.0000000;" />
    </linearGradient>
    <linearGradient
       id="linearGradient6751">
      <stop
         style="stop-color:#e2e2e2;stop-opacity:1;"
         offset="0"
         id="stop6753" />
      <stop
         style="stop-color:#979797;stop-opacity:1.0000000;"
         offset="1.0000000"
         id="stop6755" />
    </linearGradient>
    <linearGradient
       id="linearGradient6745">
      <stop
         id="stop6747"
         offset="0"
         style="stop-color:#e2e2e2;stop-opacity:1;" />
      <stop
         id="stop6749"
         offset="1.0000000"
         style="stop-color:#979797;stop-opacity:1.0000000;" />
    </linearGradient>
    <linearGradient
       id="linearGradient6739">
      <stop
         id="stop6741"
         offset="0"
         style="stop-color:#ffe000;stop-opacity:1;" />
      <stop
         id="stop6743"
         offset="1.0000000"
         style="stop-color:#ff9500;stop-opacity:1.0000000;" />
    </linearGradient>
    <linearGradient
       id="linearGradient6733">
      <stop
         style="stop-color:#ffe000;stop-opacity:1;"
         offset="0"
         id="stop6735" />
      <stop
         style="stop-color:#ff9500;stop-opacity:1.0000000;"
         offset="1.0000000"
         id="stop6737" />
    </linearGradient>
    <linearGradient
       id="linearGradient6727">
      <stop
         id="stop6729"
         offset="0"
         style="stop-color:#ffe000;stop-opacity:1;" />
      <stop
         id="stop6731"
         offset="1.0000000"
         style="stop-color:#ff9500;stop-opacity:1.0000000;" />
    </linearGradient>
    <linearGradient
       id="linearGradient6721">
      <stop
         style="stop-color:#ffe000;stop-opacity:1;"
         offset="0"
         id="stop6723" />
      <stop
         style="stop-color:#ff9500;stop-opacity:1.0000000;"
         offset="1.0000000"
         id="stop6725" />
    </linearGradient>
    <linearGradient
       id="linearGradient6715">
      <stop
         id="stop6717"
         offset="0"
         style="stop-color:#ffe000;stop-opacity:1;" />
      <stop
         id="stop6719"
         offset="1.0000000"
         style="stop-color:#ff9500;stop-opacity:1.0000000;" />
    </linearGradient>
    <linearGradient
       id="linearGradient6709">
      <stop
         style="stop-color:#ffe000;stop-opacity:1;"
         offset="0"
         id="stop6711" />
      <stop
         style="stop-color:#ff9500;stop-opacity:1.0000000;"
         offset="1.0000000"
         id="stop6713" />
    </linearGradient>
    <linearGradient
       id="linearGradient6703">
      <stop
         id="stop6705"
         offset="0"
         style="stop-color:#ffe000;stop-opacity:1;" />
      <stop
         id="stop6707"
         offset="1.0000000"
         style="stop-color:#ff9500;stop-opacity:1.0000000;" />
    </linearGradient>
    <linearGradient
       inkscape:collect="always"
       id="linearGradient6697">
      <stop
         style="stop-color:#ffffff;stop-opacity:1;"
         offset="0"
         id="stop6699" />
      <stop
         style="stop-color:#ffffff;stop-opacity:0;"
         offset="1"
         id="stop6701" />
    </linearGradient>
    <linearGradient
       id="linearGradient5922">
      <stop
         style="stop-color:#000000;stop-opacity:0.57291669;"
         offset="0.0000000"
         id="stop5924" />
      <stop
         style="stop-color:#000000;stop-opacity:0;"
         offset="1"
         id="stop5926" />
    </linearGradient>
    <linearGradient
       inkscape:collect="always"
       id="linearGradient5912">
      <stop
         style="stop-color:#000000;stop-opacity:1;"
         offset="0"
         id="stop5914" />
      <stop
         style="stop-color:#000000;stop-opacity:0;"
         offset="1"
         id="stop5916" />
    </linearGradient>
    <linearGradient
       id="linearGradient5904">
      <stop
         id="stop5906"
         offset="0.0000000"
         style="stop-color:#000000;stop-opacity:0.19791669;" />
      <stop
         id="stop5908"
         offset="1"
         style="stop-color:#000000;stop-opacity:0;" />
    </linearGradient>
    <linearGradient
       inkscape:collect="always"
       id="linearGradient5856">
      <stop
         style="stop-color:#ffffff;stop-opacity:1;"
         offset="0"
         id="stop5858" />
      <stop
         style="stop-color:#ffffff;stop-opacity:0;"
         offset="1"
         id="stop5860" />
    </linearGradient>
    <linearGradient
       id="linearGradient5846">
      <stop
         style="stop-color:#e2e2e2;stop-opacity:1;"
         offset="0"
         id="stop5848" />
      <stop
         style="stop-color:#979797;stop-opacity:1.0000000;"
         offset="1.0000000"
         id="stop5850" />
    </linearGradient>
    <linearGradient
       id="linearGradient5836">
      <stop
         style="stop-color:#ff003c;stop-opacity:1;"
         offset="0"
         id="stop5838" />
      <stop
         style="stop-color:#aa0028;stop-opacity:1.0000000;"
         offset="1.0000000"
         id="stop5840" />
    </linearGradient>
    <linearGradient
       id="linearGradient5100">
      <stop
         style="stop-color:#000000;stop-opacity:0.68750000;"
         offset="0.0000000"
         id="stop5102" />
      <stop
         style="stop-color:#000000;stop-opacity:0;"
         offset="1"
         id="stop5104" />
    </linearGradient>
    <linearGradient
       id="linearGradient2906">
      <stop
         style="stop-color:#ffe000;stop-opacity:1;"
         offset="0"
         id="stop2908" />
      <stop
         style="stop-color:#ff9500;stop-opacity:1.0000000;"
         offset="1.0000000"
         id="stop2910" />
    </linearGradient>
    <linearGradient
       id="linearGradient2065">
      <stop
         style="stop-color:#ffffff;stop-opacity:1;"
         offset="0"
         id="stop2067" />
      <stop
         style="stop-color:#bfbfbf;stop-opacity:1.0000000;"
         offset="1.0000000"
         id="stop2069" />
    </linearGradient>
    <linearGradient
       id="linearGradient2057">
      <stop
         style="stop-color:#f0f0f0;stop-opacity:1;"
         offset="0"
         id="stop2059" />
      <stop
         style="stop-color:#dddddd;stop-opacity:1.0000000;"
         offset="1.0000000"
         id="stop2061" />
    </linearGradient>
    <linearGradient
       inkscape:collect="always"
       id="linearGradient2049">
      <stop
         style="stop-color:#0a0a0a;stop-opacity:1;"
         offset="0"
         id="stop2051" />
      <stop
         style="stop-color:#0a0a0a;stop-opacity:0;"
         offset="1"
         id="stop2053" />
    </linearGradient>
    <linearGradient
       inkscape:collect="always"
       xlink:href="#linearGradient2049"
       id="linearGradient2055"
       x1="69.606209"
       y1="-2.7867124"
       x2="82.630730"
       y2="34.129730"
       gradientUnits="userSpaceOnUse"
       gradientTransform="translate(0.975845,-1.951691)" />
    <linearGradient
       inkscape:collect="always"
       xlink:href="#linearGradient2057"
       id="linearGradient2063"
       x1="57.903072"
       y1="65.225105"
       x2="85.999580"
       y2="114.99323"
       gradientUnits="userSpaceOnUse" />
    <linearGradient
       inkscape:collect="always"
       xlink:href="#linearGradient2065"
       id="linearGradient2071"
       x1="80.507256"
       y1="19.193230"
       x2="84.654594"
       y2="10.410620"
       gradientUnits="userSpaceOnUse" />
    <linearGradient
       inkscape:collect="always"
       xlink:href="#linearGradient2906"
       id="linearGradient2912"
       x1="-47.589424"
       y1="58.896137"
       x2="-63.938179"
       y2="76.461357"
       gradientUnits="userSpaceOnUse" />
    <linearGradient
       inkscape:collect="always"
       xlink:href="#linearGradient5100"
       id="linearGradient5106"
       x1="-20.528118"
       y1="107.24106"
       x2="-8.1039801"
       y2="92.060463"
       gradientUnits="userSpaceOnUse"
       gradientTransform="translate(-20.00000,0.000000)" />
    <linearGradient
       inkscape:collect="always"
       xlink:href="#linearGradient5836"
       id="linearGradient5842"
       x1="-85.481979"
       y1="27.451311"
       x2="-94.657013"
       y2="43.796722"
       gradientUnits="userSpaceOnUse" />
    <linearGradient
       inkscape:collect="always"
       xlink:href="#linearGradient5846"
       id="linearGradient5852"
       x1="-80.819405"
       y1="33.768192"
       x2="-90.566032"
       y2="44.636120"
       gradientUnits="userSpaceOnUse" />
    <linearGradient
       inkscape:collect="always"
       xlink:href="#linearGradient5856"
       id="linearGradient5862"
       x1="-54.719166"
       y1="44.506268"
       x2="-69.467331"
       y2="60.721901"
       gradientUnits="userSpaceOnUse" />
    <linearGradient
       inkscape:collect="always"
       xlink:href="#linearGradient2906"
       id="linearGradient5873"
       gradientUnits="userSpaceOnUse"
       x1="-47.589424"
       y1="58.896137"
       x2="-63.938179"
       y2="76.461357" />
    <linearGradient
       inkscape:collect="always"
       xlink:href="#linearGradient5100"
       id="linearGradient5875"
       gradientUnits="userSpaceOnUse"
       gradientTransform="translate(-20.00000,2.685789e-14)"
       x1="-20.528118"
       y1="107.24106"
       x2="-8.1039801"
       y2="92.060463" />
    <linearGradient
       inkscape:collect="always"
       xlink:href="#linearGradient5836"
       id="linearGradient5877"
       gradientUnits="userSpaceOnUse"
       x1="-85.481979"
       y1="27.451311"
       x2="-94.657013"
       y2="43.796722" />
    <linearGradient
       inkscape:collect="always"
       xlink:href="#linearGradient5846"
       id="linearGradient5879"
       gradientUnits="userSpaceOnUse"
       x1="-80.819405"
       y1="33.768192"
       x2="-90.566032"
       y2="44.636120" />
    <linearGradient
       inkscape:collect="always"
       xlink:href="#linearGradient5856"
       id="linearGradient5881"
       gradientUnits="userSpaceOnUse"
       x1="-54.719166"
       y1="44.506268"
       x2="-69.467331"
       y2="60.721901" />
    <linearGradient
       inkscape:collect="always"
       xlink:href="#linearGradient2057"
       id="linearGradient5888"
       gradientUnits="userSpaceOnUse"
       x1="57.903072"
       y1="65.225105"
       x2="85.999580"
       y2="114.99323" />
    <linearGradient
       inkscape:collect="always"
       xlink:href="#linearGradient2049"
       id="linearGradient5890"
       gradientUnits="userSpaceOnUse"
       gradientTransform="translate(0.975845,-1.951691)"
       x1="69.606209"
       y1="-2.7867124"
       x2="82.630730"
       y2="34.129730" />
    <linearGradient
       inkscape:collect="always"
       xlink:href="#linearGradient2065"
       id="linearGradient5892"
       gradientUnits="userSpaceOnUse"
       x1="80.507256"
       y1="19.193230"
       x2="84.654594"
       y2="10.410620" />
    <radialGradient
       inkscape:collect="always"
       xlink:href="#linearGradient5904"
       id="radialGradient5902"
       cx="60.502419"
       cy="115.07005"
       fx="60.502419"
       fy="115.07005"
       r="56.111115"
       gradientTransform="matrix(1.000000,0.000000,0.000000,0.213043,0.000000,90.55513)"
       gradientUnits="userSpaceOnUse" />
    <linearGradient
       inkscape:collect="always"
       xlink:href="#linearGradient5912"
       id="linearGradient5918"
       x1="71.236717"
       y1="152.15218"
       x2="88.314011"
       y2="99.212555"
       gradientUnits="userSpaceOnUse" />
    <linearGradient
       inkscape:collect="always"
       xlink:href="#linearGradient5922"
       id="linearGradient5928"
       x1="-2.4150949"
       y1="148.70081"
       x2="95.913750"
       y2="93.498650"
       gradientUnits="userSpaceOnUse" />
    <linearGradient
       inkscape:collect="always"
       xlink:href="#linearGradient6697"
       id="linearGradient5937"
       gradientUnits="userSpaceOnUse"
       x1="-54.719166"
       y1="44.506268"
       x2="-69.467331"
       y2="60.721901"
       gradientTransform="matrix(-0.940957,0.000000,0.000000,0.940957,96.92630,28.53497)" />
    <linearGradient
       inkscape:collect="always"
       xlink:href="#linearGradient6775"
       id="linearGradient5940"
       gradientUnits="userSpaceOnUse"
       x1="-80.819405"
       y1="33.768192"
       x2="-90.566032"
       y2="44.636120"
       gradientTransform="matrix(-0.940957,0.000000,0.000000,0.940957,96.92630,28.53497)" />
    <linearGradient
       inkscape:collect="always"
       xlink:href="#linearGradient6823"
       id="linearGradient5943"
       gradientUnits="userSpaceOnUse"
       x1="-85.481979"
       y1="27.451311"
       x2="-94.657013"
       y2="43.796722"
       gradientTransform="matrix(-0.940957,0.000000,0.000000,0.940957,96.92630,28.53497)" />
    <linearGradient
       inkscape:collect="always"
       xlink:href="#linearGradient6859"
       id="linearGradient5946"
       gradientUnits="userSpaceOnUse"
       gradientTransform="matrix(-0.940957,0.000000,0.000000,0.940957,115.7454,28.53497)"
       x1="-20.528118"
       y1="107.24106"
       x2="-8.1039801"
       y2="92.060463" />
    <linearGradient
       inkscape:collect="always"
       xlink:href="#linearGradient6739"
       id="linearGradient5951"
       gradientUnits="userSpaceOnUse"
       x1="-47.589424"
       y1="58.896137"
       x2="-63.938179"
       y2="76.461357"
       gradientTransform="matrix(-0.940957,0.000000,0.000000,0.940957,96.92630,28.53497)" />
    <linearGradient
       inkscape:collect="always"
       xlink:href="#linearGradient6739"
       id="linearGradient6874"
       gradientUnits="userSpaceOnUse"
       gradientTransform="matrix(-0.940957,0.000000,0.000000,0.940957,96.92630,28.53497)"
       x1="-47.589424"
       y1="58.896137"
       x2="-63.938179"
       y2="76.461357" />
    <linearGradient
       inkscape:collect="always"
       xlink:href="#linearGradient6859"
       id="linearGradient6876"
       gradientUnits="userSpaceOnUse"
       gradientTransform="matrix(-0.940957,0.000000,0.000000,0.940957,115.7454,28.53497)"
       x1="-20.528118"
       y1="107.24106"
       x2="-8.1039801"
       y2="92.060463" />
    <linearGradient
       inkscape:collect="always"
       xlink:href="#linearGradient6823"
       id="linearGradient6878"
       gradientUnits="userSpaceOnUse"
       gradientTransform="matrix(-0.940957,0.000000,0.000000,0.940957,96.92630,28.53497)"
       x1="-85.481979"
       y1="27.451311"
       x2="-94.657013"
       y2="43.796722" />
    <linearGradient
       inkscape:collect="always"
       xlink:href="#linearGradient6775"
       id="linearGradient6880"
       gradientUnits="userSpaceOnUse"
       gradientTransform="matrix(-0.940957,0.000000,0.000000,0.940957,96.92630,28.53497)"
       x1="-80.819405"
       y1="33.768192"
       x2="-90.566032"
       y2="44.636120" />
    <linearGradient
       inkscape:collect="always"
       xlink:href="#linearGradient6697"
       id="linearGradient6882"
       gradientUnits="userSpaceOnUse"
       gradientTransform="matrix(-0.940957,0.000000,0.000000,0.940957,96.92630,28.53497)"
       x1="-54.719166"
       y1="44.506268"
       x2="-69.467331"
       y2="60.721901" />
  </defs>
  <sodipodi:namedview
     id="base"
     pagecolor="#ffffff"
     bordercolor="#666666"
     borderopacity="1.0"
     inkscape:pageopacity="0.0"
     inkscape:pageshadow="2"
     inkscape:zoom="2.0495048"
     inkscape:cx="59.646551"
     inkscape:cy="65.936180"
     inkscape:document-units="px"
     inkscape:current-layer="layer1"
     inkscape:window-width="844"
     inkscape:window-height="548"
     inkscape:window-x="0"
     inkscape:window-y="25"
     showguides="true"
     inkscape:guide-bbox="true" />
  <metadata
     id="metadata7">
    <rdf:RDF>
      <cc:Work
         rdf:about="">
        <dc:format>image/svg+xml</dc:format>
        <dc:type
           rdf:resource="http://purl.org/dc/dcmitype/StillImage" />
      </cc:Work>
    </rdf:RDF>
  </metadata>
  <g
     inkscape:label="Layer 1"
     inkscape:groupmode="layer"
     id="layer1">
    <path
       style="fill:url(#linearGradient5918);fill-opacity:1.0;fill-rule:evenodd;stroke:none;stroke-width:0.25000000pt;stroke-linecap:butt;stroke-linejoin:miter;stroke-opacity:1.0000000"
       d="M 96.120779,122.14493 L 127.34783,104.57971 L 78.555561,95.309177 L 96.120779,122.14493 z "
       id="path5910" />
    <path
       sodipodi:type="arc"
       style="opacity:1.0000000;color:#000000;fill:url(#radialGradient5902);fill-opacity:1.0000000;fill-rule:evenodd;stroke:none;stroke-width:2.0000000;stroke-linecap:round;stroke-linejoin:round;marker:none;marker-start:none;marker-mid:none;marker-end:none;stroke-miterlimit:4.0000000;stroke-dasharray:none;stroke-dashoffset:0.0000000;stroke-opacity:1.0000000;visibility:visible;display:inline;overflow:visible"
       id="path5894"
       sodipodi:cx="60.502419"
       sodipodi:cy="115.07005"
       sodipodi:rx="56.111115"
       sodipodi:ry="11.954107"
       d="M 116.61353 115.07005 A 56.111115 11.954107 0 1 1  4.3913040,115.07005 A 56.111115 11.954107 0 1 1  116.61353 115.07005 z"
       transform="translate(-4.879227,0.487923)" />
    <g
       id="g5883"
       transform="matrix(0.983988,0.000000,0.000000,0.983988,-4.195292,-0.907282)">
      <path
         sodipodi:nodetypes="cccccc"
         id="path1306"
         d="M 14.086358,113.28281 C 16.041434,83.381642 17.996510,46.580205 13.741344,11.158821 L 66.183392,5.8111122 C 75.383751,5.1785874 102.06480,14.953971 102.06480,23.579308 C 105.97495,60.035733 105.05491,93.732050 101.37477,124.66826 L 14.086358,113.28281 z "
         style="fill:url(#linearGradient5888);fill-opacity:1.0000000;fill-rule:evenodd;stroke:#bababa;stroke-width:3.0000000;stroke-linecap:round;stroke-linejoin:round;stroke-miterlimit:4.0000000;stroke-dasharray:none;stroke-opacity:1.0000000" />
      <path
         sodipodi:nodetypes="cccc"
         id="path2039"
         d="M 70.410069,10.112239 C 64.487338,19.025088 66.327409,32.423111 72.307643,37.195798 C 82.313033,26.730389 89.040795,21.267676 100.42624,23.222752 C 94.359754,14.942429 81.091111,8.6890580 70.410069,10.112239 z "
         style="fill:url(#linearGradient5890);fill-opacity:1.0000000;fill-rule:evenodd;stroke:none;stroke-width:0.25000000pt;stroke-linecap:butt;stroke-linejoin:miter;stroke-opacity:1.0000000" />
      <path
         sodipodi:nodetypes="cccc"
         id="path2037"
         d="M 63.940805,7.5361796 C 58.018074,16.449028 59.858145,29.847051 65.838379,34.619738 C 75.843769,24.154329 89.126787,21.106710 100.51223,23.061786 C 97.895880,15.126477 74.621847,6.1129987 63.940805,7.5361796 z "
         style="fill:url(#linearGradient5892);fill-opacity:1.0000000;fill-rule:evenodd;stroke:#bababa;stroke-width:1.0000000;stroke-linecap:butt;stroke-linejoin:miter;stroke-miterlimit:4.0000000;stroke-dasharray:none;stroke-opacity:1.0000000" />
    </g>
  </g>
</svg>
