<?xml version="1.0" encoding="UTF-8" standalone="no"?>
<!-- Created with Inkscape (http://www.inkscape.org/) -->

<svg
   width="691.16138"
   height="247.15211"
   viewBox="0 0 182.86977 65.392326"
   version="1.1"
   id="svg5"
   inkscape:version="1.2 (dc2aedaf03, 2022-05-15)"
   sodipodi:docname="boxshadow_blur_radius_inset.svg"
   xml:space="preserve"
   xmlns:inkscape="http://www.inkscape.org/namespaces/inkscape"
   xmlns:sodipodi="http://sodipodi.sourceforge.net/DTD/sodipodi-0.dtd"
   xmlns:xlink="http://www.w3.org/1999/xlink"
   xmlns="http://www.w3.org/2000/svg"
   xmlns:svg="http://www.w3.org/2000/svg"><sodipodi:namedview
     id="namedview7"
     pagecolor="#4f4f4f"
     bordercolor="#eeeeee"
     borderopacity="1"
     inkscape:showpageshadow="false"
     inkscape:pageopacity="0"
     inkscape:pagecheckerboard="true"
     inkscape:deskcolor="#505050"
     inkscape:document-units="px"
     showgrid="false"
     inkscape:zoom="1.3453378"
     inkscape:cx="82.135506"
     inkscape:cy="166.12928"
     inkscape:window-width="1920"
     inkscape:window-height="991"
     inkscape:window-x="-9"
     inkscape:window-y="-9"
     inkscape:window-maximized="1"
     inkscape:current-layer="layer1"
     showborder="true"
     borderlayer="true"
     shape-rendering="auto"
     showguides="true" /><defs
     id="defs2"><clipPath
       clipPathUnits="userSpaceOnUse"
       id="clipPath955"><rect
         style="fill:#ffffff;fill-opacity:1;stroke-width:0.264583;paint-order:fill markers stroke"
         id="rect957"
         width="52.916664"
         height="39.687496"
         x="2054.3066"
         y="133.89188" /></clipPath><clipPath
       clipPathUnits="userSpaceOnUse"
       id="clipPath1685"><rect
         style="fill:#ffffff;fill-opacity:0.534286;stroke-width:0.264583;paint-order:fill markers stroke"
         id="rect1687"
         width="52.916664"
         height="39.687496"
         x="1833.8656"
         y="130.16852" /></clipPath></defs><g
     inkscape:label="Camada 1"
     inkscape:groupmode="layer"
     id="layer1"
     transform="translate(-1824.1152,-38.195286)"><rect
       style="fill:#ffffff;fill-opacity:1;stroke-width:0.264583;paint-order:fill markers stroke"
       id="rect2493"
       width="182.86975"
       height="65.392326"
       x="1824.1152"
       y="38.195286" /><text
       xml:space="preserve"
       style="font-weight:bold;font-size:4.93532px;font-family:sans-serif;-inkscape-font-specification:'sans-serif Bold';text-align:end;text-anchor:end;fill:#e4e4e4;fill-opacity:1;stroke:none;stroke-width:0.396588;stroke-linejoin:bevel;stroke-dasharray:none;stroke-opacity:1"
       x="1897.0149"
       y="99.190292"
       id="text8997-9-9-4-9"
       transform="scale(0.99927722,1.0007233)"><tspan
         sodipodi:role="line"
         style="font-style:normal;font-variant:normal;font-weight:bold;font-stretch:normal;font-size:4.93532px;font-family:'Fira Code';-inkscape-font-specification:'Fira Code Bold';fill:#1a1a1a;stroke-width:0.396588"
         x="1897.0149"
         y="99.190292"
         id="tspan7679-9">blur_radius: 25.0</tspan><tspan
         sodipodi:role="line"
         style="font-style:normal;font-variant:normal;font-weight:bold;font-stretch:normal;font-size:4.93532px;font-family:'Fira Code';-inkscape-font-specification:'Fira Code Bold';fill:#1a1a1a;stroke-width:0.396588"
         x="1897.0149"
         y="105.54368"
         id="tspan12511-7-6-2-7" /></text><text
       xml:space="preserve"
       style="font-weight:bold;font-size:4.93532px;font-family:sans-serif;-inkscape-font-specification:'sans-serif Bold';text-align:end;text-anchor:end;fill:#e4e4e4;fill-opacity:1;stroke:none;stroke-width:0.396588;stroke-linejoin:bevel;stroke-dasharray:none;stroke-opacity:1"
       x="1988.1193"
       y="99.190292"
       id="text8997-1-1-6-5"
       transform="scale(0.99927722,1.0007233)"><tspan
         sodipodi:role="line"
         style="font-style:normal;font-variant:normal;font-weight:bold;font-stretch:normal;font-size:4.93532px;font-family:'Fira Code';-inkscape-font-specification:'Fira Code Bold';fill:#1a1a1a;stroke-width:0.396588"
         x="1988.1193"
         y="99.190292"
         id="tspan9051-6-5-6-0">blur_radius: 50.0</tspan><tspan
         sodipodi:role="line"
         style="font-style:normal;font-variant:normal;font-weight:bold;font-stretch:normal;font-size:4.93532px;font-family:'Fira Code';-inkscape-font-specification:'Fira Code Bold';fill:#1a1a1a;stroke-width:0.396588"
         x="1988.1193"
         y="105.54368"
         id="tspan12511-0-8-0-3" /></text><image
       width="97.895828"
       height="85.724998"
       preserveAspectRatio="none"
       xlink:href="data:image/png;base64,iVBORw0KGgoAAAANSUhEUgAAAXIAAAFECAYAAAA6B7W5AAAABHNCSVQICAgIfAhkiAAAB7tJREFU eJzt3E1y00oYhtGWbIdNsTAWmGJP2JL6Dm51ynEFqgjRz9s+ZwZMNGg9fPkkZai11gJArHHvCwDg 3wg5QDghBwgn5ADhhBwgnJADhBNygHBCDhBOyAHCCTlAOCEHCCfkAOGEHCCckAOEE3KAcEIOEE7I AcIJOUA4IQcIJ+QA4YQcIJyQA4QTcoBwQg4QTsgBwgk5QDghBwgn5ADhhBwgnJADhBNygHBCDhBO yAHCCTlAOCEHCCfkAOGEHCCckAOEE3KAcEIOEE7IAcIJOUA4IQcIJ+QA4YQcIJyQA4QTcoBwQg4Q TsgBwgk5QDghBwgn5ADhhBwgnJADhBNygHBCDhBOyAHCCTlAOCEHCCfkAOGEHCCckAOEE3KAcEIO EE7IAcIJOUA4IQcIJ+QA4YQcIJyQA4QTcoBwQg4Q7rz3BfTs9fW1vL6+7n0ZcEg/fvzY+xK6IeQr +vnzZzmdTuV0OpVx9MMPLMtS5nkutda9L6UrQr6iYRjK6XQq3759K+fz+e3v4NnUWkuttczzXH79 +lXmed77kroi5Csbx7Gcz+fy8vJSTqeTkPOUWsSv12u53W5C/sWEfANtMn95eTGZ81TaCmWapnK9 Xp37lQj5RsZxLJfLpVwulzKOowPNU6i1lmVZyjAMZZqmvS+nW0K+sXEc39Ys0Lu2TmFdQr6xYRje 9ubjOJZxHEut1YROF9oqpU3izvY2hHwHLeaXy+VtMnfYSXf/SuE8z+V2uznXGxHynbQHoG0yd+Dp QZvESyl24hsS8p0Mw/BuzWJnTg/meS7TNL2db7Yh5Du7n8wdfJK11Yp3xLcn5AfRgu5TfhK1T+/Z h5AfSFu1PP5Y6sk/R9Gm7nYe26f3fnfKvoT8QO735iZzEizL8vbBD/sR8oO5D7mbgyO7f2ecfQn5 Qd2vWeBo7l8zZH9CfmBt1fLRzrz9O6zp8fmMffgxCfnBmczZ2p8GhftP7zkOIQ8i5mzhd+dMvI9L yEP4Uo4jEPNjEvIwLeaizha8mZJByMOYzNnSMAwecAYQ8lBizhYEPIOQBxNz1iTiOYS8E6LOVxDv TH6hRwdEnK/iLGUykXfCDchXMJFnEvJwj2+xCDqf8dGvpyWH1UpHRJzPcnayCTlAOKuVzpm0+IjV SV9M5B0TcX7H2eiLkAOEE3KAcEIOEM7DzidiL/rcPODsl4kcIJyQA4QTcoBwQg4QTsgBwgk5QDgh Bwgn5ADhhBwgnJADhBNygHBCDhBOyAHCCTlAOCEHCCfkAOGEHCCckAOEE3KAcEIOEE7IAcIJOUA4 IQcIJ+QA4YQcIJyQA4QTcoBwQg4QTsgBwgk5QDghBwgn5ADhhBwgnJADhBNygHBCDhBOyAHCCTlA OCEHCCfkAOGEHCCckAOEE3KAcEIOEE7IAcIJOUA4IQcIJ+QA4YQcIJyQA4QTcoBwQg4QTsgBwgk5 QDghBwgn5ADhhBwgnJADhBNygHBCDhBOyAHCCTlAOCEHCCfkAOGEHCCckAOEE3KAcEIOEE7IAcIJ OUA4IQcIJ+QA4YQcIJyQA4QTcoBwQg4QTsgBwp33vgC2U2vd+xKAFZjIAcIJOUA4IQcIJ+QdsxPn d5yNvnjY2Tk3LPTPRA4QTsg7Yvrms5ydbFYr4doNOAzDuz/DZ9RanaFAQt4JNx88L6uVDog4f+NP 58VZymQi74QbkL/hvPRFyIO5GYFShDyWiAONkIdpbxW0t1RgTQaGDEIept1YbjCgEfIQws3enMHj EvIgjzfS48dAwHMS8oOrtZZlWd7F+nFHblJiDR8NCr78PCYhPzD7cI7KmTwWIT+oNonDUYn5cQj5 wQg4SZZlEfQDEPIDafvH+5vDA02O5KPftmlvvj8hPxDTOKmEfF9CfhC11jLPc5nnee9LgU8R8/0I +c5awKEH8zwL+g6EfCf3+/BpmsScLtw/4xH07Qj5Th4ncQ8z6UU720K+HSHfQZtabrdbmaaplCLk 9OH+bSuvJm5HyDd2v06B3on5NoR8Y8uylOv1agLnKXildhtCvpG2SvGBD8+knfdpmgR9RUK+gfbw 53q9ltvttvflwOY8AF2XkK+s1vpuH24S5xmZzNcl5CtqEa+1msSh/L9iNJl/PSFfUZs8fOwD733/ /n3vS+jKUP3XCBBt3PsCAPg3Qg4QTsgBwgk5QDghBwgn5ADhhBwgnJADhBNygHBCDhBOyAHCCTlA OCEHCCfkAOGEHCCckAOEE3KAcEIOEE7IAcIJOUA4IQcIJ+QA4YQcIJyQA4QTcoBwQg4QTsgBwgk5 QDghBwgn5ADhhBwgnJADhBNygHBCDhBOyAHCCTlAOCEHCCfkAOGEHCCckAOEE3KAcEIOEE7IAcIJ OUA4IQcIJ+QA4YQcIJyQA4QTcoBwQg4QTsgBwgk5QDghBwgn5ADhhBwgnJADhBNygHBCDhBOyAHC CTlAOCEHCCfkAOGEHCCckAOEE3KAcEIOEE7IAcIJOUA4IQcIJ+QA4YQcIJyQA4QTcoBwQg4QTsgB wgk5QDghBwgn5ADhhBwgnJADhBNygHBCDhBOyAHCCTlAOCEHCCfkAOGEHCCckAOEE3KAcEIOEE7I AcIJOUA4IQcIJ+QA4YQcIJyQA4QTcoBwQg4QTsgBwgk5QLj/ABv1VZMzPfqYAAAAAElFTkSuQmCC  "
       id="image270"
       x="1810.9608"
       y="110.90131"
       clip-path="url(#clipPath1685)"
       transform="translate(9.1289146,-81.744933)" /><image
       width="98.954163"
       height="84.402077"
       preserveAspectRatio="none"
       xlink:href="data:image/png;base64,iVBORw0KGgoAAAANSUhEUgAAAXYAAAE/CAYAAABSCejBAAAABHNCSVQICAgIfAhkiAAACEVJREFU eJzt3VFu2zgUhlHJmXV1ZV1dui5L8zBgh3WdpEklkfx5DjBPgwJCLH29vaaddd/3fQEgxq31BQBw LGEHCCPsAGGEHSCMsAOEEXaAMMIOEEbYAcIIO0AYYQcII+wAYYQdIIywA4QRdoAwwg4QRtgBwgg7 QBhhBwgj7ABhhB0gjLADhBF2gDDCDhBG2AHCCDtAGGEHCCPsAGGEHSCMsAOEEXaAMMIOEEbYAcII O0AYYQcII+wAYYQdIIywA4QRdoAwwg4QRtgBwgg7QBhhBwgj7ABhhB0gjLADhBF2gDDCDhBG2AHC CDtAGGEHCCPsAGGEHSCMsAOEEXaAMMIOEEbYAcIIO0AYYQcII+wAYYQdIIywA4QRdoAwwg4QRtgB wgg7QBhhBwjzT+sLSPH6+rq8vr62vgzo0vfv31tfwlSE/SA/fvxYbrfbsq7rsq5r68uB5vZ9//kf 1xL2g6zrutxut+Xl5WW53Wy4YNu25X6/L9u2tb6U6Qj7wUrcTe7Mqp7S7/d746uZk7AfqMTc5M7M 6kndcNOGsJ9gXdfl5eXl5+QOs9j33fqlA8J+ohJ4kzszKJM67Qn7ycpqppyY2ffdFE+E+rTLtm1O v3RE2E9m5066snaxfumHsF/EaRnSOP3SL2G/QIm5nTtJyk7dsNIfYb9QvZbxIDCyMqlbv/RJ2Bso k7u4M6JypJF+CXsjZXr3z1hGUXbqpvT+CXtDdu6MxDn1cQh7Q49n3E3u9Kg+/WJaH4Owd+Bx5y7w 9KDE3E59PMLegfrLw0zu9KLeqbsnxyLsHanjDq15o3Rcwt4ZkztXeet7i5x+GZ+wd6T+hKq408Lj +sX9NyZh75S1DC2Y1DMIe4eeTe5wNpN6DmHvXB15DxtnqM+pk0HYB1AmdzjDuq5+UUYYYR9Iiftb k7vfzsRn+DRpLmEfxLN1jMDzTAn2e/dH+f/ulUzCPpg67h5Invko1vVXBVi/ZBL2Af3p5L4spnf+ 9zipi3ouYR/Yn5yUEXUKQZ+HsA/MMUg+o17BkE3YQ4g77xHzuQh7AFM7f0Lc5yHsQZyWoWb1Mi9h D2N6pybqcxL2IM64U9THXMV9PsIeTNznJOQIeyCT+7xM6iyLsEezb5+ToCPskxD4bGJOTdgn8pW4 +66Z/ok6j/z2hgn8zUpG1Ptn5cYjE/tkBCCLaZ1nhH1iIt/WV9dcYs5HrGImJertWY9xFhP75ERi LKZ1/oSJHSCMsAOEsYphWRYrmd5ZwfAZws5vRL4PYs5XWcXwC1Hvh9eCrxJ2gDDCDhBG2AHCePOU d9nzXssbphzBxA4QRtgBwljF8ClWM8eyeuEMJnaAMMIOEEbYAcIIO0AYYQcII+wAYRx35DCOQj7n SCNXM7FzCFF/m58NVxN2gDDCDhBG2AHCCDtAGGEHCCPsAGGEHSCMDyhxifSz3D6ERE9M7ABhhB0g jLADhLFj5xJ20HAdEztAGGEHCCPsAGGEHSCMsAOEEXaAMMIOEEbYOYRz6m/zs+FqPqDEYQQM+mBi Bwgj7ABhhB0gjLADhBF2gDDCDhDGcUc+xZFG6J+JHSCMsAOEsYrhXVYvMB4TO0AYYQcII+wAYYSd X9ip98NrwVd585TfCAqMTdhZlkXMIYlVDEAYYQcIYxUzOSsYyGNin9RXg+4vguN4DTiLiX1iwtKe nyVnEPbJCAnks4qZwL7vgh7M68sjE/tEPPwwB2GfhKjDPIQ9mJjPx2vOsgh7pPJwr+vqQZ+QnTvC HszDDXMS9iAmdWom93kJexgPMoV7YV7CHqQ8yB5omJuwBxByPuIemYuwh/DgAoWwD8zqhc9yr8xB 2AdWTj2s69r6UhiAqM9D2Af0GPRnD6zgz+uj117g8wn7YOqzyR89vMI+r23blmV5fo8Iez5hH0QJ +keT+uOfYW7btr35F7z3aHIJ+0DKFAbwHmEfwL7v705e8Dd89UAeYe+cfy5zFfdYDmHvUL1Pt37h SvW9x7iEvVPWL7Qg6hmEvSOPk3od9XIaxjFGzlbfhyI/JmHvjPULvRD1cQl7R6xf6ImJfVzC3oHH N0qFnR7UJ7IEfizC3oF935f7/S7odEnYxyPsDdmnM5Jt2wR+EMLeUJnUxZ0RmNzHIeyNmNYZlbj3 T9gbKJM6jErc+ybsFzKlk8TOvV/CfoH6U3x26qTwCdV+CftFxJxU7u3+CPvJ6vVL2as7r06Cekq3 lumLsJ+shN1UQzph74ewn6js1J2AYRbi3gdhP0EJupucGVnLtCfsB6q/zMv3pjMrp2XaE/aD2aXD fzwL7Qj7QUzq8CtTezvCfhA3MDz37du31pcwnXVXI4Aot9YXAMCxhB0gjLADhBF2gDDCDhBG2AHC CDtAGGEHCCPsAGGEHSCMsAOEEXaAMMIOEEbYAcIIO0AYYQcII+wAYYQdIIywA4QRdoAwwg4QRtgB wgg7QBhhBwgj7ABhhB0gjLADhBF2gDDCDhBG2AHCCDtAGGEHCCPsAGGEHSCMsAOEEXaAMMIOEEbY AcIIO0AYYQcII+wAYYQdIIywA4QRdoAwwg4QRtgBwgg7QBhhBwgj7ABhhB0gjLADhBF2gDDCDhBG 2AHCCDtAGGEHCCPsAGGEHSCMsAOEEXaAMMIOEEbYAcIIO0AYYQcII+wAYYQdIIywA4QRdoAwwg4Q RtgBwgg7QBhhBwgj7ABhhB0gjLADhBF2gDDCDhBG2AHCCDtAGGEHCCPsAGGEHSCMsAOEEXaAMMIO EEbYAcIIO0AYYQcII+wAYYQdIIywA4QRdoAwwg4QRtgBwgg7QBhhBwgj7ABhhB0gjLADhBF2gDDC DhDmX9I1b/q6HATQAAAAAElFTkSuQmCC "
       id="image336"
       x="2032.6652"
       y="116.28277"
       clip-path="url(#clipPath955)"
       transform="translate(-119.55803,-85.50372)" /><text
       xml:space="preserve"
       style="font-weight:bold;font-size:5.64444px;font-family:sans-serif;-inkscape-font-specification:'sans-serif Bold';text-align:end;text-anchor:end;fill:#ff0000;stroke:none;stroke-width:0.396875;stroke-linejoin:bevel;stroke-dasharray:none;stroke-opacity:1"
       x="1880.8026"
       y="53.272007"
       id="text5498-5-3-4-3-2-5"><tspan
         sodipodi:role="line"
         id="tspan5496-1-0-79-5-1-0"
         style="font-size:5.64444px;fill:#ff0000;stroke-width:0.396875"
         x="1880.8026"
         y="53.272007">25px</tspan></text><path
       id="path6359-5-2-8-5"
       style="fill:#ff0000;stroke-width:0.0189966"
       d="m 1859.1997,53.613491 2.3161,1.4403 2.3162,-1.4403 -1.9132,5e-4 v -3.7345 h 1.9132 l -2.3162,-1.4403 -2.3162,1.4403 h 1.9132 v 3.734 z"
       sodipodi:nodetypes="ccccccccccc" /><text
       xml:space="preserve"
       style="font-weight:bold;font-size:5.64444px;font-family:sans-serif;-inkscape-font-specification:'sans-serif Bold';text-align:end;text-anchor:end;fill:#ff0000;stroke:none;stroke-width:0.396875;stroke-linejoin:bevel;stroke-dasharray:none;stroke-opacity:1"
       x="78.546448"
       y="-1891.0159"
       id="text5498-5-3-4-3-7"
       transform="rotate(90)"><tspan
         sodipodi:role="line"
         id="tspan5496-1-0-79-5-4"
         style="font-size:5.64444px;fill:#ff0000;stroke-width:0.396875"
         x="78.546448"
         y="-1891.0159">25px</tspan></text><path
       id="path6359-5-2-1"
       style="fill:#ff0000;stroke-width:0.0189966"
       d="m 1890.6743,56.943469 -1.4403,2.31617 1.4403,2.31614 -5e-4,-1.91316 h 3.7345 v 1.91316 l 1.4403,-2.31614 -1.4403,-2.31618 v 1.9132 h -3.734 z"
       sodipodi:nodetypes="ccccccccccc" /><path
       id="path6359-7-0"
       style="fill:#ff0000;stroke-width:0.0268653"
       d="m 1951.1633,60.272809 2.3162,1.44028 2.3161,-1.44028 -1.9131,4.6e-4 v -10.34906 h 1.9131 l -2.3161,-1.4403 -2.3162,1.4403 h 1.9132 v 10.3486 z"
       sodipodi:nodetypes="ccccccccccc" /><text
       xml:space="preserve"
       style="font-weight:bold;font-size:5.64444px;font-family:sans-serif;-inkscape-font-specification:'sans-serif Bold';text-align:end;text-anchor:end;fill:#ff0000;stroke:none;stroke-width:0.396875;stroke-linejoin:bevel;stroke-dasharray:none;stroke-opacity:1"
       x="1971.1788"
       y="56.624069"
       id="text5498-5-3-4-1-7"><tspan
         sodipodi:role="line"
         id="tspan5496-1-0-79-8-9"
         style="font-size:5.64444px;fill:#ff0000;stroke-width:0.396875"
         x="1971.1788"
         y="56.624069">50px</tspan></text><path
       id="path6359-4"
       style="fill:#ff0000;stroke-width:0.0268653"
       d="m 1975.8764,61.494386 -1.4403,2.316167 1.4403,2.31614 -5e-4,-1.91316 h 10.3491 v 1.91316 l 1.4403,-2.31614 -1.4403,-2.316179 v 1.913199 h -10.3486 z"
       sodipodi:nodetypes="ccccccccccc" /><text
       xml:space="preserve"
       style="font-weight:bold;font-size:5.64444px;font-family:sans-serif;-inkscape-font-specification:'sans-serif Bold';text-align:end;text-anchor:end;fill:#ff0000;stroke:none;stroke-width:0.396875;stroke-linejoin:bevel;stroke-dasharray:none;stroke-opacity:1"
       x="81.509933"
       y="-1979.5254"
       id="text5498-5-3-4-5"
       transform="rotate(90)"><tspan
         sodipodi:role="line"
         id="tspan5496-1-0-79-1"
         style="font-size:5.64444px;fill:#ff0000;stroke-width:0.396875"
         x="81.509933"
         y="-1979.5254">50px</tspan></text><rect
       style="fill:none;stroke:#ff5656;stroke-width:0.264583;stroke-dasharray:3.06518, 3.06518;paint-order:fill markers stroke"
       id="rect7817"
       width="26.193701"
       height="12.77305"
       x="1948.1101"
       y="61.845375" /><rect
       style="fill:none;stroke:#ff5656;stroke-width:0.264582;stroke-dasharray:3.06518, 3.06518;paint-order:fill markers stroke"
       id="rect8186"
       width="38.570438"
       height="25.56698"
       x="1850.1676"
       y="55.483845" /></g><inkscape:templateinfo><inkscape:name>Padrão</inkscape:name><inkscape:date>2022-06-22</inkscape:date></inkscape:templateinfo></svg>
