PyNaCl<2.0,>=1.1.2
protobuf>=3.20.0
pyRFC3339<2.0,>=1.0
pymacaroons<1.0,>=0.12.0
requests<3.0,>=2.18.1
six<2.0,>=1.11.0

[:python_full_version < "2.7.9"]
cryptography==1.3.2
ndg_httpsclient==0.3.3
pyOpenSSL==16.0.0
pyasn1==0.1.9

[:python_version < "3"]
ipaddress
