<?xml version="1.0" encoding="UTF-8" standalone="no"?>
<svg
   xmlns:dc="http://purl.org/dc/elements/1.1/"
   xmlns:cc="http://creativecommons.org/ns#"
   xmlns:rdf="http://www.w3.org/1999/02/22-rdf-syntax-ns#"
   xmlns:svg="http://www.w3.org/2000/svg"
   xmlns="http://www.w3.org/2000/svg"
   xmlns:sodipodi="http://sodipodi.sourceforge.net/DTD/sodipodi-0.dtd"
   xmlns:inkscape="http://www.inkscape.org/namespaces/inkscape"
   width="210mm"
   height="297mm"
   viewBox="0 0 210 297"
   version="1.1"
   id="svg851"
   inkscape:version="1.0.1 (3bc2e813f5, 2020-09-07)"
   sodipodi:docname="icon-marker-style.svg">
  <defs
     id="defs845" />
  <sodipodi:namedview
     id="base"
     pagecolor="#ffffff"
     bordercolor="#666666"
     borderopacity="1.0"
     inkscape:pageopacity="0.0"
     inkscape:pageshadow="2"
     inkscape:zoom="0.98994949"
     inkscape:cx="384.97384"
     inkscape:cy="408.21671"
     inkscape:document-units="mm"
     inkscape:current-layer="layer1"
     inkscape:document-rotation="0"
     showgrid="false"
     inkscape:window-width="1438"
     inkscape:window-height="1115"
     inkscape:window-x="186"
     inkscape:window-y="56"
     inkscape:window-maximized="0" />
  <metadata
     id="metadata848">
    <rdf:RDF>
      <cc:Work
         rdf:about="">
        <dc:format>image/svg+xml</dc:format>
        <dc:type
           rdf:resource="http://purl.org/dc/dcmitype/StillImage" />
        <dc:title></dc:title>
      </cc:Work>
    </rdf:RDF>
  </metadata>
  <g
     inkscape:label="Calque 1"
     inkscape:groupmode="layer"
     id="layer1">
    <g
       id="g1616">
      <path
         style="fill:none;stroke:#006680;stroke-width:7;stroke-linecap:butt;stroke-linejoin:miter;stroke-miterlimit:4;stroke-dasharray:none;stroke-opacity:1"
         d="m 26.82611,147.54495 49.748133,-13.23673 49.864587,10.61931 48.86176,30.30114"
         id="path1452-4"
         sodipodi:nodetypes="cccc" />
      <path
         style="fill:none;stroke:#c83737;stroke-width:7;stroke-linecap:butt;stroke-linejoin:miter;stroke-miterlimit:4;stroke-dasharray:none;stroke-opacity:1"
         d="m 31.448629,60.530733 46.039894,31.111479 55.777847,-5.671761 41.74569,41.214789"
         id="path1452"
         sodipodi:nodetypes="cccc" />
      <ellipse
         style="fill:#ffd6d6;fill-opacity:1;stroke:#c83737;stroke-width:7;stroke-miterlimit:4;stroke-dasharray:none;stroke-dashoffset:0;stroke-opacity:1"
         id="path1414"
         cx="31.665136"
         cy="61.514549"
         rx="13.999998"
         ry="13.999999" />
      <rect
         style="fill:#aaeeff;fill-opacity:1;stroke:#006680;stroke-width:7;stroke-miterlimit:4;stroke-dasharray:none;stroke-dashoffset:0;stroke-opacity:1"
         id="rect1468"
         width="25.277777"
         height="25.277775"
         x="14.913048"
         y="134.68098" />
      <ellipse
         style="fill:#ffd6d6;fill-opacity:1;stroke:#c83737;stroke-width:7;stroke-miterlimit:4;stroke-dasharray:none;stroke-dashoffset:0;stroke-opacity:1"
         id="path1414-9"
         cx="78.042702"
         cy="90.60437"
         rx="13.999998"
         ry="13.999999" />
      <ellipse
         style="fill:#ffd6d6;fill-opacity:1;stroke:#c83737;stroke-width:7;stroke-miterlimit:4;stroke-dasharray:none;stroke-dashoffset:0;stroke-opacity:1"
         id="path1414-7"
         cx="131.49661"
         cy="88.198944"
         rx="13.999998"
         ry="13.999999" />
      <ellipse
         style="fill:#ffd6d6;fill-opacity:1;stroke:#c83737;stroke-width:7;stroke-miterlimit:4;stroke-dasharray:none;stroke-dashoffset:0;stroke-opacity:1"
         id="path1414-3"
         cx="176.39789"
         cy="125.88395"
         rx="13.999998"
         ry="13.999999" />
      <rect
         style="fill:#aaeeff;fill-opacity:1;stroke:#006680;stroke-width:7;stroke-miterlimit:4;stroke-dasharray:none;stroke-dashoffset:0;stroke-opacity:1"
         id="rect1468-9"
         width="25.277777"
         height="25.277775"
         x="64.067467"
         y="121.53042" />
      <rect
         style="fill:#aaeeff;fill-opacity:1;stroke:#006680;stroke-width:7;stroke-miterlimit:4;stroke-dasharray:none;stroke-dashoffset:0;stroke-opacity:1"
         id="rect1468-7"
         width="25.277777"
         height="25.277775"
         x="114.58141"
         y="133.82481" />
      <rect
         style="fill:#aaeeff;fill-opacity:1;stroke:#006680;stroke-width:7;stroke-miterlimit:4;stroke-dasharray:none;stroke-dashoffset:0;stroke-opacity:1"
         id="rect1468-3"
         width="25.277777"
         height="25.277775"
         x="163.22446"
         y="161.35356" />
    </g>
  </g>
</svg>
