<?xml version="1.0" encoding="UTF-8" standalone="no"?>
<svg
   xmlns:dc="http://purl.org/dc/elements/1.1/"
   xmlns:cc="http://creativecommons.org/ns#"
   xmlns:rdf="http://www.w3.org/1999/02/22-rdf-syntax-ns#"
   xmlns:svg="http://www.w3.org/2000/svg"
   xmlns="http://www.w3.org/2000/svg"
   xmlns:sodipodi="http://sodipodi.sourceforge.net/DTD/sodipodi-0.dtd"
   xmlns:inkscape="http://www.inkscape.org/namespaces/inkscape"
   width="210mm"
   height="297mm"
   viewBox="0 0 210 297"
   version="1.1"
   id="svg3839"
   inkscape:version="1.0.1 (3bc2e813f5, 2020-09-07)"
   sodipodi:docname="errorbar.svg">
  <defs
     id="defs3833" />
  <sodipodi:namedview
     id="base"
     pagecolor="#ffffff"
     bordercolor="#666666"
     borderopacity="1.0"
     inkscape:pageopacity="0.0"
     inkscape:pageshadow="2"
     inkscape:zoom="1.4"
     inkscape:cx="489.95248"
     inkscape:cy="732.44707"
     inkscape:document-units="mm"
     inkscape:current-layer="layer1"
     inkscape:document-rotation="0"
     showgrid="false"
     inkscape:window-width="1438"
     inkscape:window-height="967"
     inkscape:window-x="208"
     inkscape:window-y="164"
     inkscape:window-maximized="0" />
  <metadata
     id="metadata3836">
    <rdf:RDF>
      <cc:Work
         rdf:about="">
        <dc:format>image/svg+xml</dc:format>
        <dc:type
           rdf:resource="http://purl.org/dc/dcmitype/StillImage" />
        <dc:title />
      </cc:Work>
    </rdf:RDF>
  </metadata>
  <g
     inkscape:label="Calque 1"
     inkscape:groupmode="layer"
     id="layer1">
    <g
       id="g5096"
       inkscape:export-xdpi="92"
       inkscape:export-ydpi="92">
      <rect
         style="fill:#cccccc;stroke:none;stroke-width:3.81446;stroke-linecap:round;stroke-linejoin:round;stroke-miterlimit:4;stroke-dasharray:none"
         id="rect2487"
         width="79.759361"
         height="75.595238"
         x="82.014458"
         y="163.85268"
         inkscape:export-xdpi="92"
         inkscape:export-ydpi="92" />
      <path
         style="fill:none;stroke:#000000;stroke-width:3.2;stroke-linecap:round;stroke-linejoin:round;stroke-miterlimit:4;stroke-dasharray:none;stroke-opacity:1"
         d="m 106.96726,169.8058 h 10.39435 -5.48066 v 49.3259 h -5.10268 10.01637"
         id="path5056-6" />
      <path
         style="fill:none;stroke:#000000;stroke-width:3.2;stroke-linecap:round;stroke-linejoin:round;stroke-opacity:1;stroke-miterlimit:4;stroke-dasharray:none"
         d="m 87.879463,175.38095 h 10.394344 -5.480653 v 49.32589 h -5.10268 10.01637"
         id="path5056" />
      <path
         style="fill:none;stroke:#000000;stroke-width:3.2;stroke-linecap:round;stroke-linejoin:round;stroke-miterlimit:4;stroke-dasharray:none;stroke-opacity:1"
         d="m 127.18899,174.34152 h 10.39434 -5.48065 v 49.32589 H 127 137.01637"
         id="path5056-0" />
      <path
         style="fill:none;stroke:#000000;stroke-width:3.2;stroke-linecap:round;stroke-linejoin:round;stroke-miterlimit:4;stroke-dasharray:none;stroke-opacity:1"
         d="m 145.89881,185.30283 h 10.39434 -5.48065 v 49.32589 h -5.10268 10.01637"
         id="path5056-04" />
      <g
         id="g5052"
         transform="translate(0.1889881,-14.174107)">
        <path
           style="fill:none;stroke:#006680;stroke-width:2.73732;stroke-linecap:butt;stroke-linejoin:miter;stroke-miterlimit:4;stroke-dasharray:none;stroke-opacity:1"
           d="m 92.279543,213.73259 19.453777,-5.17616 19.49931,4.15263 19.10716,11.84912"
           id="path1452-4"
           sodipodi:nodetypes="cccc" />
        <rect
           style="fill:#aaeeff;fill-opacity:1;stroke:#006680;stroke-width:2.73732;stroke-miterlimit:4;stroke-dasharray:none;stroke-dashoffset:0;stroke-opacity:1"
           id="rect1468"
           width="9.8847561"
           height="9.8847551"
           x="87.620995"
           y="208.70219" />
        <rect
           style="fill:#aaeeff;fill-opacity:1;stroke:#006680;stroke-width:2.73732;stroke-miterlimit:4;stroke-dasharray:none;stroke-dashoffset:0;stroke-opacity:1"
           id="rect1468-9"
           width="9.8847561"
           height="9.8847551"
           x="106.8426"
           y="203.55972" />
        <rect
           style="fill:#aaeeff;fill-opacity:1;stroke:#006680;stroke-width:2.73732;stroke-miterlimit:4;stroke-dasharray:none;stroke-dashoffset:0;stroke-opacity:1"
           id="rect1468-7"
           width="9.8847561"
           height="9.8847551"
           x="126.59584"
           y="208.3674" />
        <rect
           style="fill:#aaeeff;fill-opacity:1;stroke:#006680;stroke-width:2.73732;stroke-miterlimit:4;stroke-dasharray:none;stroke-dashoffset:0;stroke-opacity:1"
           id="rect1468-3"
           width="9.8847561"
           height="9.8847551"
           x="145.61748"
           y="219.13239" />
      </g>
    </g>
  </g>
</svg>
