<?xml version="1.0" encoding="UTF-8" standalone="no"?>
<svg
   xmlns:dc="http://purl.org/dc/elements/1.1/"
   xmlns:cc="http://creativecommons.org/ns#"
   xmlns:rdf="http://www.w3.org/1999/02/22-rdf-syntax-ns#"
   xmlns:svg="http://www.w3.org/2000/svg"
   xmlns="http://www.w3.org/2000/svg"
   xmlns:sodipodi="http://sodipodi.sourceforge.net/DTD/sodipodi-0.dtd"
   xmlns:inkscape="http://www.inkscape.org/namespaces/inkscape"
   width="210mm"
   height="297mm"
   viewBox="0 0 210 297"
   version="1.1"
   id="svg8"
   inkscape:version="1.0.1 (3bc2e813f5, 2020-09-07)"
   sodipodi:docname="xrange.svg">
  <defs
     id="defs2" />
  <sodipodi:namedview
     id="base"
     pagecolor="#ffffff"
     bordercolor="#666666"
     borderopacity="1.0"
     inkscape:pageopacity="0.0"
     inkscape:pageshadow="2"
     inkscape:zoom="1.979899"
     inkscape:cx="261.39296"
     inkscape:cy="212.09176"
     inkscape:document-units="mm"
     inkscape:current-layer="g1718"
     inkscape:document-rotation="0"
     showgrid="false"
     inkscape:window-width="1438"
     inkscape:window-height="967"
     inkscape:window-x="315"
     inkscape:window-y="159"
     inkscape:window-maximized="0" />
  <metadata
     id="metadata5">
    <rdf:RDF>
      <cc:Work
         rdf:about="">
        <dc:format>image/svg+xml</dc:format>
        <dc:type
           rdf:resource="http://purl.org/dc/dcmitype/StillImage" />
        <dc:title></dc:title>
      </cc:Work>
    </rdf:RDF>
  </metadata>
  <g
     inkscape:label="Calque 1"
     inkscape:groupmode="layer"
     id="layer1">
    <g
       id="g1718">
      <g
         id="g1740"
         inkscape:export-xdpi="92"
         inkscape:export-ydpi="92">
        <text
           xml:space="preserve"
           style="font-style:normal;font-weight:normal;font-size:70.5556px;line-height:1.25;font-family:sans-serif;fill:#668000;fill-opacity:1;stroke:none;stroke-width:0.609661"
           x="65.141624"
           y="63.910706"
           id="text856"
           transform="scale(1.0310942,0.9698435)"><tspan
             sodipodi:role="line"
             id="tspan854"
             x="65.141624"
             y="63.910706"
             style="font-style:normal;font-variant:normal;font-weight:normal;font-stretch:normal;font-size:70.5556px;font-family:Arial;-inkscape-font-specification:Arial;fill:#668000;stroke-width:0.609661">x</tspan></text>
        <path
           style="fill:none;stroke:#000000;stroke-width:2.965;stroke-linecap:round;stroke-linejoin:round;stroke-miterlimit:4;stroke-dasharray:none;stroke-opacity:1"
           d="M 59.974154,74.242094 H 114.02475"
           id="path833" />
        <path
           style="fill:none;stroke:#000000;stroke-width:2.965;stroke-linecap:round;stroke-linejoin:round;stroke-miterlimit:4;stroke-dasharray:none;stroke-opacity:1"
           d="M 59.985339,79.947026 V 68.855341"
           id="path835" />
        <path
           style="fill:none;stroke:#000000;stroke-width:2.965;stroke-linecap:round;stroke-linejoin:round;stroke-miterlimit:4;stroke-dasharray:none;stroke-opacity:1"
           d="m 100.9444,76.683718 -0.13364,-5.34539"
           id="path835-1"
           sodipodi:nodetypes="cc" />
        <path
           style="fill:none;stroke:#000000;stroke-width:2.965;stroke-linecap:round;stroke-linejoin:round;stroke-miterlimit:4;stroke-dasharray:none;stroke-opacity:1"
           d="m 86.311389,76.873426 -0.133635,-5.34539"
           id="path835-1-9"
           sodipodi:nodetypes="cc" />
        <path
           style="fill:none;stroke:#000000;stroke-width:2.965;stroke-linecap:round;stroke-linejoin:round;stroke-miterlimit:4;stroke-dasharray:none;stroke-opacity:1"
           d="m 71.878834,76.873427 -0.133635,-5.34539"
           id="path835-1-1"
           sodipodi:nodetypes="cc" />
        <path
           style="fill:#aad400;fill-opacity:1;stroke:#668000;stroke-width:3;stroke-linecap:round;stroke-linejoin:round;stroke-miterlimit:4;stroke-dasharray:none;stroke-opacity:1"
           d="m 59.985338,79.947027 -9.421249,-5.612659 9.421249,-5.479026 v 11.091685"
           id="path1552" />
        <path
           style="fill:#aad400;fill-opacity:1;stroke:#668000;stroke-width:3;stroke-linecap:round;stroke-linejoin:round;stroke-miterlimit:4;stroke-dasharray:none;stroke-opacity:1"
           d="m 109.73081,68.654833 9.42125,5.612659 -9.42125,5.479026 V 68.654833"
           id="path1552-8" />
      </g>
    </g>
  </g>
</svg>
