WorkDir: C:\Users\barry\Projects\pysvn\Extension
PYTHON: c:\python38.Win64\python.exe
Username: barry
SVN_BIN: C:\BuildRoot\Win64-VC-14.1-1.14.0\dist\bin
Info: PYSVN CMD c:\python38.Win64\python.exe C:\Users\barry\Projects\pysvn\Extension\Examples\Client\svn_cmd.py --pysvn-testing 01.03.00 --config-dir b:\configdir

Info: CMD mkdir testroot-05

Info: CMD subst b: C:\Users\barry\Projects\pysvn\Extension\Tests\testroot-05

Info: CMD cd /d b:\

Info: CMD C:\BuildRoot\Win64-VC-14.1-1.14.0\dist\bin\svnadmin create b:\repos
Info: Setup - mkdir

Info: PYSVN CMD mkdir file:///b:/repos/trunk -m "test-05 add trunk"
commit_finalizing .

Info: PYSVN CMD mkdir file:///b:/repos/trunk/test -m "test-05 add test"
commit_finalizing .
Info: Setup - checkout wc1

Info: PYSVN CMD checkout file:///b:/repos/trunk b:\wc1
A B:/wc1/test
U B:/wc1
update_started B:/wc1
Checked out revision 2

Info: CMD cd b:\wc1\test
Info: Setup - add files
Info: Create File file1.txt - test add file 1     
Info: Create File file2.txt - test add file 2     

Info: PYSVN CMD add file1.txt
A B:/wc1/test/file1.txt

Info: PYSVN CMD add file2.txt
A B:/wc1/test/file2.txt

Info: PYSVN CMD checkin -m "commit added files"
A B:/wc1/test/file1.txt
A B:/wc1/test/file2.txt
commit_finalizing .
Revision 3
Info: Setup - checkout wc2

Info: PYSVN CMD checkout file:///b:/repos/trunk b:\wc2
A B:/wc2/test
A B:/wc2/test/file1.txt
A B:/wc2/test/file2.txt
U B:/wc2
update_started B:/wc2
Checked out revision 3
Info: Test - status of unlocked files

Info: PYSVN CMD status --verbose b:\wc1
               2      2 barry          B:\wc1
               2      2 barry          B:\wc1\test
               3      3 barry          B:\wc1\test\file1.txt
               3      3 barry          B:\wc1\test\file2.txt
Info: Test - info2 of unlocked files

Info: PYSVN CMD info2 b:\wc1\test\file1.txt

Path: B:/wc1/test/file1.txt
Url: file:///B:/repos/trunk/test/file1.txt
Revision: 3
Repository root_URL: file:///B:/repos
Repository UUID: d52a8600-1afa-5548-868b-b308103e8346
Last changed author: barry
Last Changed Date: 31-Aug-2020 15:02:19
Last changed revision: 3
Node kind: file
Schedule: normal
Text Last Updated: 31-Aug-2020 15:02:18
Checksum: d88eba14019658765c3dc2a2b46c4d0f1ee50e5f
Info: Test - list of unlocked files

Info: PYSVN CMD list --verbose --fetch-locks b:\wc1\test\file1.txt
      3 barry          17 31-Aug-2020 15:02:19 B:/wc1/test/file1.txt

Info: PYSVN CMD list --verbose --fetch-locks b:\wc1\test
      3 barry           - 31-Aug-2020 15:02:19 B:/wc1/test
      3 barry          17 31-Aug-2020 15:02:19 B:/wc1/test/file1.txt
      3 barry          17 31-Aug-2020 15:02:19 B:/wc1/test/file2.txt
Info: Test - lock unlocked file

Info: PYSVN CMD lock b:\wc1\test\file1.txt
locked B:/wc1/test/file1.txt
Info: Test - status of locked files

Info: PYSVN CMD status --verbose b:\wc1
               2      2 barry          B:\wc1
               2      2 barry          B:\wc1\test
     K         3      3 barry          B:\wc1\test\file1.txt
               3      3 barry          B:\wc1\test\file2.txt
Info: Test - info2 of locked files

Info: PYSVN CMD info2 b:\wc1\test\file1.txt

Path: B:/wc1/test/file1.txt
Url: file:///B:/repos/trunk/test/file1.txt
Revision: 3
Repository root_URL: file:///B:/repos
Repository UUID: d52a8600-1afa-5548-868b-b308103e8346
Last changed author: barry
Last Changed Date: 31-Aug-2020 15:02:19
Last changed revision: 3
Node kind: file
Lock Owner: barry
Lock Creation Date: 31-Aug-2020 15:02:20
Lock Token: opaquelocktoken:659984cb-1ca1-3b43-8b95-1ac5d8427c99
Lock Comment:
Schedule: normal
Text Last Updated: 31-Aug-2020 15:02:18
Checksum: d88eba14019658765c3dc2a2b46c4d0f1ee50e5f
Info: Test - list of locked files

Info: PYSVN CMD list --verbose --fetch-locks b:\wc1\test\file1.txt
      3 barry          17 31-Aug-2020 15:02:19 B:/wc1/test/file1.txt
        Lock   owner: barry
        Lock comment: 
        Lock created: 2020-08-31 15:02:20

Info: PYSVN CMD list --verbose --fetch-locks b:\wc1\test
      3 barry           - 31-Aug-2020 15:02:19 B:/wc1/test
      3 barry          17 31-Aug-2020 15:02:19 B:/wc1/test/file1.txt
        Lock   owner: barry
        Lock comment: 
        Lock created: 2020-08-31 15:02:20
      3 barry          17 31-Aug-2020 15:02:19 B:/wc1/test/file2.txt
Info: Test - attempt to checkin over a locked file

Info: CMD cd b:\wc2\test
Info: Append File file1.txt - Change to file 1     
Info: Append File file2.txt - Change to file 2     

Info: PYSVN CMD commit -m "change when file locked in other wc" .
M B:/wc2/test/file1.txt
M B:/wc2/test/file2.txt
failed_locked B:/wc2/test/file1.txt
Commit failed (details follow):
File 'B:\wc2\test\file1.txt' is locked in another working copy
While preparing 'B:\wc2\test\file1.txt' for commit
Cannot verify lock on path '/trunk/test/file1.txt'; no matching lock-token available
Info: Test - lock locked file

Info: PYSVN CMD lock b:\wc2\test\file1.txt
failed_lock B:/wc2/test/file1.txt
Info: Test - lock --force locked file

Info: PYSVN CMD lock --force b:\wc2\test\file1.txt -m "Stealing lock"
locked B:/wc2/test/file1.txt
Info: Test - info2 of locked files

Info: PYSVN CMD info2 b:\wc2\test\file1.txt

Path: B:/wc2/test/file1.txt
Url: file:///B:/repos/trunk/test/file1.txt
Revision: 3
Repository root_URL: file:///B:/repos
Repository UUID: d52a8600-1afa-5548-868b-b308103e8346
Last changed author: barry
Last Changed Date: 31-Aug-2020 15:02:19
Last changed revision: 3
Node kind: file
Lock Owner: barry
Lock Creation Date: 31-Aug-2020 15:02:21
Lock Token: opaquelocktoken:21fcd9d9-1c61-4e4d-8af4-e7545e53ded6
Lock Comment:
Stealing lock
Schedule: normal
Text Last Updated: 31-Aug-2020 15:02:19
Checksum: d88eba14019658765c3dc2a2b46c4d0f1ee50e5f
Info: Test - status of locked files

Info: PYSVN CMD status --verbose b:\wc2
               3      3 barry          B:\wc2
               3      3 barry          B:\wc2\test
M    K         3      3 barry          B:\wc2\test\file1.txt
M              3      3 barry          B:\wc2\test\file2.txt
Info: Test - list of locked files

Info: PYSVN CMD list --verbose --fetch-locks --recursive b:\wc2
      3 barry           - 31-Aug-2020 15:02:19 B:/wc2
      3 barry           - 31-Aug-2020 15:02:19 B:/wc2/test
      3 barry          17 31-Aug-2020 15:02:19 B:/wc2/test/file1.txt
        Lock   owner: barry
        Lock comment: Stealing lock
        Lock created: 2020-08-31 15:02:21
      3 barry          17 31-Aug-2020 15:02:19 B:/wc2/test/file2.txt
Info: Test - commit with lock

Info: PYSVN CMD commit -m "change when file locked in this wc" .
M B:/wc2/test/file1.txt
M B:/wc2/test/file2.txt
commit_finalizing .
Revision 4
Info: Test - status of locked files

Info: PYSVN CMD status --verbose b:\wc2
               3      3 barry          B:\wc2
               3      3 barry          B:\wc2\test
     K         4      4 barry          B:\wc2\test\file1.txt
               4      4 barry          B:\wc2\test\file2.txt
Info: Test - list of locked files

Info: PYSVN CMD list --verbose --fetch-locks --recursive b:\wc2
      4 barry           - 31-Aug-2020 15:02:21 B:/wc2
      4 barry           - 31-Aug-2020 15:02:21 B:/wc2/test
      4 barry          35 31-Aug-2020 15:02:21 B:/wc2/test/file1.txt
        Lock   owner: barry
        Lock comment: Stealing lock
        Lock created: 2020-08-31 15:02:21
      4 barry          35 31-Aug-2020 15:02:21 B:/wc2/test/file2.txt
Info: Test - unlock locked file

Info: PYSVN CMD unlock b:\wc2\test\file1.txt
unlocked B:/wc2/test/file1.txt
Info: Test - status of unlocked files

Info: PYSVN CMD status --verbose b:\wc2
               3      3 barry          B:\wc2
               3      3 barry          B:\wc2\test
               4      4 barry          B:\wc2\test\file1.txt
               4      4 barry          B:\wc2\test\file2.txt
Info: Test - list of unlocked files

Info: PYSVN CMD list --verbose --fetch-locks --recursive b:\wc2
      4 barry           - 31-Aug-2020 15:02:21 B:/wc2
      4 barry           - 31-Aug-2020 15:02:21 B:/wc2/test
      4 barry          35 31-Aug-2020 15:02:21 B:/wc2/test/file1.txt
      4 barry          35 31-Aug-2020 15:02:21 B:/wc2/test/file2.txt
Info: Test - status of locked files

Info: PYSVN CMD status --verbose b:\wc1
               2      2 barry          B:\wc1
               2      2 barry          B:\wc1\test
     K         3      3 barry          B:\wc1\test\file1.txt
               3      3 barry          B:\wc1\test\file2.txt
Info: Test - list of unlocked files

Info: PYSVN CMD list --verbose --fetch-locks --recursive b:\wc1
      4 barry           - 31-Aug-2020 15:02:21 B:/wc1
      4 barry           - 31-Aug-2020 15:02:21 B:/wc1/test
      4 barry          35 31-Aug-2020 15:02:21 B:/wc1/test/file1.txt
      4 barry          35 31-Aug-2020 15:02:21 B:/wc1/test/file2.txt
Info: Test - update with stolen lock

Info: PYSVN CMD update b:\wc1\test
U B:/wc1
U B:/wc1/test
U B:/wc1/test/file1.txt
U B:/wc1/test/file2.txt
update_started B:/wc1/test
Updated to revision 4
Info: Test - status of locked files

Info: PYSVN CMD status --verbose b:\wc1
               2      2 barry          B:\wc1
               4      4 barry          B:\wc1\test
               4      4 barry          B:\wc1\test\file1.txt
               4      4 barry          B:\wc1\test\file2.txt
Info: Test - info2 of URL

Info: PYSVN CMD info2 --revision HEAD file:///b:/repos/trunk/test/file1.txt

Path: file1.txt
Url: file:///B:/repos/trunk/test/file1.txt
Revision: 4
Repository root_URL: file:///B:/repos
Repository UUID: d52a8600-1afa-5548-868b-b308103e8346
Last changed author: barry
Last Changed Date: 31-Aug-2020 15:02:21
Last changed revision: 4
Node kind: file
Info: Test - list of locked files

Info: PYSVN CMD list --verbose --fetch-locks --recursive b:\wc1
      4 barry           - 31-Aug-2020 15:02:21 B:/wc1
      4 barry           - 31-Aug-2020 15:02:21 B:/wc1/test
      4 barry          35 31-Aug-2020 15:02:21 B:/wc1/test/file1.txt
      4 barry          35 31-Aug-2020 15:02:21 B:/wc1/test/file2.txt
